Android 1.5
type: Ontology
version info: $Id: UML2ToPackageAPIOntology.atl 8082 2010-03-18 21:11:00Z dwagelaa $
imports: platform.owl
imports: java.owl
imports: j2se-5 0.owl#
imports: isa.owl
comment: Generated by [UML2ToSimplifiedPackageAPIOntology.atl 8080 2010-03-18 10:46:40Z dwagelaa], [UML2ToPackageAPIOntology.atl 8082 2010-03-18 21:11:00Z dwagelaa], [UML2ToAPIOntology.atl 8086 2010-03-19 09:49:17Z dwagelaa], and [UML2Comparison.atl 8326 2010-11-11 13:32:14Z dwagelaa]
comment: Dennis Wagelaar <dennis.wagelaar@vub.ac.be>
comment: © 2010, Vrije Universiteit Brussel. All rights reserved.

Android1 5API
type: Class
subclass of: AndroidAPI
subclass of: AndroidAppAPI
subclass of: AndroidViewAPI
subclass of: AndroidViewInputmethodAPI
subclass of: AndroidViewAnimationAPI
subclass of: AndroidContentAPI
subclass of: AndroidContentResAPI
subclass of: AndroidContentPmAPI
subclass of: AndroidOsAPI
subclass of: AndroidGraphicsAPI
subclass of: AndroidGraphicsDrawableAPI
subclass of: AndroidGraphicsDrawableShapesAPI
subclass of: AndroidNetAPI
subclass of: AndroidNetHttpAPI
subclass of: AndroidNetWifiAPI
subclass of: AndroidDatabaseAPI
subclass of: AndroidDatabaseSqliteAPI
subclass of: AndroidUtilAPI
subclass of: AndroidWidgetAPI
subclass of: AndroidAppwidgetAPI
subclass of: AndroidHardwareAPI
subclass of: AndroidInputmethodserviceAPI
subclass of: AndroidLocationAPI
subclass of: AndroidMediaAPI
subclass of: AndroidOpenglAPI
subclass of: AndroidPreferenceAPI
subclass of: AndroidProviderAPI
subclass of: AndroidWebkitAPI
subclass of: AndroidSaxAPI
subclass of: AndroidSpeechAPI
subclass of: AndroidTelephonyAPI
subclass of: AndroidTelephonyGsmAPI
subclass of: AndroidTextAPI
subclass of: AndroidTextFormatAPI
subclass of: AndroidTextMethodAPI
subclass of: AndroidTextStyleAPI
subclass of: AndroidTextUtilAPI
subclass of: AndroidTestAPI
subclass of: AndroidTestMockAPI
subclass of: AndroidTestSuitebuilderAPI
subclass of: AndroidTestSuitebuilderAnnotationAPI
subclass of: JavaLangAPI
subclass of: JavaLangAnnotationAPI
subclass of: JavaLangReflectAPI
subclass of: JavaLangRefAPI
subclass of: JavaUtilAPI
subclass of: JavaUtilConcurrentAPI
subclass of: JavaUtilConcurrentAtomicAPI
subclass of: JavaUtilConcurrentLocksAPI
subclass of: JavaUtilRegexAPI
subclass of: JavaUtilJarAPI
subclass of: JavaUtilZipAPI
subclass of: JavaUtilLoggingAPI
subclass of: JavaUtilPrefsAPI
subclass of: JavaIoAPI
subclass of: JavaNioAPI
subclass of: JavaNioChannelsAPI
subclass of: JavaNioChannelsSpiAPI
subclass of: JavaNioCharsetAPI
subclass of: JavaNioCharsetSpiAPI
subclass of: JavaNetAPI
subclass of: JavaSecurityAPI
subclass of: JavaSecurityCertAPI
subclass of: JavaSecuritySpecAPI
subclass of: JavaSecurityAclAPI
subclass of: JavaSecurityInterfacesAPI
subclass of: JavaTextAPI
subclass of: JavaAwtFontAPI
subclass of: JavaBeansAPI
subclass of: JavaMathAPI
subclass of: JavaSqlAPI
subclass of: OrgXmlpullV1API
subclass of: OrgXmlpullV1Sax2API
subclass of: OrgXmlSaxAPI
subclass of: OrgXmlSaxHelpersAPI
subclass of: OrgXmlSaxExtAPI
subclass of: OrgW3cDomAPI
subclass of: OrgApacheCommonsLoggingAPI
subclass of: OrgApacheHttpAPI

Android1 5ClassLibrary
type: Class
subclass of: AndroidClassLibrary
subclass of: AndroidAppClassLibrary
subclass of: AndroidViewClassLibrary
subclass of: AndroidViewInputmethodClassLibrary
subclass of: AndroidViewAnimationClassLibrary
subclass of: AndroidContentClassLibrary
subclass of: AndroidContentResClassLibrary
subclass of: AndroidContentPmClassLibrary
subclass of: AndroidOsClassLibrary
subclass of: AndroidGraphicsClassLibrary
subclass of: AndroidGraphicsDrawableClassLibrary
subclass of: AndroidGraphicsDrawableShapesClassLibrary
subclass of: AndroidNetClassLibrary
subclass of: AndroidNetHttpClassLibrary
subclass of: AndroidNetWifiClassLibrary
subclass of: AndroidDatabaseClassLibrary
subclass of: AndroidDatabaseSqliteClassLibrary
subclass of: AndroidUtilClassLibrary
subclass of: AndroidWidgetClassLibrary
subclass of: AndroidAppwidgetClassLibrary
subclass of: AndroidHardwareClassLibrary
subclass of: AndroidInputmethodserviceClassLibrary
subclass of: AndroidLocationClassLibrary
subclass of: AndroidMediaClassLibrary
subclass of: AndroidOpenglClassLibrary
subclass of: AndroidPreferenceClassLibrary
subclass of: AndroidProviderClassLibrary
subclass of: AndroidWebkitClassLibrary
subclass of: AndroidSaxClassLibrary
subclass of: AndroidSpeechClassLibrary
subclass of: AndroidTelephonyClassLibrary
subclass of: AndroidTelephonyGsmClassLibrary
subclass of: AndroidTextClassLibrary
subclass of: AndroidTextFormatClassLibrary
subclass of: AndroidTextMethodClassLibrary
subclass of: AndroidTextStyleClassLibrary
subclass of: AndroidTextUtilClassLibrary
subclass of: AndroidTestClassLibrary
subclass of: AndroidTestMockClassLibrary
subclass of: AndroidTestSuitebuilderClassLibrary
subclass of: AndroidTestSuitebuilderAnnotationClassLibrary
subclass of: JavaLangClassLibrary
subclass of: JavaLangAnnotationClassLibrary
subclass of: JavaLangReflectClassLibrary
subclass of: JavaLangRefClassLibrary
subclass of: JavaUtilClassLibrary
subclass of: JavaUtilConcurrentClassLibrary
subclass of: JavaUtilConcurrentAtomicClassLibrary
subclass of: JavaUtilConcurrentLocksClassLibrary
subclass of: JavaUtilRegexClassLibrary
subclass of: JavaUtilJarClassLibrary
subclass of: JavaUtilZipClassLibrary
subclass of: JavaUtilLoggingClassLibrary
subclass of: JavaUtilPrefsClassLibrary
subclass of: JavaIoClassLibrary
subclass of: JavaNioClassLibrary
subclass of: JavaNioChannelsClassLibrary
subclass of: JavaNioChannelsSpiClassLibrary
subclass of: JavaNioCharsetClassLibrary
subclass of: JavaNioCharsetSpiClassLibrary
subclass of: JavaNetClassLibrary
subclass of: JavaSecurityClassLibrary
subclass of: JavaSecurityCertClassLibrary
subclass of: JavaSecuritySpecClassLibrary
subclass of: JavaSecurityAclClassLibrary
subclass of: JavaSecurityInterfacesClassLibrary
subclass of: JavaTextClassLibrary
subclass of: JavaAwtFontClassLibrary
subclass of: JavaBeansClassLibrary
subclass of: JavaMathClassLibrary
subclass of: JavaSqlClassLibrary
subclass of: OrgXmlpullV1ClassLibrary
subclass of: OrgXmlpullV1Sax2ClassLibrary
subclass of: OrgXmlSaxClassLibrary
subclass of: OrgXmlSaxHelpersClassLibrary
subclass of: OrgXmlSaxExtClassLibrary
subclass of: OrgW3cDomClassLibrary
subclass of: OrgApacheCommonsLoggingClassLibrary
subclass of: OrgApacheHttpClassLibrary

Android1 5BytecodeFormat
type: Class
equivalent class: J2SE5 0BytecodeFormat
subclass of: JavaBytecode
comment: Android 1.5 bytecode format
comment: java:majorVersionNumber some xsd:integer[>="49"^^xsd:integer] and java:preverified value false

theAndroid1 5BytecodeFormat
type: Android1 5BytecodeFormat
preverified: false
minor version number: 0
major version number: 49

Android1 5VM
type: Class
equivalent class: Restriction
  on property: implementsInterface
  some values from: Android1 5BytecodeFormat
subclass of: JavaVM
comment: Android 1.5 virtual machine

Android1 5JRE
type: Class
equivalent class: Class
  intersection of: Restriction
    on property: providesFeature
    some values from: Android1 5ClassLibrary
  intersection of: Restriction
    on property: providesFeature
    some values from: Android1 5VM
subclass of: JRE
comment: Android 1.5 Java Runtime Environment

Android
type: Class
subclass of: JavaAPIPart
comment: Java API part implementing the android package for Android 1.5

AndroidApp
type: Class
subclass of: JavaAPIPart
comment: Java API part implementing the android.app package for Android 1.5

AndroidView
type: Class
subclass of: JavaAPIPart
comment: Java API part implementing the android.view package for Android 1.5

AndroidViewInputmethod
type: Class
subclass of: JavaAPIPart
comment: Java API part implementing the android.view.inputmethod package for Android 1.5

AndroidViewAnimation
type: Class
subclass of: JavaAPIPart
comment: Java API part implementing the android.view.animation package for Android 1.5

AndroidContent
type: Class
subclass of: JavaAPIPart
comment: Java API part implementing the android.content package for Android 1.5

AndroidContentRes
type: Class
subclass of: JavaAPIPart
comment: Java API part implementing the android.content.res package for Android 1.5

AndroidContentPm
type: Class
subclass of: JavaAPIPart
comment: Java API part implementing the android.content.pm package for Android 1.5

AndroidOs
type: Class
subclass of: JavaAPIPart
comment: Java API part implementing the android.os package for Android 1.5

AndroidGraphics
type: Class
subclass of: JavaAPIPart
comment: Java API part implementing the android.graphics package for Android 1.5

AndroidGraphicsDrawable
type: Class
subclass of: JavaAPIPart
comment: Java API part implementing the android.graphics.drawable package for Android 1.5

AndroidGraphicsDrawableShapes
type: Class
subclass of: JavaAPIPart
comment: Java API part implementing the android.graphics.drawable.shapes package for Android 1.5

AndroidNet
type: Class
subclass of: JavaAPIPart
comment: Java API part implementing the android.net package for Android 1.5

AndroidNetHttp
type: Class
subclass of: JavaAPIPart
comment: Java API part implementing the android.net.http package for Android 1.5

AndroidNetWifi
type: Class
subclass of: JavaAPIPart
comment: Java API part implementing the android.net.wifi package for Android 1.5

AndroidDatabase
type: Class
subclass of: JavaAPIPart
comment: Java API part implementing the android.database package for Android 1.5

AndroidDatabaseSqlite
type: Class
subclass of: JavaAPIPart
comment: Java API part implementing the android.database.sqlite package for Android 1.5

AndroidUtil
type: Class
subclass of: JavaAPIPart
comment: Java API part implementing the android.util package for Android 1.5

AndroidWidget
type: Class
subclass of: JavaAPIPart
comment: Java API part implementing the android.widget package for Android 1.5

AndroidAppwidget
type: Class
subclass of: JavaAPIPart
comment: Java API part implementing the android.appwidget package for Android 1.5

AndroidHardware
type: Class
subclass of: JavaAPIPart
comment: Java API part implementing the android.hardware package for Android 1.5

AndroidInputmethodservice
type: Class
subclass of: JavaAPIPart
comment: Java API part implementing the android.inputmethodservice package for Android 1.5

AndroidLocation
type: Class
subclass of: JavaAPIPart
comment: Java API part implementing the android.location package for Android 1.5

AndroidMedia
type: Class
subclass of: JavaAPIPart
comment: Java API part implementing the android.media package for Android 1.5

AndroidOpengl
type: Class
subclass of: JavaAPIPart
comment: Java API part implementing the android.opengl package for Android 1.5

AndroidPreference
type: Class
subclass of: JavaAPIPart
comment: Java API part implementing the android.preference package for Android 1.5

AndroidProvider
type: Class
subclass of: JavaAPIPart
comment: Java API part implementing the android.provider package for Android 1.5

AndroidWebkit
type: Class
subclass of: JavaAPIPart
comment: Java API part implementing the android.webkit package for Android 1.5

AndroidSax
type: Class
subclass of: JavaAPIPart
comment: Java API part implementing the android.sax package for Android 1.5

AndroidSpeech
type: Class
subclass of: JavaAPIPart
comment: Java API part implementing the android.speech package for Android 1.5

AndroidTelephony
type: Class
subclass of: JavaAPIPart
comment: Java API part implementing the android.telephony package for Android 1.5

AndroidTelephonyGsm
type: Class
subclass of: JavaAPIPart
comment: Java API part implementing the android.telephony.gsm package for Android 1.5

AndroidText
type: Class
subclass of: JavaAPIPart
comment: Java API part implementing the android.text package for Android 1.5

AndroidTextFormat
type: Class
subclass of: JavaAPIPart
comment: Java API part implementing the android.text.format package for Android 1.5

AndroidTextMethod
type: Class
subclass of: JavaAPIPart
comment: Java API part implementing the android.text.method package for Android 1.5

AndroidTextStyle
type: Class
subclass of: JavaAPIPart
comment: Java API part implementing the android.text.style package for Android 1.5

AndroidTextUtil
type: Class
subclass of: JavaAPIPart
comment: Java API part implementing the android.text.util package for Android 1.5

AndroidTest
type: Class
subclass of: JavaAPIPart
comment: Java API part implementing the android.test package for Android 1.5

AndroidTestMock
type: Class
subclass of: JavaAPIPart
comment: Java API part implementing the android.test.mock package for Android 1.5

AndroidTestSuitebuilder
type: Class
subclass of: JavaAPIPart
comment: Java API part implementing the android.test.suitebuilder package for Android 1.5

AndroidTestSuitebuilderAnnotation
type: Class
subclass of: JavaAPIPart
comment: Java API part implementing the android.test.suitebuilder.annotation package for Android 1.5

JavaLang
type: Class
subclass of: JavaLang
comment: Java API part implementing the java.lang package for Android 1.5

JavaLangAnnotation
type: Class
equivalent class: JavaLangAnnotation
subclass of: JavaAPIPart
comment: Java API part implementing the java.lang.annotation package for Android 1.5

JavaLangReflect
type: Class
equivalent class: JavaLangReflect
subclass of: JavaAPIPart
comment: Java API part implementing the java.lang.reflect package for Android 1.5

JavaLangRef
type: Class
equivalent class: JavaLangRef
subclass of: JavaAPIPart
comment: Java API part implementing the java.lang.ref package for Android 1.5

JavaUtil
type: Class
equivalent class: JavaUtil
subclass of: JavaAPIPart
comment: Java API part implementing the java.util package for Android 1.5

JavaUtilConcurrent
type: Class
equivalent class: JavaUtilConcurrent
subclass of: JavaAPIPart
comment: Java API part implementing the java.util.concurrent package for Android 1.5

JavaUtilConcurrentAtomic
type: Class
equivalent class: JavaUtilConcurrentAtomic
subclass of: JavaAPIPart
comment: Java API part implementing the java.util.concurrent.atomic package for Android 1.5

JavaUtilConcurrentLocks
type: Class
equivalent class: JavaUtilConcurrentLocks
subclass of: JavaAPIPart
comment: Java API part implementing the java.util.concurrent.locks package for Android 1.5

JavaUtilRegex
type: Class
equivalent class: JavaUtilRegex
subclass of: JavaAPIPart
comment: Java API part implementing the java.util.regex package for Android 1.5

JavaUtilJar
type: Class
equivalent class: JavaUtilJar
subclass of: JavaAPIPart
comment: Java API part implementing the java.util.jar package for Android 1.5

JavaUtilZip
type: Class
equivalent class: JavaUtilZip
subclass of: JavaAPIPart
comment: Java API part implementing the java.util.zip package for Android 1.5

JavaUtilLogging
type: Class
equivalent class: JavaUtilLogging
subclass of: JavaAPIPart
comment: Java API part implementing the java.util.logging package for Android 1.5

JavaUtilPrefs
type: Class
equivalent class: JavaUtilPrefs
subclass of: JavaAPIPart
comment: Java API part implementing the java.util.prefs package for Android 1.5

JavaIo
type: Class
equivalent class: JavaIo
subclass of: JavaAPIPart
comment: Java API part implementing the java.io package for Android 1.5

JavaNio
type: Class
equivalent class: JavaNio
subclass of: JavaAPIPart
comment: Java API part implementing the java.nio package for Android 1.5

JavaNioChannels
type: Class
equivalent class: JavaNioChannels
subclass of: JavaAPIPart
comment: Java API part implementing the java.nio.channels package for Android 1.5

JavaNioChannelsSpi
type: Class
equivalent class: JavaNioChannelsSpi
subclass of: JavaAPIPart
comment: Java API part implementing the java.nio.channels.spi package for Android 1.5

JavaNioCharset
type: Class
equivalent class: JavaNioCharset
subclass of: JavaAPIPart
comment: Java API part implementing the java.nio.charset package for Android 1.5

JavaNioCharsetSpi
type: Class
equivalent class: JavaNioCharsetSpi
subclass of: JavaAPIPart
comment: Java API part implementing the java.nio.charset.spi package for Android 1.5

JavaNet
type: Class
equivalent class: JavaNet
subclass of: JavaAPIPart
comment: Java API part implementing the java.net package for Android 1.5

JavaSecurity
type: Class
equivalent class: JavaSecurity
subclass of: JavaAPIPart
comment: Java API part implementing the java.security package for Android 1.5

JavaSecurityCert
type: Class
equivalent class: JavaSecurityCert
subclass of: JavaAPIPart
comment: Java API part implementing the java.security.cert package for Android 1.5

JavaSecuritySpec
type: Class
equivalent class: JavaSecuritySpec
subclass of: JavaAPIPart
comment: Java API part implementing the java.security.spec package for Android 1.5

JavaSecurityAcl
type: Class
equivalent class: JavaSecurityAcl
subclass of: JavaAPIPart
comment: Java API part implementing the java.security.acl package for Android 1.5

JavaSecurityInterfaces
type: Class
equivalent class: JavaSecurityInterfaces
subclass of: JavaAPIPart
comment: Java API part implementing the java.security.interfaces package for Android 1.5

JavaText
type: Class
equivalent class: JavaText
subclass of: JavaAPIPart
comment: Java API part implementing the java.text package for Android 1.5

JavaAwtFont
type: Class
subclass of: JavaAPIPart
comment: Java API part implementing the java.awt.font package for Android 1.5

JavaBeans
type: Class
subclass of: JavaAPIPart
comment: Java API part implementing the java.beans package for Android 1.5

JavaMath
type: Class
equivalent class: JavaMath
subclass of: JavaAPIPart
comment: Java API part implementing the java.math package for Android 1.5

JavaSql
type: Class
equivalent class: JavaSql
subclass of: JavaAPIPart
comment: Java API part implementing the java.sql package for Android 1.5

OrgXmlpullV1
type: Class
subclass of: JavaAPIPart
comment: Java API part implementing the org.xmlpull.v1 package for Android 1.5

OrgXmlpullV1Sax2
type: Class
subclass of: JavaAPIPart
comment: Java API part implementing the org.xmlpull.v1.sax2 package for Android 1.5

OrgXmlSax
type: Class
equivalent class: OrgXmlSax
subclass of: JavaAPIPart
comment: Java API part implementing the org.xml.sax package for Android 1.5

OrgXmlSaxHelpers
type: Class
equivalent class: OrgXmlSaxHelpers
subclass of: JavaAPIPart
comment: Java API part implementing the org.xml.sax.helpers package for Android 1.5

OrgXmlSaxExt
type: Class
equivalent class: OrgXmlSaxExt
subclass of: JavaAPIPart
comment: Java API part implementing the org.xml.sax.ext package for Android 1.5

OrgW3cDom
type: Class
subclass of: JavaAPIPart
comment: Java API part implementing the org.w3c.dom package for Android 1.5

OrgApacheCommonsLogging
type: Class
subclass of: JavaAPIPart
comment: Java API part implementing the org.apache.commons.logging package for Android 1.5

OrgApacheHttp
type: Class
subclass of: JavaAPIPart
comment: Java API part implementing the org.apache.http package for Android 1.5

OrgApacheHttpProtocol
type: Class
subclass of: JavaAPIPart
comment: Java API part implementing the org.apache.http.protocol package for Android 1.5

OrgApacheHttpUtil
type: Class
subclass of: JavaAPIPart
comment: Java API part implementing the org.apache.http.util package for Android 1.5

OrgApacheHttpParams
type: Class
subclass of: JavaAPIPart
comment: Java API part implementing the org.apache.http.params package for Android 1.5

OrgApacheHttpAuth
type: Class
subclass of: JavaAPIPart
comment: Java API part implementing the org.apache.http.auth package for Android 1.5

OrgApacheHttpAuthParams
type: Class
subclass of: JavaAPIPart
comment: Java API part implementing the org.apache.http.auth.params package for Android 1.5

OrgApacheHttpClient
type: Class
subclass of: JavaAPIPart
comment: Java API part implementing the org.apache.http.client package for Android 1.5

OrgApacheHttpClientMethods
type: Class
subclass of: JavaAPIPart
comment: Java API part implementing the org.apache.http.client.methods package for Android 1.5

OrgApacheHttpClientEntity
type: Class
subclass of: JavaAPIPart
comment: Java API part implementing the org.apache.http.client.entity package for Android 1.5

OrgApacheHttpClientParams
type: Class
subclass of: JavaAPIPart
comment: Java API part implementing the org.apache.http.client.params package for Android 1.5

OrgApacheHttpClientProtocol
type: Class
subclass of: JavaAPIPart
comment: Java API part implementing the org.apache.http.client.protocol package for Android 1.5

OrgApacheHttpClientUtils
type: Class
subclass of: JavaAPIPart
comment: Java API part implementing the org.apache.http.client.utils package for Android 1.5

OrgApacheHttpCookie
type: Class
subclass of: JavaAPIPart
comment: Java API part implementing the org.apache.http.cookie package for Android 1.5

OrgApacheHttpCookieParams
type: Class
subclass of: JavaAPIPart
comment: Java API part implementing the org.apache.http.cookie.params package for Android 1.5

OrgApacheHttpConn
type: Class
subclass of: JavaAPIPart
comment: Java API part implementing the org.apache.http.conn package for Android 1.5

OrgApacheHttpConnParams
type: Class
subclass of: JavaAPIPart
comment: Java API part implementing the org.apache.http.conn.params package for Android 1.5

OrgApacheHttpConnScheme
type: Class
subclass of: JavaAPIPart
comment: Java API part implementing the org.apache.http.conn.scheme package for Android 1.5

OrgApacheHttpConnRouting
type: Class
subclass of: JavaAPIPart
comment: Java API part implementing the org.apache.http.conn.routing package for Android 1.5

OrgApacheHttpConnSsl
type: Class
subclass of: JavaAPIPart
comment: Java API part implementing the org.apache.http.conn.ssl package for Android 1.5

OrgApacheHttpConnUtil
type: Class
subclass of: JavaAPIPart
comment: Java API part implementing the org.apache.http.conn.util package for Android 1.5

OrgApacheHttpEntity
type: Class
subclass of: JavaAPIPart
comment: Java API part implementing the org.apache.http.entity package for Android 1.5

OrgApacheHttpMessage
type: Class
subclass of: JavaAPIPart
comment: Java API part implementing the org.apache.http.message package for Android 1.5

OrgApacheHttpImpl
type: Class
subclass of: JavaAPIPart
comment: Java API part implementing the org.apache.http.impl package for Android 1.5

OrgApacheHttpImplEntity
type: Class
subclass of: JavaAPIPart
comment: Java API part implementing the org.apache.http.impl.entity package for Android 1.5

OrgApacheHttpImplAuth
type: Class
subclass of: JavaAPIPart
comment: Java API part implementing the org.apache.http.impl.auth package for Android 1.5

OrgApacheHttpImplClient
type: Class
subclass of: JavaAPIPart
comment: Java API part implementing the org.apache.http.impl.client package for Android 1.5

OrgApacheHttpImplConn
type: Class
subclass of: JavaAPIPart
comment: Java API part implementing the org.apache.http.impl.conn package for Android 1.5

OrgApacheHttpImplConnTsccm
type: Class
subclass of: JavaAPIPart
comment: Java API part implementing the org.apache.http.impl.conn.tsccm package for Android 1.5

OrgApacheHttpImplIo
type: Class
subclass of: JavaAPIPart
comment: Java API part implementing the org.apache.http.impl.io package for Android 1.5

OrgApacheHttpImplCookie
type: Class
subclass of: JavaAPIPart
comment: Java API part implementing the org.apache.http.impl.cookie package for Android 1.5

OrgApacheHttpIo
type: Class
subclass of: JavaAPIPart
comment: Java API part implementing the org.apache.http.io package for Android 1.5

OrgJson
type: Class
subclass of: JavaAPIPart
comment: Java API part implementing the org.json package for Android 1.5

JavaxMicroeditionKhronosOpengles
type: Class
subclass of: JavaAPIPart
comment: Java API part implementing the javax.microedition.khronos.opengles package for Android 1.5

JavaxMicroeditionKhronosEgl
type: Class
subclass of: JavaAPIPart
comment: Java API part implementing the javax.microedition.khronos.egl package for Android 1.5

JavaxNet
type: Class
equivalent class: JavaxNet
subclass of: JavaAPIPart
comment: Java API part implementing the javax.net package for Android 1.5

JavaxNetSsl
type: Class
equivalent class: JavaxNetSsl
subclass of: JavaAPIPart
comment: Java API part implementing the javax.net.ssl package for Android 1.5

JavaxSecurityAuth
type: Class
subclass of: JavaAPIPart
comment: Java API part implementing the javax.security.auth package for Android 1.5

JavaxSecurityAuthCallback
type: Class
subclass of: JavaAPIPart
comment: Java API part implementing the javax.security.auth.callback package for Android 1.5

JavaxSecurityAuthX500
type: Class
subclass of: JavaAPIPart
comment: Java API part implementing the javax.security.auth.x500 package for Android 1.5

JavaxSecurityAuthLogin
type: Class
subclass of: JavaAPIPart
comment: Java API part implementing the javax.security.auth.login package for Android 1.5

JavaxSecurityCert
type: Class
equivalent class: JavaxSecurityCert
subclass of: JavaAPIPart
comment: Java API part implementing the javax.security.cert package for Android 1.5

JavaxCrypto
type: Class
equivalent class: JavaxCrypto
subclass of: JavaAPIPart
comment: Java API part implementing the javax.crypto package for Android 1.5

JavaxCryptoInterfaces
type: Class
equivalent class: JavaxCryptoInterfaces
subclass of: JavaAPIPart
comment: Java API part implementing the javax.crypto.interfaces package for Android 1.5

JavaxCryptoSpec
type: Class
equivalent class: JavaxCryptoSpec
subclass of: JavaAPIPart
comment: Java API part implementing the javax.crypto.spec package for Android 1.5

JavaxSql
type: Class
subclass of: JavaAPIPart
comment: Java API part implementing the javax.sql package for Android 1.5

JavaxXml
type: Class
subclass of: JavaxXml
comment: Java API part implementing the javax.xml package for Android 1.5

JavaxXmlParsers
type: Class
subclass of: JavaAPIPart
comment: Java API part implementing the javax.xml.parsers package for Android 1.5

JunitFramework
type: Class
subclass of: JavaAPIPart
comment: Java API part implementing the junit.framework package for Android 1.5

JunitRunner
type: Class
subclass of: JavaAPIPart
comment: Java API part implementing the junit.runner package for Android 1.5

DalvikAnnotation
type: Class
subclass of: JavaAPIPart
comment: Java API part implementing the dalvik.annotation package for Android 1.5

DalvikBytecode
type: Class
subclass of: JavaAPIPart
comment: Java API part implementing the dalvik.bytecode package for Android 1.5

DalvikSystem
type: Class
subclass of: JavaAPIPart
comment: Java API part implementing the dalvik.system package for Android 1.5

AndroidAPI
type: Class
subclass of: JavaAPI
comment: JavaLibrary implementing the android package for Android 1.5
comment: platform:comprisesInterfacePart some Android

AndroidAppAPI
type: Class
subclass of: JavaAPI
comment: JavaLibrary implementing the android.app package for Android 1.5
comment: platform:comprisesInterfacePart some AndroidApp

AndroidViewAPI
type: Class
subclass of: JavaAPI
comment: JavaLibrary implementing the android.view package for Android 1.5
comment: platform:comprisesInterfacePart some AndroidView

AndroidViewInputmethodAPI
type: Class
subclass of: JavaAPI
comment: JavaLibrary implementing the android.view.inputmethod package for Android 1.5
comment: platform:comprisesInterfacePart some AndroidViewInputmethod

AndroidViewAnimationAPI
type: Class
subclass of: JavaAPI
comment: JavaLibrary implementing the android.view.animation package for Android 1.5
comment: platform:comprisesInterfacePart some AndroidViewAnimation

AndroidContentAPI
type: Class
subclass of: JavaAPI
comment: JavaLibrary implementing the android.content package for Android 1.5
comment: platform:comprisesInterfacePart some AndroidContent

AndroidContentResAPI
type: Class
subclass of: JavaAPI
comment: JavaLibrary implementing the android.content.res package for Android 1.5
comment: platform:comprisesInterfacePart some AndroidContentRes

AndroidContentPmAPI
type: Class
subclass of: JavaAPI
comment: JavaLibrary implementing the android.content.pm package for Android 1.5
comment: platform:comprisesInterfacePart some AndroidContentPm

AndroidOsAPI
type: Class
subclass of: JavaAPI
comment: JavaLibrary implementing the android.os package for Android 1.5
comment: platform:comprisesInterfacePart some AndroidOs

AndroidGraphicsAPI
type: Class
subclass of: JavaAPI
comment: JavaLibrary implementing the android.graphics package for Android 1.5
comment: platform:comprisesInterfacePart some AndroidGraphics

AndroidGraphicsDrawableAPI
type: Class
subclass of: JavaAPI
comment: JavaLibrary implementing the android.graphics.drawable package for Android 1.5
comment: platform:comprisesInterfacePart some AndroidGraphicsDrawable

AndroidGraphicsDrawableShapesAPI
type: Class
subclass of: JavaAPI
comment: JavaLibrary implementing the android.graphics.drawable.shapes package for Android 1.5
comment: platform:comprisesInterfacePart some AndroidGraphicsDrawableShapes

AndroidNetAPI
type: Class
subclass of: JavaAPI
comment: JavaLibrary implementing the android.net package for Android 1.5
comment: platform:comprisesInterfacePart some AndroidNet

AndroidNetHttpAPI
type: Class
subclass of: JavaAPI
comment: JavaLibrary implementing the android.net.http package for Android 1.5
comment: platform:comprisesInterfacePart some AndroidNetHttp

AndroidNetWifiAPI
type: Class
subclass of: JavaAPI
comment: JavaLibrary implementing the android.net.wifi package for Android 1.5
comment: platform:comprisesInterfacePart some AndroidNetWifi

AndroidDatabaseAPI
type: Class
subclass of: JavaAPI
comment: JavaLibrary implementing the android.database package for Android 1.5
comment: platform:comprisesInterfacePart some AndroidDatabase

AndroidDatabaseSqliteAPI
type: Class
subclass of: JavaAPI
comment: JavaLibrary implementing the android.database.sqlite package for Android 1.5
comment: platform:comprisesInterfacePart some AndroidDatabaseSqlite

AndroidUtilAPI
type: Class
subclass of: JavaAPI
comment: JavaLibrary implementing the android.util package for Android 1.5
comment: platform:comprisesInterfacePart some AndroidUtil

AndroidWidgetAPI
type: Class
subclass of: JavaAPI
comment: JavaLibrary implementing the android.widget package for Android 1.5
comment: platform:comprisesInterfacePart some AndroidWidget

AndroidAppwidgetAPI
type: Class
subclass of: JavaAPI
comment: JavaLibrary implementing the android.appwidget package for Android 1.5
comment: platform:comprisesInterfacePart some AndroidAppwidget

AndroidHardwareAPI
type: Class
subclass of: JavaAPI
comment: JavaLibrary implementing the android.hardware package for Android 1.5
comment: platform:comprisesInterfacePart some AndroidHardware

AndroidInputmethodserviceAPI
type: Class
subclass of: JavaAPI
comment: JavaLibrary implementing the android.inputmethodservice package for Android 1.5
comment: platform:comprisesInterfacePart some AndroidInputmethodservice

AndroidLocationAPI
type: Class
subclass of: JavaAPI
comment: JavaLibrary implementing the android.location package for Android 1.5
comment: platform:comprisesInterfacePart some AndroidLocation

AndroidMediaAPI
type: Class
subclass of: JavaAPI
comment: JavaLibrary implementing the android.media package for Android 1.5
comment: platform:comprisesInterfacePart some AndroidMedia

AndroidOpenglAPI
type: Class
subclass of: JavaAPI
comment: JavaLibrary implementing the android.opengl package for Android 1.5
comment: platform:comprisesInterfacePart some AndroidOpengl

AndroidPreferenceAPI
type: Class
subclass of: JavaAPI
comment: JavaLibrary implementing the android.preference package for Android 1.5
comment: platform:comprisesInterfacePart some AndroidPreference

AndroidProviderAPI
type: Class
subclass of: JavaAPI
comment: JavaLibrary implementing the android.provider package for Android 1.5
comment: platform:comprisesInterfacePart some AndroidProvider

AndroidWebkitAPI
type: Class
subclass of: JavaAPI
comment: JavaLibrary implementing the android.webkit package for Android 1.5
comment: platform:comprisesInterfacePart some AndroidWebkit

AndroidSaxAPI
type: Class
subclass of: JavaAPI
comment: JavaLibrary implementing the android.sax package for Android 1.5
comment: platform:comprisesInterfacePart some AndroidSax

AndroidSpeechAPI
type: Class
subclass of: JavaAPI
comment: JavaLibrary implementing the android.speech package for Android 1.5
comment: platform:comprisesInterfacePart some AndroidSpeech

AndroidTelephonyAPI
type: Class
subclass of: JavaAPI
comment: JavaLibrary implementing the android.telephony package for Android 1.5
comment: platform:comprisesInterfacePart some AndroidTelephony

AndroidTelephonyGsmAPI
type: Class
subclass of: JavaAPI
comment: JavaLibrary implementing the android.telephony.gsm package for Android 1.5
comment: platform:comprisesInterfacePart some AndroidTelephonyGsm

AndroidTextAPI
type: Class
subclass of: JavaAPI
comment: JavaLibrary implementing the android.text package for Android 1.5
comment: platform:comprisesInterfacePart some AndroidText

AndroidTextFormatAPI
type: Class
subclass of: JavaAPI
comment: JavaLibrary implementing the android.text.format package for Android 1.5
comment: platform:comprisesInterfacePart some AndroidTextFormat

AndroidTextMethodAPI
type: Class
subclass of: JavaAPI
comment: JavaLibrary implementing the android.text.method package for Android 1.5
comment: platform:comprisesInterfacePart some AndroidTextMethod

AndroidTextStyleAPI
type: Class
subclass of: JavaAPI
comment: JavaLibrary implementing the android.text.style package for Android 1.5
comment: platform:comprisesInterfacePart some AndroidTextStyle

AndroidTextUtilAPI
type: Class
subclass of: JavaAPI
comment: JavaLibrary implementing the android.text.util package for Android 1.5
comment: platform:comprisesInterfacePart some AndroidTextUtil

AndroidTestAPI
type: Class
subclass of: JavaAPI
comment: JavaLibrary implementing the android.test package for Android 1.5
comment: platform:comprisesInterfacePart some AndroidTest

AndroidTestMockAPI
type: Class
subclass of: JavaAPI
comment: JavaLibrary implementing the android.test.mock package for Android 1.5
comment: platform:comprisesInterfacePart some AndroidTestMock

AndroidTestSuitebuilderAPI
type: Class
subclass of: JavaAPI
comment: JavaLibrary implementing the android.test.suitebuilder package for Android 1.5
comment: platform:comprisesInterfacePart some AndroidTestSuitebuilder

AndroidTestSuitebuilderAnnotationAPI
type: Class
subclass of: JavaAPI
comment: JavaLibrary implementing the android.test.suitebuilder.annotation package for Android 1.5
comment: platform:comprisesInterfacePart some AndroidTestSuitebuilderAnnotation

JavaLangAPI
type: Class
subclass of: JavaLangAPI
comment: JavaLibrary implementing the java.lang package for Android 1.5
comment: platform:comprisesInterfacePart some JavaLang

JavaLangAnnotationAPI
type: Class
equivalent class: JavaLangAnnotationAPI
subclass of: JavaAPI
comment: JavaLibrary implementing the java.lang.annotation package for Android 1.5
comment: platform:comprisesInterfacePart some JavaLangAnnotation

JavaLangReflectAPI
type: Class
equivalent class: JavaLangReflectAPI
subclass of: JavaAPI
comment: JavaLibrary implementing the java.lang.reflect package for Android 1.5
comment: platform:comprisesInterfacePart some JavaLangReflect

JavaLangRefAPI
type: Class
equivalent class: JavaLangRefAPI
subclass of: JavaAPI
comment: JavaLibrary implementing the java.lang.ref package for Android 1.5
comment: platform:comprisesInterfacePart some JavaLangRef

JavaUtilAPI
type: Class
equivalent class: JavaUtilAPI
subclass of: JavaAPI
comment: JavaLibrary implementing the java.util package for Android 1.5
comment: platform:comprisesInterfacePart some JavaUtil

JavaUtilConcurrentAPI
type: Class
equivalent class: JavaUtilConcurrentAPI
subclass of: JavaAPI
comment: JavaLibrary implementing the java.util.concurrent package for Android 1.5
comment: platform:comprisesInterfacePart some JavaUtilConcurrent

JavaUtilConcurrentAtomicAPI
type: Class
equivalent class: JavaUtilConcurrentAtomicAPI
subclass of: JavaAPI
comment: JavaLibrary implementing the java.util.concurrent.atomic package for Android 1.5
comment: platform:comprisesInterfacePart some JavaUtilConcurrentAtomic

JavaUtilConcurrentLocksAPI
type: Class
equivalent class: JavaUtilConcurrentLocksAPI
subclass of: JavaAPI
comment: JavaLibrary implementing the java.util.concurrent.locks package for Android 1.5
comment: platform:comprisesInterfacePart some JavaUtilConcurrentLocks

JavaUtilRegexAPI
type: Class
equivalent class: JavaUtilRegexAPI
subclass of: JavaAPI
comment: JavaLibrary implementing the java.util.regex package for Android 1.5
comment: platform:comprisesInterfacePart some JavaUtilRegex

JavaUtilJarAPI
type: Class
equivalent class: JavaUtilJarAPI
subclass of: JavaAPI
comment: JavaLibrary implementing the java.util.jar package for Android 1.5
comment: platform:comprisesInterfacePart some JavaUtilJar

JavaUtilZipAPI
type: Class
equivalent class: JavaUtilZipAPI
subclass of: JavaAPI
comment: JavaLibrary implementing the java.util.zip package for Android 1.5
comment: platform:comprisesInterfacePart some JavaUtilZip

JavaUtilLoggingAPI
type: Class
equivalent class: JavaUtilLoggingAPI
subclass of: JavaAPI
comment: JavaLibrary implementing the java.util.logging package for Android 1.5
comment: platform:comprisesInterfacePart some JavaUtilLogging

JavaUtilPrefsAPI
type: Class
equivalent class: JavaUtilPrefsAPI
subclass of: JavaAPI
comment: JavaLibrary implementing the java.util.prefs package for Android 1.5
comment: platform:comprisesInterfacePart some JavaUtilPrefs

JavaIoAPI
type: Class
equivalent class: JavaIoAPI
subclass of: JavaAPI
comment: JavaLibrary implementing the java.io package for Android 1.5
comment: platform:comprisesInterfacePart some JavaIo

JavaNioAPI
type: Class
equivalent class: JavaNioAPI
subclass of: JavaAPI
comment: JavaLibrary implementing the java.nio package for Android 1.5
comment: platform:comprisesInterfacePart some JavaNio

JavaNioChannelsAPI
type: Class
equivalent class: JavaNioChannelsAPI
subclass of: JavaAPI
comment: JavaLibrary implementing the java.nio.channels package for Android 1.5
comment: platform:comprisesInterfacePart some JavaNioChannels

JavaNioChannelsSpiAPI
type: Class
equivalent class: JavaNioChannelsSpiAPI
subclass of: JavaAPI
comment: JavaLibrary implementing the java.nio.channels.spi package for Android 1.5
comment: platform:comprisesInterfacePart some JavaNioChannelsSpi

JavaNioCharsetAPI
type: Class
equivalent class: JavaNioCharsetAPI
subclass of: JavaAPI
comment: JavaLibrary implementing the java.nio.charset package for Android 1.5
comment: platform:comprisesInterfacePart some JavaNioCharset

JavaNioCharsetSpiAPI
type: Class
equivalent class: JavaNioCharsetSpiAPI
subclass of: JavaAPI
comment: JavaLibrary implementing the java.nio.charset.spi package for Android 1.5
comment: platform:comprisesInterfacePart some JavaNioCharsetSpi

JavaNetAPI
type: Class
equivalent class: JavaNetAPI
subclass of: JavaAPI
comment: JavaLibrary implementing the java.net package for Android 1.5
comment: platform:comprisesInterfacePart some JavaNet

JavaSecurityAPI
type: Class
equivalent class: JavaSecurityAPI
subclass of: JavaAPI
comment: JavaLibrary implementing the java.security package for Android 1.5
comment: platform:comprisesInterfacePart some JavaSecurity

JavaSecurityCertAPI
type: Class
equivalent class: JavaSecurityCertAPI
subclass of: JavaAPI
comment: JavaLibrary implementing the java.security.cert package for Android 1.5
comment: platform:comprisesInterfacePart some JavaSecurityCert

JavaSecuritySpecAPI
type: Class
equivalent class: JavaSecuritySpecAPI
subclass of: JavaAPI
comment: JavaLibrary implementing the java.security.spec package for Android 1.5
comment: platform:comprisesInterfacePart some JavaSecuritySpec

JavaSecurityAclAPI
type: Class
equivalent class: JavaSecurityAclAPI
subclass of: JavaAPI
comment: JavaLibrary implementing the java.security.acl package for Android 1.5
comment: platform:comprisesInterfacePart some JavaSecurityAcl

JavaSecurityInterfacesAPI
type: Class
equivalent class: JavaSecurityInterfacesAPI
subclass of: JavaAPI
comment: JavaLibrary implementing the java.security.interfaces package for Android 1.5
comment: platform:comprisesInterfacePart some JavaSecurityInterfaces

JavaTextAPI
type: Class
equivalent class: JavaTextAPI
subclass of: JavaAPI
comment: JavaLibrary implementing the java.text package for Android 1.5
comment: platform:comprisesInterfacePart some JavaText

JavaAwtFontAPI
type: Class
subclass of: JavaAPI
comment: JavaLibrary implementing the java.awt.font package for Android 1.5
comment: platform:comprisesInterfacePart some JavaAwtFont

JavaBeansAPI
type: Class
subclass of: JavaAPI
comment: JavaLibrary implementing the java.beans package for Android 1.5
comment: platform:comprisesInterfacePart some JavaBeans

JavaMathAPI
type: Class
equivalent class: JavaMathAPI
subclass of: JavaAPI
comment: JavaLibrary implementing the java.math package for Android 1.5
comment: platform:comprisesInterfacePart some JavaMath

JavaSqlAPI
type: Class
equivalent class: JavaSqlAPI
subclass of: JavaAPI
comment: JavaLibrary implementing the java.sql package for Android 1.5
comment: platform:comprisesInterfacePart some JavaSql

OrgXmlpullV1API
type: Class
subclass of: JavaAPI
comment: JavaLibrary implementing the org.xmlpull.v1 package for Android 1.5
comment: platform:comprisesInterfacePart some OrgXmlpullV1

OrgXmlpullV1Sax2API
type: Class
subclass of: JavaAPI
comment: JavaLibrary implementing the org.xmlpull.v1.sax2 package for Android 1.5
comment: platform:comprisesInterfacePart some OrgXmlpullV1Sax2

OrgXmlSaxAPI
type: Class
equivalent class: OrgXmlSaxAPI
subclass of: JavaAPI
comment: JavaLibrary implementing the org.xml.sax package for Android 1.5
comment: platform:comprisesInterfacePart some OrgXmlSax

OrgXmlSaxHelpersAPI
type: Class
equivalent class: OrgXmlSaxHelpersAPI
subclass of: JavaAPI
comment: JavaLibrary implementing the org.xml.sax.helpers package for Android 1.5
comment: platform:comprisesInterfacePart some OrgXmlSaxHelpers

OrgXmlSaxExtAPI
type: Class
equivalent class: OrgXmlSaxExtAPI
subclass of: JavaAPI
comment: JavaLibrary implementing the org.xml.sax.ext package for Android 1.5
comment: platform:comprisesInterfacePart some OrgXmlSaxExt

OrgW3cDomAPI
type: Class
subclass of: JavaAPI
comment: JavaLibrary implementing the org.w3c.dom package for Android 1.5
comment: platform:comprisesInterfacePart some OrgW3cDom

OrgApacheCommonsLoggingAPI
type: Class
subclass of: JavaAPI
comment: JavaLibrary implementing the org.apache.commons.logging package for Android 1.5
comment: platform:comprisesInterfacePart some OrgApacheCommonsLogging

OrgApacheHttpAPI
type: Class
subclass of: JavaAPI
comment: JavaLibrary implementing the org.apache.http package for Android 1.5
comment: platform:comprisesInterfacePart some OrgApacheHttp

OrgApacheHttpProtocolAPI
type: Class
subclass of: JavaAPI
comment: JavaLibrary implementing the org.apache.http.protocol package for Android 1.5
comment: platform:comprisesInterfacePart some OrgApacheHttpProtocol

OrgApacheHttpUtilAPI
type: Class
subclass of: JavaAPI
comment: JavaLibrary implementing the org.apache.http.util package for Android 1.5
comment: platform:comprisesInterfacePart some OrgApacheHttpUtil

OrgApacheHttpParamsAPI
type: Class
subclass of: JavaAPI
comment: JavaLibrary implementing the org.apache.http.params package for Android 1.5
comment: platform:comprisesInterfacePart some OrgApacheHttpParams

OrgApacheHttpAuthAPI
type: Class
subclass of: JavaAPI
comment: JavaLibrary implementing the org.apache.http.auth package for Android 1.5
comment: platform:comprisesInterfacePart some OrgApacheHttpAuth

OrgApacheHttpAuthParamsAPI
type: Class
subclass of: JavaAPI
comment: JavaLibrary implementing the org.apache.http.auth.params package for Android 1.5
comment: platform:comprisesInterfacePart some OrgApacheHttpAuthParams

OrgApacheHttpClientAPI
type: Class
subclass of: JavaAPI
comment: JavaLibrary implementing the org.apache.http.client package for Android 1.5
comment: platform:comprisesInterfacePart some OrgApacheHttpClient

OrgApacheHttpClientMethodsAPI
type: Class
subclass of: JavaAPI
comment: JavaLibrary implementing the org.apache.http.client.methods package for Android 1.5
comment: platform:comprisesInterfacePart some OrgApacheHttpClientMethods

OrgApacheHttpClientEntityAPI
type: Class
subclass of: JavaAPI
comment: JavaLibrary implementing the org.apache.http.client.entity package for Android 1.5
comment: platform:comprisesInterfacePart some OrgApacheHttpClientEntity

OrgApacheHttpClientParamsAPI
type: Class
subclass of: JavaAPI
comment: JavaLibrary implementing the org.apache.http.client.params package for Android 1.5
comment: platform:comprisesInterfacePart some OrgApacheHttpClientParams

OrgApacheHttpClientProtocolAPI
type: Class
subclass of: JavaAPI
comment: JavaLibrary implementing the org.apache.http.client.protocol package for Android 1.5
comment: platform:comprisesInterfacePart some OrgApacheHttpClientProtocol

OrgApacheHttpClientUtilsAPI
type: Class
subclass of: JavaAPI
comment: JavaLibrary implementing the org.apache.http.client.utils package for Android 1.5
comment: platform:comprisesInterfacePart some OrgApacheHttpClientUtils

OrgApacheHttpCookieAPI
type: Class
subclass of: JavaAPI
comment: JavaLibrary implementing the org.apache.http.cookie package for Android 1.5
comment: platform:comprisesInterfacePart some OrgApacheHttpCookie

OrgApacheHttpCookieParamsAPI
type: Class
subclass of: JavaAPI
comment: JavaLibrary implementing the org.apache.http.cookie.params package for Android 1.5
comment: platform:comprisesInterfacePart some OrgApacheHttpCookieParams

OrgApacheHttpConnAPI
type: Class
subclass of: JavaAPI
comment: JavaLibrary implementing the org.apache.http.conn package for Android 1.5
comment: platform:comprisesInterfacePart some OrgApacheHttpConn

OrgApacheHttpConnParamsAPI
type: Class
subclass of: JavaAPI
comment: JavaLibrary implementing the org.apache.http.conn.params package for Android 1.5
comment: platform:comprisesInterfacePart some OrgApacheHttpConnParams

OrgApacheHttpConnSchemeAPI
type: Class
subclass of: JavaAPI
comment: JavaLibrary implementing the org.apache.http.conn.scheme package for Android 1.5
comment: platform:comprisesInterfacePart some OrgApacheHttpConnScheme

OrgApacheHttpConnRoutingAPI
type: Class
subclass of: JavaAPI
comment: JavaLibrary implementing the org.apache.http.conn.routing package for Android 1.5
comment: platform:comprisesInterfacePart some OrgApacheHttpConnRouting

OrgApacheHttpConnSslAPI
type: Class
subclass of: JavaAPI
comment: JavaLibrary implementing the org.apache.http.conn.ssl package for Android 1.5
comment: platform:comprisesInterfacePart some OrgApacheHttpConnSsl

OrgApacheHttpConnUtilAPI
type: Class
subclass of: JavaAPI
comment: JavaLibrary implementing the org.apache.http.conn.util package for Android 1.5
comment: platform:comprisesInterfacePart some OrgApacheHttpConnUtil

OrgApacheHttpEntityAPI
type: Class
subclass of: JavaAPI
comment: JavaLibrary implementing the org.apache.http.entity package for Android 1.5
comment: platform:comprisesInterfacePart some OrgApacheHttpEntity

OrgApacheHttpMessageAPI
type: Class
subclass of: JavaAPI
comment: JavaLibrary implementing the org.apache.http.message package for Android 1.5
comment: platform:comprisesInterfacePart some OrgApacheHttpMessage

OrgApacheHttpImplAPI
type: Class
subclass of: JavaAPI
comment: JavaLibrary implementing the org.apache.http.impl package for Android 1.5
comment: platform:comprisesInterfacePart some OrgApacheHttpImpl

OrgApacheHttpImplEntityAPI
type: Class
subclass of: JavaAPI
comment: JavaLibrary implementing the org.apache.http.impl.entity package for Android 1.5
comment: platform:comprisesInterfacePart some OrgApacheHttpImplEntity

OrgApacheHttpImplAuthAPI
type: Class
subclass of: JavaAPI
comment: JavaLibrary implementing the org.apache.http.impl.auth package for Android 1.5
comment: platform:comprisesInterfacePart some OrgApacheHttpImplAuth

OrgApacheHttpImplClientAPI
type: Class
subclass of: JavaAPI
comment: JavaLibrary implementing the org.apache.http.impl.client package for Android 1.5
comment: platform:comprisesInterfacePart some OrgApacheHttpImplClient

OrgApacheHttpImplConnAPI
type: Class
subclass of: JavaAPI
comment: JavaLibrary implementing the org.apache.http.impl.conn package for Android 1.5
comment: platform:comprisesInterfacePart some OrgApacheHttpImplConn

OrgApacheHttpImplConnTsccmAPI
type: Class
subclass of: JavaAPI
comment: JavaLibrary implementing the org.apache.http.impl.conn.tsccm package for Android 1.5
comment: platform:comprisesInterfacePart some OrgApacheHttpImplConnTsccm

OrgApacheHttpImplIoAPI
type: Class
subclass of: JavaAPI
comment: JavaLibrary implementing the org.apache.http.impl.io package for Android 1.5
comment: platform:comprisesInterfacePart some OrgApacheHttpImplIo

OrgApacheHttpImplCookieAPI
type: Class
subclass of: JavaAPI
comment: JavaLibrary implementing the org.apache.http.impl.cookie package for Android 1.5
comment: platform:comprisesInterfacePart some OrgApacheHttpImplCookie

OrgApacheHttpIoAPI
type: Class
subclass of: JavaAPI
comment: JavaLibrary implementing the org.apache.http.io package for Android 1.5
comment: platform:comprisesInterfacePart some OrgApacheHttpIo

OrgJsonAPI
type: Class
subclass of: JavaAPI
comment: JavaLibrary implementing the org.json package for Android 1.5
comment: platform:comprisesInterfacePart some OrgJson

JavaxMicroeditionKhronosOpenglesAPI
type: Class
subclass of: JavaAPI
comment: JavaLibrary implementing the javax.microedition.khronos.opengles package for Android 1.5
comment: platform:comprisesInterfacePart some JavaxMicroeditionKhronosOpengles

JavaxMicroeditionKhronosEglAPI
type: Class
subclass of: JavaAPI
comment: JavaLibrary implementing the javax.microedition.khronos.egl package for Android 1.5
comment: platform:comprisesInterfacePart some JavaxMicroeditionKhronosEgl

JavaxNetAPI
type: Class
equivalent class: JavaxNetAPI
subclass of: JavaAPI
comment: JavaLibrary implementing the javax.net package for Android 1.5
comment: platform:comprisesInterfacePart some JavaxNet

JavaxNetSslAPI
type: Class
equivalent class: JavaxNetSslAPI
subclass of: JavaAPI
comment: JavaLibrary implementing the javax.net.ssl package for Android 1.5
comment: platform:comprisesInterfacePart some JavaxNetSsl

JavaxSecurityAuthAPI
type: Class
subclass of: JavaAPI
comment: JavaLibrary implementing the javax.security.auth package for Android 1.5
comment: platform:comprisesInterfacePart some JavaxSecurityAuth

JavaxSecurityAuthCallbackAPI
type: Class
subclass of: JavaAPI
comment: JavaLibrary implementing the javax.security.auth.callback package for Android 1.5
comment: platform:comprisesInterfacePart some JavaxSecurityAuthCallback

JavaxSecurityAuthX500API
type: Class
subclass of: JavaAPI
comment: JavaLibrary implementing the javax.security.auth.x500 package for Android 1.5
comment: platform:comprisesInterfacePart some JavaxSecurityAuthX500

JavaxSecurityAuthLoginAPI
type: Class
subclass of: JavaAPI
comment: JavaLibrary implementing the javax.security.auth.login package for Android 1.5
comment: platform:comprisesInterfacePart some JavaxSecurityAuthLogin

JavaxSecurityCertAPI
type: Class
equivalent class: JavaxSecurityCertAPI
subclass of: JavaAPI
comment: JavaLibrary implementing the javax.security.cert package for Android 1.5
comment: platform:comprisesInterfacePart some JavaxSecurityCert

JavaxCryptoAPI
type: Class
equivalent class: JavaxCryptoAPI
subclass of: JavaAPI
comment: JavaLibrary implementing the javax.crypto package for Android 1.5
comment: platform:comprisesInterfacePart some JavaxCrypto

JavaxCryptoInterfacesAPI
type: Class
equivalent class: JavaxCryptoInterfacesAPI
subclass of: JavaAPI
comment: JavaLibrary implementing the javax.crypto.interfaces package for Android 1.5
comment: platform:comprisesInterfacePart some JavaxCryptoInterfaces

JavaxCryptoSpecAPI
type: Class
equivalent class: JavaxCryptoSpecAPI
subclass of: JavaAPI
comment: JavaLibrary implementing the javax.crypto.spec package for Android 1.5
comment: platform:comprisesInterfacePart some JavaxCryptoSpec

JavaxSqlAPI
type: Class
subclass of: JavaAPI
comment: JavaLibrary implementing the javax.sql package for Android 1.5
comment: platform:comprisesInterfacePart some JavaxSql

JavaxXmlAPI
type: Class
subclass of: JavaxXmlAPI
comment: JavaLibrary implementing the javax.xml package for Android 1.5
comment: platform:comprisesInterfacePart some JavaxXml

JavaxXmlParsersAPI
type: Class
subclass of: JavaAPI
comment: JavaLibrary implementing the javax.xml.parsers package for Android 1.5
comment: platform:comprisesInterfacePart some JavaxXmlParsers

JunitFrameworkAPI
type: Class
subclass of: JavaAPI
comment: JavaLibrary implementing the junit.framework package for Android 1.5
comment: platform:comprisesInterfacePart some JunitFramework

JunitRunnerAPI
type: Class
subclass of: JavaAPI
comment: JavaLibrary implementing the junit.runner package for Android 1.5
comment: platform:comprisesInterfacePart some JunitRunner

DalvikAnnotationAPI
type: Class
subclass of: JavaAPI
comment: JavaLibrary implementing the dalvik.annotation package for Android 1.5
comment: platform:comprisesInterfacePart some DalvikAnnotation

DalvikBytecodeAPI
type: Class
subclass of: JavaAPI
comment: JavaLibrary implementing the dalvik.bytecode package for Android 1.5
comment: platform:comprisesInterfacePart some DalvikBytecode

DalvikSystemAPI
type: Class
subclass of: JavaAPI
comment: JavaLibrary implementing the dalvik.system package for Android 1.5
comment: platform:comprisesInterfacePart some DalvikSystem

AndroidClassLibrary
type: Class
subclass of: JavaClassLibrary
comment: JavaLibrary implementing the android package for Android 1.5
comment: platform:implementsInterface some AndroidAPI

AndroidAppClassLibrary
type: Class
subclass of: JavaClassLibrary
comment: JavaLibrary implementing the android.app package for Android 1.5
comment: platform:implementsInterface some AndroidAppAPI

AndroidViewClassLibrary
type: Class
subclass of: JavaClassLibrary
comment: JavaLibrary implementing the android.view package for Android 1.5
comment: platform:implementsInterface some AndroidViewAPI

AndroidViewInputmethodClassLibrary
type: Class
subclass of: JavaClassLibrary
comment: JavaLibrary implementing the android.view.inputmethod package for Android 1.5
comment: platform:implementsInterface some AndroidViewInputmethodAPI

AndroidViewAnimationClassLibrary
type: Class
subclass of: JavaClassLibrary
comment: JavaLibrary implementing the android.view.animation package for Android 1.5
comment: platform:implementsInterface some AndroidViewAnimationAPI

AndroidContentClassLibrary
type: Class
subclass of: JavaClassLibrary
comment: JavaLibrary implementing the android.content package for Android 1.5
comment: platform:implementsInterface some AndroidContentAPI

AndroidContentResClassLibrary
type: Class
subclass of: JavaClassLibrary
comment: JavaLibrary implementing the android.content.res package for Android 1.5
comment: platform:implementsInterface some AndroidContentResAPI

AndroidContentPmClassLibrary
type: Class
subclass of: JavaClassLibrary
comment: JavaLibrary implementing the android.content.pm package for Android 1.5
comment: platform:implementsInterface some AndroidContentPmAPI

AndroidOsClassLibrary
type: Class
subclass of: JavaClassLibrary
comment: JavaLibrary implementing the android.os package for Android 1.5
comment: platform:implementsInterface some AndroidOsAPI

AndroidGraphicsClassLibrary
type: Class
subclass of: JavaClassLibrary
comment: JavaLibrary implementing the android.graphics package for Android 1.5
comment: platform:implementsInterface some AndroidGraphicsAPI

AndroidGraphicsDrawableClassLibrary
type: Class
subclass of: JavaClassLibrary
comment: JavaLibrary implementing the android.graphics.drawable package for Android 1.5
comment: platform:implementsInterface some AndroidGraphicsDrawableAPI

AndroidGraphicsDrawableShapesClassLibrary
type: Class
subclass of: JavaClassLibrary
comment: JavaLibrary implementing the android.graphics.drawable.shapes package for Android 1.5
comment: platform:implementsInterface some AndroidGraphicsDrawableShapesAPI

AndroidNetClassLibrary
type: Class
subclass of: JavaClassLibrary
comment: JavaLibrary implementing the android.net package for Android 1.5
comment: platform:implementsInterface some AndroidNetAPI

AndroidNetHttpClassLibrary
type: Class
subclass of: JavaClassLibrary
comment: JavaLibrary implementing the android.net.http package for Android 1.5
comment: platform:implementsInterface some AndroidNetHttpAPI

AndroidNetWifiClassLibrary
type: Class
subclass of: JavaClassLibrary
comment: JavaLibrary implementing the android.net.wifi package for Android 1.5
comment: platform:implementsInterface some AndroidNetWifiAPI

AndroidDatabaseClassLibrary
type: Class
subclass of: JavaClassLibrary
comment: JavaLibrary implementing the android.database package for Android 1.5
comment: platform:implementsInterface some AndroidDatabaseAPI

AndroidDatabaseSqliteClassLibrary
type: Class
subclass of: JavaClassLibrary
comment: JavaLibrary implementing the android.database.sqlite package for Android 1.5
comment: platform:implementsInterface some AndroidDatabaseSqliteAPI

AndroidUtilClassLibrary
type: Class
subclass of: JavaClassLibrary
comment: JavaLibrary implementing the android.util package for Android 1.5
comment: platform:implementsInterface some AndroidUtilAPI

AndroidWidgetClassLibrary
type: Class
subclass of: JavaClassLibrary
comment: JavaLibrary implementing the android.widget package for Android 1.5
comment: platform:implementsInterface some AndroidWidgetAPI

AndroidAppwidgetClassLibrary
type: Class
subclass of: JavaClassLibrary
comment: JavaLibrary implementing the android.appwidget package for Android 1.5
comment: platform:implementsInterface some AndroidAppwidgetAPI

AndroidHardwareClassLibrary
type: Class
subclass of: JavaClassLibrary
comment: JavaLibrary implementing the android.hardware package for Android 1.5
comment: platform:implementsInterface some AndroidHardwareAPI

AndroidInputmethodserviceClassLibrary
type: Class
subclass of: JavaClassLibrary
comment: JavaLibrary implementing the android.inputmethodservice package for Android 1.5
comment: platform:implementsInterface some AndroidInputmethodserviceAPI

AndroidLocationClassLibrary
type: Class
subclass of: JavaClassLibrary
comment: JavaLibrary implementing the android.location package for Android 1.5
comment: platform:implementsInterface some AndroidLocationAPI

AndroidMediaClassLibrary
type: Class
subclass of: JavaClassLibrary
comment: JavaLibrary implementing the android.media package for Android 1.5
comment: platform:implementsInterface some AndroidMediaAPI

AndroidOpenglClassLibrary
type: Class
subclass of: JavaClassLibrary
comment: JavaLibrary implementing the android.opengl package for Android 1.5
comment: platform:implementsInterface some AndroidOpenglAPI

AndroidPreferenceClassLibrary
type: Class
subclass of: JavaClassLibrary
comment: JavaLibrary implementing the android.preference package for Android 1.5
comment: platform:implementsInterface some AndroidPreferenceAPI

AndroidProviderClassLibrary
type: Class
subclass of: JavaClassLibrary
comment: JavaLibrary implementing the android.provider package for Android 1.5
comment: platform:implementsInterface some AndroidProviderAPI

AndroidWebkitClassLibrary
type: Class
subclass of: JavaClassLibrary
comment: JavaLibrary implementing the android.webkit package for Android 1.5
comment: platform:implementsInterface some AndroidWebkitAPI

AndroidSaxClassLibrary
type: Class
subclass of: JavaClassLibrary
comment: JavaLibrary implementing the android.sax package for Android 1.5
comment: platform:implementsInterface some AndroidSaxAPI

AndroidSpeechClassLibrary
type: Class
subclass of: JavaClassLibrary
comment: JavaLibrary implementing the android.speech package for Android 1.5
comment: platform:implementsInterface some AndroidSpeechAPI

AndroidTelephonyClassLibrary
type: Class
subclass of: JavaClassLibrary
comment: JavaLibrary implementing the android.telephony package for Android 1.5
comment: platform:implementsInterface some AndroidTelephonyAPI

AndroidTelephonyGsmClassLibrary
type: Class
subclass of: JavaClassLibrary
comment: JavaLibrary implementing the android.telephony.gsm package for Android 1.5
comment: platform:implementsInterface some AndroidTelephonyGsmAPI

AndroidTextClassLibrary
type: Class
subclass of: JavaClassLibrary
comment: JavaLibrary implementing the android.text package for Android 1.5
comment: platform:implementsInterface some AndroidTextAPI

AndroidTextFormatClassLibrary
type: Class
subclass of: JavaClassLibrary
comment: JavaLibrary implementing the android.text.format package for Android 1.5
comment: platform:implementsInterface some AndroidTextFormatAPI

AndroidTextMethodClassLibrary
type: Class
subclass of: JavaClassLibrary
comment: JavaLibrary implementing the android.text.method package for Android 1.5
comment: platform:implementsInterface some AndroidTextMethodAPI

AndroidTextStyleClassLibrary
type: Class
subclass of: JavaClassLibrary
comment: JavaLibrary implementing the android.text.style package for Android 1.5
comment: platform:implementsInterface some AndroidTextStyleAPI

AndroidTextUtilClassLibrary
type: Class
subclass of: JavaClassLibrary
comment: JavaLibrary implementing the android.text.util package for Android 1.5
comment: platform:implementsInterface some AndroidTextUtilAPI

AndroidTestClassLibrary
type: Class
subclass of: JavaClassLibrary
comment: JavaLibrary implementing the android.test package for Android 1.5
comment: platform:implementsInterface some AndroidTestAPI

AndroidTestMockClassLibrary
type: Class
subclass of: JavaClassLibrary
comment: JavaLibrary implementing the android.test.mock package for Android 1.5
comment: platform:implementsInterface some AndroidTestMockAPI

AndroidTestSuitebuilderClassLibrary
type: Class
subclass of: JavaClassLibrary
comment: JavaLibrary implementing the android.test.suitebuilder package for Android 1.5
comment: platform:implementsInterface some AndroidTestSuitebuilderAPI

AndroidTestSuitebuilderAnnotationClassLibrary
type: Class
subclass of: JavaClassLibrary
comment: JavaLibrary implementing the android.test.suitebuilder.annotation package for Android 1.5
comment: platform:implementsInterface some AndroidTestSuitebuilderAnnotationAPI

JavaLangClassLibrary
type: Class
subclass of: JavaLangClassLibrary
comment: JavaLibrary implementing the java.lang package for Android 1.5
comment: platform:implementsInterface some JavaLangAPI

JavaLangAnnotationClassLibrary
type: Class
equivalent class: JavaLangAnnotationClassLibrary
subclass of: JavaClassLibrary
comment: JavaLibrary implementing the java.lang.annotation package for Android 1.5
comment: platform:implementsInterface some JavaLangAnnotationAPI

JavaLangReflectClassLibrary
type: Class
equivalent class: JavaLangReflectClassLibrary
subclass of: JavaClassLibrary
comment: JavaLibrary implementing the java.lang.reflect package for Android 1.5
comment: platform:implementsInterface some JavaLangReflectAPI

JavaLangRefClassLibrary
type: Class
equivalent class: JavaLangRefClassLibrary
subclass of: JavaClassLibrary
comment: JavaLibrary implementing the java.lang.ref package for Android 1.5
comment: platform:implementsInterface some JavaLangRefAPI

JavaUtilClassLibrary
type: Class
equivalent class: JavaUtilClassLibrary
subclass of: JavaClassLibrary
comment: JavaLibrary implementing the java.util package for Android 1.5
comment: platform:implementsInterface some JavaUtilAPI

JavaUtilConcurrentClassLibrary
type: Class
equivalent class: JavaUtilConcurrentClassLibrary
subclass of: JavaClassLibrary
comment: JavaLibrary implementing the java.util.concurrent package for Android 1.5
comment: platform:implementsInterface some JavaUtilConcurrentAPI

JavaUtilConcurrentAtomicClassLibrary
type: Class
equivalent class: JavaUtilConcurrentAtomicClassLibrary
subclass of: JavaClassLibrary
comment: JavaLibrary implementing the java.util.concurrent.atomic package for Android 1.5
comment: platform:implementsInterface some JavaUtilConcurrentAtomicAPI

JavaUtilConcurrentLocksClassLibrary
type: Class
equivalent class: JavaUtilConcurrentLocksClassLibrary
subclass of: JavaClassLibrary
comment: JavaLibrary implementing the java.util.concurrent.locks package for Android 1.5
comment: platform:implementsInterface some JavaUtilConcurrentLocksAPI

JavaUtilRegexClassLibrary
type: Class
equivalent class: JavaUtilRegexClassLibrary
subclass of: JavaClassLibrary
comment: JavaLibrary implementing the java.util.regex package for Android 1.5
comment: platform:implementsInterface some JavaUtilRegexAPI

JavaUtilJarClassLibrary
type: Class
equivalent class: JavaUtilJarClassLibrary
subclass of: JavaClassLibrary
comment: JavaLibrary implementing the java.util.jar package for Android 1.5
comment: platform:implementsInterface some JavaUtilJarAPI

JavaUtilZipClassLibrary
type: Class
equivalent class: JavaUtilZipClassLibrary
subclass of: JavaClassLibrary
comment: JavaLibrary implementing the java.util.zip package for Android 1.5
comment: platform:implementsInterface some JavaUtilZipAPI

JavaUtilLoggingClassLibrary
type: Class
equivalent class: JavaUtilLoggingClassLibrary
subclass of: JavaClassLibrary
comment: JavaLibrary implementing the java.util.logging package for Android 1.5
comment: platform:implementsInterface some JavaUtilLoggingAPI

JavaUtilPrefsClassLibrary
type: Class
equivalent class: JavaUtilPrefsClassLibrary
subclass of: JavaClassLibrary
comment: JavaLibrary implementing the java.util.prefs package for Android 1.5
comment: platform:implementsInterface some JavaUtilPrefsAPI

JavaIoClassLibrary
type: Class
equivalent class: JavaIoClassLibrary
subclass of: JavaClassLibrary
comment: JavaLibrary implementing the java.io package for Android 1.5
comment: platform:implementsInterface some JavaIoAPI

JavaNioClassLibrary
type: Class
equivalent class: JavaNioClassLibrary
subclass of: JavaClassLibrary
comment: JavaLibrary implementing the java.nio package for Android 1.5
comment: platform:implementsInterface some JavaNioAPI

JavaNioChannelsClassLibrary
type: Class
equivalent class: JavaNioChannelsClassLibrary
subclass of: JavaClassLibrary
comment: JavaLibrary implementing the java.nio.channels package for Android 1.5
comment: platform:implementsInterface some JavaNioChannelsAPI

JavaNioChannelsSpiClassLibrary
type: Class
equivalent class: JavaNioChannelsSpiClassLibrary
subclass of: JavaClassLibrary
comment: JavaLibrary implementing the java.nio.channels.spi package for Android 1.5
comment: platform:implementsInterface some JavaNioChannelsSpiAPI

JavaNioCharsetClassLibrary
type: Class
equivalent class: JavaNioCharsetClassLibrary
subclass of: JavaClassLibrary
comment: JavaLibrary implementing the java.nio.charset package for Android 1.5
comment: platform:implementsInterface some JavaNioCharsetAPI

JavaNioCharsetSpiClassLibrary
type: Class
equivalent class: JavaNioCharsetSpiClassLibrary
subclass of: JavaClassLibrary
comment: JavaLibrary implementing the java.nio.charset.spi package for Android 1.5
comment: platform:implementsInterface some JavaNioCharsetSpiAPI

JavaNetClassLibrary
type: Class
equivalent class: JavaNetClassLibrary
subclass of: JavaClassLibrary
comment: JavaLibrary implementing the java.net package for Android 1.5
comment: platform:implementsInterface some JavaNetAPI

JavaSecurityClassLibrary
type: Class
equivalent class: JavaSecurityClassLibrary
subclass of: JavaClassLibrary
comment: JavaLibrary implementing the java.security package for Android 1.5
comment: platform:implementsInterface some JavaSecurityAPI

JavaSecurityCertClassLibrary
type: Class
equivalent class: JavaSecurityCertClassLibrary
subclass of: JavaClassLibrary
comment: JavaLibrary implementing the java.security.cert package for Android 1.5
comment: platform:implementsInterface some JavaSecurityCertAPI

JavaSecuritySpecClassLibrary
type: Class
equivalent class: JavaSecuritySpecClassLibrary
subclass of: JavaClassLibrary
comment: JavaLibrary implementing the java.security.spec package for Android 1.5
comment: platform:implementsInterface some JavaSecuritySpecAPI

JavaSecurityAclClassLibrary
type: Class
equivalent class: JavaSecurityAclClassLibrary
subclass of: JavaClassLibrary
comment: JavaLibrary implementing the java.security.acl package for Android 1.5
comment: platform:implementsInterface some JavaSecurityAclAPI

JavaSecurityInterfacesClassLibrary
type: Class
equivalent class: JavaSecurityInterfacesClassLibrary
subclass of: JavaClassLibrary
comment: JavaLibrary implementing the java.security.interfaces package for Android 1.5
comment: platform:implementsInterface some JavaSecurityInterfacesAPI

JavaTextClassLibrary
type: Class
equivalent class: JavaTextClassLibrary
subclass of: JavaClassLibrary
comment: JavaLibrary implementing the java.text package for Android 1.5
comment: platform:implementsInterface some JavaTextAPI

JavaAwtFontClassLibrary
type: Class
subclass of: JavaClassLibrary
comment: JavaLibrary implementing the java.awt.font package for Android 1.5
comment: platform:implementsInterface some JavaAwtFontAPI

JavaBeansClassLibrary
type: Class
subclass of: JavaClassLibrary
comment: JavaLibrary implementing the java.beans package for Android 1.5
comment: platform:implementsInterface some JavaBeansAPI

JavaMathClassLibrary
type: Class
equivalent class: JavaMathClassLibrary
subclass of: JavaClassLibrary
comment: JavaLibrary implementing the java.math package for Android 1.5
comment: platform:implementsInterface some JavaMathAPI

JavaSqlClassLibrary
type: Class
equivalent class: JavaSqlClassLibrary
subclass of: JavaClassLibrary
comment: JavaLibrary implementing the java.sql package for Android 1.5
comment: platform:implementsInterface some JavaSqlAPI

OrgXmlpullV1ClassLibrary
type: Class
subclass of: JavaClassLibrary
comment: JavaLibrary implementing the org.xmlpull.v1 package for Android 1.5
comment: platform:implementsInterface some OrgXmlpullV1API

OrgXmlpullV1Sax2ClassLibrary
type: Class
subclass of: JavaClassLibrary
comment: JavaLibrary implementing the org.xmlpull.v1.sax2 package for Android 1.5
comment: platform:implementsInterface some OrgXmlpullV1Sax2API

OrgXmlSaxClassLibrary
type: Class
equivalent class: OrgXmlSaxClassLibrary
subclass of: JavaClassLibrary
comment: JavaLibrary implementing the org.xml.sax package for Android 1.5
comment: platform:implementsInterface some OrgXmlSaxAPI

OrgXmlSaxHelpersClassLibrary
type: Class
equivalent class: OrgXmlSaxHelpersClassLibrary
subclass of: JavaClassLibrary
comment: JavaLibrary implementing the org.xml.sax.helpers package for Android 1.5
comment: platform:implementsInterface some OrgXmlSaxHelpersAPI

OrgXmlSaxExtClassLibrary
type: Class
equivalent class: OrgXmlSaxExtClassLibrary
subclass of: JavaClassLibrary
comment: JavaLibrary implementing the org.xml.sax.ext package for Android 1.5
comment: platform:implementsInterface some OrgXmlSaxExtAPI

OrgW3cDomClassLibrary
type: Class
subclass of: JavaClassLibrary
comment: JavaLibrary implementing the org.w3c.dom package for Android 1.5
comment: platform:implementsInterface some OrgW3cDomAPI

OrgApacheCommonsLoggingClassLibrary
type: Class
subclass of: JavaClassLibrary
comment: JavaLibrary implementing the org.apache.commons.logging package for Android 1.5
comment: platform:implementsInterface some OrgApacheCommonsLoggingAPI

OrgApacheHttpClassLibrary
type: Class
subclass of: JavaClassLibrary
comment: JavaLibrary implementing the org.apache.http package for Android 1.5
comment: platform:implementsInterface some OrgApacheHttpAPI

OrgApacheHttpProtocolClassLibrary
type: Class
subclass of: JavaClassLibrary
comment: JavaLibrary implementing the org.apache.http.protocol package for Android 1.5
comment: platform:implementsInterface some OrgApacheHttpProtocolAPI

OrgApacheHttpUtilClassLibrary
type: Class
subclass of: JavaClassLibrary
comment: JavaLibrary implementing the org.apache.http.util package for Android 1.5
comment: platform:implementsInterface some OrgApacheHttpUtilAPI

OrgApacheHttpParamsClassLibrary
type: Class
subclass of: JavaClassLibrary
comment: JavaLibrary implementing the org.apache.http.params package for Android 1.5
comment: platform:implementsInterface some OrgApacheHttpParamsAPI

OrgApacheHttpAuthClassLibrary
type: Class
subclass of: JavaClassLibrary
comment: JavaLibrary implementing the org.apache.http.auth package for Android 1.5
comment: platform:implementsInterface some OrgApacheHttpAuthAPI

OrgApacheHttpAuthParamsClassLibrary
type: Class
subclass of: JavaClassLibrary
comment: JavaLibrary implementing the org.apache.http.auth.params package for Android 1.5
comment: platform:implementsInterface some OrgApacheHttpAuthParamsAPI

OrgApacheHttpClientClassLibrary
type: Class
subclass of: JavaClassLibrary
comment: JavaLibrary implementing the org.apache.http.client package for Android 1.5
comment: platform:implementsInterface some OrgApacheHttpClientAPI

OrgApacheHttpClientMethodsClassLibrary
type: Class
subclass of: JavaClassLibrary
comment: JavaLibrary implementing the org.apache.http.client.methods package for Android 1.5
comment: platform:implementsInterface some OrgApacheHttpClientMethodsAPI

OrgApacheHttpClientEntityClassLibrary
type: Class
subclass of: JavaClassLibrary
comment: JavaLibrary implementing the org.apache.http.client.entity package for Android 1.5
comment: platform:implementsInterface some OrgApacheHttpClientEntityAPI

OrgApacheHttpClientParamsClassLibrary
type: Class
subclass of: JavaClassLibrary
comment: JavaLibrary implementing the org.apache.http.client.params package for Android 1.5
comment: platform:implementsInterface some OrgApacheHttpClientParamsAPI

OrgApacheHttpClientProtocolClassLibrary
type: Class
subclass of: JavaClassLibrary
comment: JavaLibrary implementing the org.apache.http.client.protocol package for Android 1.5
comment: platform:implementsInterface some OrgApacheHttpClientProtocolAPI

OrgApacheHttpClientUtilsClassLibrary
type: Class
subclass of: JavaClassLibrary
comment: JavaLibrary implementing the org.apache.http.client.utils package for Android 1.5
comment: platform:implementsInterface some OrgApacheHttpClientUtilsAPI

OrgApacheHttpCookieClassLibrary
type: Class
subclass of: JavaClassLibrary
comment: JavaLibrary implementing the org.apache.http.cookie package for Android 1.5
comment: platform:implementsInterface some OrgApacheHttpCookieAPI

OrgApacheHttpCookieParamsClassLibrary
type: Class
subclass of: JavaClassLibrary
comment: JavaLibrary implementing the org.apache.http.cookie.params package for Android 1.5
comment: platform:implementsInterface some OrgApacheHttpCookieParamsAPI

OrgApacheHttpConnClassLibrary
type: Class
subclass of: JavaClassLibrary
comment: JavaLibrary implementing the org.apache.http.conn package for Android 1.5
comment: platform:implementsInterface some OrgApacheHttpConnAPI

OrgApacheHttpConnParamsClassLibrary
type: Class
subclass of: JavaClassLibrary
comment: JavaLibrary implementing the org.apache.http.conn.params package for Android 1.5
comment: platform:implementsInterface some OrgApacheHttpConnParamsAPI

OrgApacheHttpConnSchemeClassLibrary
type: Class
subclass of: JavaClassLibrary
comment: JavaLibrary implementing the org.apache.http.conn.scheme package for Android 1.5
comment: platform:implementsInterface some OrgApacheHttpConnSchemeAPI

OrgApacheHttpConnRoutingClassLibrary
type: Class
subclass of: JavaClassLibrary
comment: JavaLibrary implementing the org.apache.http.conn.routing package for Android 1.5
comment: platform:implementsInterface some OrgApacheHttpConnRoutingAPI

OrgApacheHttpConnSslClassLibrary
type: Class
subclass of: JavaClassLibrary
comment: JavaLibrary implementing the org.apache.http.conn.ssl package for Android 1.5
comment: platform:implementsInterface some OrgApacheHttpConnSslAPI

OrgApacheHttpConnUtilClassLibrary
type: Class
subclass of: JavaClassLibrary
comment: JavaLibrary implementing the org.apache.http.conn.util package for Android 1.5
comment: platform:implementsInterface some OrgApacheHttpConnUtilAPI

OrgApacheHttpEntityClassLibrary
type: Class
subclass of: JavaClassLibrary
comment: JavaLibrary implementing the org.apache.http.entity package for Android 1.5
comment: platform:implementsInterface some OrgApacheHttpEntityAPI

OrgApacheHttpMessageClassLibrary
type: Class
subclass of: JavaClassLibrary
comment: JavaLibrary implementing the org.apache.http.message package for Android 1.5
comment: platform:implementsInterface some OrgApacheHttpMessageAPI

OrgApacheHttpImplClassLibrary
type: Class
subclass of: JavaClassLibrary
comment: JavaLibrary implementing the org.apache.http.impl package for Android 1.5
comment: platform:implementsInterface some OrgApacheHttpImplAPI

OrgApacheHttpImplEntityClassLibrary
type: Class
subclass of: JavaClassLibrary
comment: JavaLibrary implementing the org.apache.http.impl.entity package for Android 1.5
comment: platform:implementsInterface some OrgApacheHttpImplEntityAPI

OrgApacheHttpImplAuthClassLibrary
type: Class
subclass of: JavaClassLibrary
comment: JavaLibrary implementing the org.apache.http.impl.auth package for Android 1.5
comment: platform:implementsInterface some OrgApacheHttpImplAuthAPI

OrgApacheHttpImplClientClassLibrary
type: Class
subclass of: JavaClassLibrary
comment: JavaLibrary implementing the org.apache.http.impl.client package for Android 1.5
comment: platform:implementsInterface some OrgApacheHttpImplClientAPI

OrgApacheHttpImplConnClassLibrary
type: Class
subclass of: JavaClassLibrary
comment: JavaLibrary implementing the org.apache.http.impl.conn package for Android 1.5
comment: platform:implementsInterface some OrgApacheHttpImplConnAPI

OrgApacheHttpImplConnTsccmClassLibrary
type: Class
subclass of: JavaClassLibrary
comment: JavaLibrary implementing the org.apache.http.impl.conn.tsccm package for Android 1.5
comment: platform:implementsInterface some OrgApacheHttpImplConnTsccmAPI

OrgApacheHttpImplIoClassLibrary
type: Class
subclass of: JavaClassLibrary
comment: JavaLibrary implementing the org.apache.http.impl.io package for Android 1.5
comment: platform:implementsInterface some OrgApacheHttpImplIoAPI

OrgApacheHttpImplCookieClassLibrary
type: Class
subclass of: JavaClassLibrary
comment: JavaLibrary implementing the org.apache.http.impl.cookie package for Android 1.5
comment: platform:implementsInterface some OrgApacheHttpImplCookieAPI

OrgApacheHttpIoClassLibrary
type: Class
subclass of: JavaClassLibrary
comment: JavaLibrary implementing the org.apache.http.io package for Android 1.5
comment: platform:implementsInterface some OrgApacheHttpIoAPI

OrgJsonClassLibrary
type: Class
subclass of: JavaClassLibrary
comment: JavaLibrary implementing the org.json package for Android 1.5
comment: platform:implementsInterface some OrgJsonAPI

JavaxMicroeditionKhronosOpenglesClassLibrary
type: Class
subclass of: JavaClassLibrary
comment: JavaLibrary implementing the javax.microedition.khronos.opengles package for Android 1.5
comment: platform:implementsInterface some JavaxMicroeditionKhronosOpenglesAPI

JavaxMicroeditionKhronosEglClassLibrary
type: Class
subclass of: JavaClassLibrary
comment: JavaLibrary implementing the javax.microedition.khronos.egl package for Android 1.5
comment: platform:implementsInterface some JavaxMicroeditionKhronosEglAPI

JavaxNetClassLibrary
type: Class
equivalent class: JavaxNetClassLibrary
subclass of: JavaClassLibrary
comment: JavaLibrary implementing the javax.net package for Android 1.5
comment: platform:implementsInterface some JavaxNetAPI

JavaxNetSslClassLibrary
type: Class
equivalent class: JavaxNetSslClassLibrary
subclass of: JavaClassLibrary
comment: JavaLibrary implementing the javax.net.ssl package for Android 1.5
comment: platform:implementsInterface some JavaxNetSslAPI

JavaxSecurityAuthClassLibrary
type: Class
subclass of: JavaClassLibrary
comment: JavaLibrary implementing the javax.security.auth package for Android 1.5
comment: platform:implementsInterface some JavaxSecurityAuthAPI

JavaxSecurityAuthCallbackClassLibrary
type: Class
subclass of: JavaClassLibrary
comment: JavaLibrary implementing the javax.security.auth.callback package for Android 1.5
comment: platform:implementsInterface some JavaxSecurityAuthCallbackAPI

JavaxSecurityAuthX500ClassLibrary
type: Class
subclass of: JavaClassLibrary
comment: JavaLibrary implementing the javax.security.auth.x500 package for Android 1.5
comment: platform:implementsInterface some JavaxSecurityAuthX500API

JavaxSecurityAuthLoginClassLibrary
type: Class
subclass of: JavaClassLibrary
comment: JavaLibrary implementing the javax.security.auth.login package for Android 1.5
comment: platform:implementsInterface some JavaxSecurityAuthLoginAPI

JavaxSecurityCertClassLibrary
type: Class
equivalent class: JavaxSecurityCertClassLibrary
subclass of: JavaClassLibrary
comment: JavaLibrary implementing the javax.security.cert package for Android 1.5
comment: platform:implementsInterface some JavaxSecurityCertAPI

JavaxCryptoClassLibrary
type: Class
equivalent class: JavaxCryptoClassLibrary
subclass of: JavaClassLibrary
comment: JavaLibrary implementing the javax.crypto package for Android 1.5
comment: platform:implementsInterface some JavaxCryptoAPI

JavaxCryptoInterfacesClassLibrary
type: Class
equivalent class: JavaxCryptoInterfacesClassLibrary
subclass of: JavaClassLibrary
comment: JavaLibrary implementing the javax.crypto.interfaces package for Android 1.5
comment: platform:implementsInterface some JavaxCryptoInterfacesAPI

JavaxCryptoSpecClassLibrary
type: Class
equivalent class: JavaxCryptoSpecClassLibrary
subclass of: JavaClassLibrary
comment: JavaLibrary implementing the javax.crypto.spec package for Android 1.5
comment: platform:implementsInterface some JavaxCryptoSpecAPI

JavaxSqlClassLibrary
type: Class
subclass of: JavaClassLibrary
comment: JavaLibrary implementing the javax.sql package for Android 1.5
comment: platform:implementsInterface some JavaxSqlAPI

JavaxXmlClassLibrary
type: Class
subclass of: JavaxXmlClassLibrary
comment: JavaLibrary implementing the javax.xml package for Android 1.5
comment: platform:implementsInterface some JavaxXmlAPI

JavaxXmlParsersClassLibrary
type: Class
subclass of: JavaClassLibrary
comment: JavaLibrary implementing the javax.xml.parsers package for Android 1.5
comment: platform:implementsInterface some JavaxXmlParsersAPI

JunitFrameworkClassLibrary
type: Class
subclass of: JavaClassLibrary
comment: JavaLibrary implementing the junit.framework package for Android 1.5
comment: platform:implementsInterface some JunitFrameworkAPI

JunitRunnerClassLibrary
type: Class
subclass of: JavaClassLibrary
comment: JavaLibrary implementing the junit.runner package for Android 1.5
comment: platform:implementsInterface some JunitRunnerAPI

DalvikAnnotationClassLibrary
type: Class
subclass of: JavaClassLibrary
comment: JavaLibrary implementing the dalvik.annotation package for Android 1.5
comment: platform:implementsInterface some DalvikAnnotationAPI

DalvikBytecodeClassLibrary
type: Class
subclass of: JavaClassLibrary
comment: JavaLibrary implementing the dalvik.bytecode package for Android 1.5
comment: platform:implementsInterface some DalvikBytecodeAPI

DalvikSystemClassLibrary
type: Class
subclass of: JavaClassLibrary
comment: JavaLibrary implementing the dalvik.system package for Android 1.5
comment: platform:implementsInterface some DalvikSystemAPI