Android 2.3
type: Ontology
version info: $Id$
creator: Dennis Wagelaar <dennis.wagelaar@vub.ac.be>
comment: Generated by [UML2ToSimplifiedPackageAPIOntology.atl 8080 2010-03-18 10:46:40Z dwagelaa], [UML2ToPackageAPIOntology.atl 8082 2010-03-18 21:11:00Z dwagelaa], [UML2ToAPIOntology.atl 8086 2010-03-19 09:49:17Z dwagelaa], and [UML2Comparison.atl 8326 2010-11-11 13:32:14Z dwagelaa]
rights: © 2011, Vrije Universiteit Brussel. All rights reserved.
imports: android-2 2.owl
imports: android.owl
imports: isa.owl
imports: java-se-6.owl
imports: java.owl
imports: platform.owl

Android
type: Class
subclass of: JavaAPIPart
comment: Java API part implementing the android package for Android 2.3

Android2 3API
type: Class
subclass of: AndroidAPI
subclass of: AndroidAccessibilityserviceAPI
subclass of: AndroidAccountsAPI
subclass of: AndroidAppAPI
subclass of: AndroidAppAdminAPI
subclass of: AndroidAppBackupAPI
subclass of: AndroidAppwidgetAPI
subclass of: AndroidBluetoothAPI
subclass of: AndroidContentAPI
subclass of: AndroidContentPmAPI
subclass of: AndroidContentResAPI
subclass of: AndroidDatabaseAPI
subclass of: AndroidDatabaseSqliteAPI
subclass of: AndroidGestureAPI
subclass of: AndroidGraphicsAPI
subclass of: AndroidGraphicsDrawableAPI
subclass of: AndroidGraphicsDrawableShapesAPI
subclass of: AndroidHardwareAPI
subclass of: AndroidInputmethodserviceAPI
subclass of: AndroidLocationAPI
subclass of: AndroidMediaAPI
subclass of: AndroidMediaAudiofxAPI
subclass of: AndroidNetAPI
subclass of: AndroidNetHttpAPI
subclass of: AndroidNetSipAPI
subclass of: AndroidNetWifiAPI
subclass of: AndroidNfcAPI
subclass of: AndroidOpenglAPI
subclass of: AndroidOsAPI
subclass of: AndroidOsStorageAPI
subclass of: AndroidPreferenceAPI
subclass of: AndroidProviderAPI
subclass of: AndroidSaxAPI
subclass of: AndroidServiceWallpaperAPI
subclass of: AndroidSpeechAPI
subclass of: AndroidSpeechTtsAPI
subclass of: AndroidTelephonyAPI
subclass of: AndroidTelephonyCdmaAPI
subclass of: AndroidTelephonyGsmAPI
subclass of: AndroidTestAPI
subclass of: AndroidTestMockAPI
subclass of: AndroidTestSuitebuilderAPI
subclass of: AndroidTestSuitebuilderAnnotationAPI
subclass of: AndroidTextAPI
subclass of: AndroidTextFormatAPI
subclass of: AndroidTextMethodAPI
subclass of: AndroidTextStyleAPI
subclass of: AndroidTextUtilAPI
subclass of: AndroidUtilAPI
subclass of: AndroidViewAPI
subclass of: AndroidViewAccessibilityAPI
subclass of: AndroidViewAnimationAPI
subclass of: AndroidViewInputmethodAPI
subclass of: AndroidWebkitAPI
subclass of: AndroidWidgetAPI
subclass of: DalvikAnnotationAPI
subclass of: DalvikBytecodeAPI
subclass of: DalvikSystemAPI
subclass of: JavaAwtFontAPI
subclass of: JavaBeansAPI
subclass of: JavaIoAPI
subclass of: JavaLangAPI
subclass of: JavaLangAnnotationAPI
subclass of: JavaLangRefAPI
subclass of: JavaLangReflectAPI
subclass of: JavaMathAPI
subclass of: JavaNetAPI
subclass of: JavaNioAPI
subclass of: JavaNioChannelsAPI
subclass of: JavaNioChannelsSpiAPI
subclass of: JavaNioCharsetAPI
subclass of: JavaNioCharsetSpiAPI
subclass of: JavaSecurityAPI
subclass of: JavaSecurityAclAPI
subclass of: JavaSecurityCertAPI
subclass of: JavaSecurityInterfacesAPI
subclass of: JavaSecuritySpecAPI
subclass of: JavaSqlAPI
subclass of: JavaTextAPI

Android2 3BytecodeFormat
type: Class
subclass of: JavaBytecode
comment: java:majorVersionNumber some xsd:integer[>="49"^^xsd:integer] and java:preverified value false
comment: Android 2.3 bytecode format

Android2 3ClassLibrary
type: Class
subclass of: AndroidAccessibilityserviceClassLibrary
subclass of: AndroidAccountsClassLibrary
subclass of: AndroidAppAdminClassLibrary
subclass of: AndroidAppBackupClassLibrary
subclass of: AndroidAppClassLibrary
subclass of: AndroidAppwidgetClassLibrary
subclass of: AndroidBluetoothClassLibrary
subclass of: AndroidClassLibrary
subclass of: AndroidContentClassLibrary
subclass of: AndroidContentPmClassLibrary
subclass of: AndroidContentResClassLibrary
subclass of: AndroidDatabaseClassLibrary
subclass of: AndroidDatabaseSqliteClassLibrary
subclass of: AndroidGestureClassLibrary
subclass of: AndroidGraphicsClassLibrary
subclass of: AndroidGraphicsDrawableClassLibrary
subclass of: AndroidGraphicsDrawableShapesClassLibrary
subclass of: AndroidHardwareClassLibrary
subclass of: AndroidInputmethodserviceClassLibrary
subclass of: AndroidLocationClassLibrary
subclass of: AndroidMediaAudiofxClassLibrary
subclass of: AndroidMediaClassLibrary
subclass of: AndroidNetClassLibrary
subclass of: AndroidNetHttpClassLibrary
subclass of: AndroidNetSipClassLibrary
subclass of: AndroidNetWifiClassLibrary
subclass of: AndroidNfcClassLibrary
subclass of: AndroidOpenglClassLibrary
subclass of: AndroidOsClassLibrary
subclass of: AndroidOsStorageClassLibrary
subclass of: AndroidPreferenceClassLibrary
subclass of: AndroidProviderClassLibrary
subclass of: AndroidSaxClassLibrary
subclass of: AndroidServiceWallpaperClassLibrary
subclass of: AndroidSpeechClassLibrary
subclass of: AndroidSpeechTtsClassLibrary
subclass of: AndroidTelephonyCdmaClassLibrary
subclass of: AndroidTelephonyClassLibrary
subclass of: AndroidTelephonyGsmClassLibrary
subclass of: AndroidTestClassLibrary
subclass of: AndroidTestMockClassLibrary
subclass of: AndroidTestSuitebuilderAnnotationClassLibrary
subclass of: AndroidTestSuitebuilderClassLibrary
subclass of: AndroidTextClassLibrary
subclass of: AndroidTextFormatClassLibrary
subclass of: AndroidTextMethodClassLibrary
subclass of: AndroidTextStyleClassLibrary
subclass of: AndroidTextUtilClassLibrary
subclass of: AndroidUtilClassLibrary
subclass of: AndroidViewAccessibilityClassLibrary
subclass of: AndroidViewAnimationClassLibrary
subclass of: AndroidViewClassLibrary
subclass of: AndroidViewInputmethodClassLibrary
subclass of: AndroidWebkitClassLibrary
subclass of: AndroidWidgetClassLibrary
subclass of: DalvikAnnotationClassLibrary
subclass of: DalvikBytecodeClassLibrary
subclass of: DalvikSystemClassLibrary
subclass of: JavaAwtFontClassLibrary
subclass of: JavaBeansClassLibrary
subclass of: JavaIoClassLibrary
subclass of: JavaLangAnnotationClassLibrary
subclass of: JavaLangClassLibrary
subclass of: JavaLangRefClassLibrary
subclass of: JavaLangReflectClassLibrary
subclass of: JavaMathClassLibrary
subclass of: JavaNetClassLibrary
subclass of: JavaNioChannelsClassLibrary
subclass of: JavaNioChannelsSpiClassLibrary
subclass of: JavaNioCharsetClassLibrary
subclass of: JavaNioCharsetSpiClassLibrary
subclass of: JavaNioClassLibrary
subclass of: JavaSecurityAclClassLibrary
subclass of: JavaSecurityCertClassLibrary
subclass of: JavaSecurityClassLibrary
subclass of: JavaSecurityInterfacesClassLibrary
subclass of: JavaSecuritySpecClassLibrary
subclass of: JavaSqlClassLibrary
subclass of: JavaTextClassLibrary

Android2 3RE
type: Class
equivalent class: Class
  intersection of: Restriction
    on property: providesFeature
    some values from: Android2 3ClassLibrary
  intersection of: Restriction
    on property: providesFeature
    some values from: Android2 3VM
subclass of: AndroidRE
comment: Android 2.3 Java Runtime Environment

Android2 3VM
type: Class
equivalent class: Restriction
  on property: implementsInterface
  some values from: Android2 3BytecodeFormat
subclass of: JavaVM
comment: Android 2.3 virtual machine

AndroidAPI
type: Class
subclass of: JavaAPI
comment: platform:comprisesInterfacePart some Android
comment: JavaLibrary implementing the android package for Android 2.3

AndroidAccessibilityservice
type: Class
subclass of: AndroidAccessibilityservice
comment: Java API part implementing the android.accessibilityservice package for Android 2.3

AndroidAccessibilityserviceAPI
type: Class
subclass of: AndroidAccessibilityserviceAPI
comment: platform:comprisesInterfacePart some AndroidAccessibilityservice
comment: JavaLibrary implementing the android.accessibilityservice package for Android 2.3

AndroidAccessibilityserviceClassLibrary
type: Class
subclass of: AndroidAccessibilityserviceClassLibrary
comment: platform:implementsInterface some AndroidAccessibilityserviceAPI
comment: JavaLibrary implementing the android.accessibilityservice package for Android 2.3

AndroidAccounts
type: Class
subclass of: AndroidAccounts
comment: Java API part implementing the android.accounts package for Android 2.3

AndroidAccountsAPI
type: Class
subclass of: AndroidAccountsAPI
comment: platform:comprisesInterfacePart some AndroidAccounts
comment: JavaLibrary implementing the android.accounts package for Android 2.3

AndroidAccountsClassLibrary
type: Class
subclass of: AndroidAccountsClassLibrary
comment: platform:implementsInterface some AndroidAccountsAPI
comment: JavaLibrary implementing the android.accounts package for Android 2.3

AndroidApp
type: Class
subclass of: AndroidApp
comment: Java API part implementing the android.app package for Android 2.3

AndroidAppAPI
type: Class
subclass of: AndroidAppAPI
comment: platform:comprisesInterfacePart some AndroidApp
comment: JavaLibrary implementing the android.app package for Android 2.3

AndroidAppAdmin
type: Class
subclass of: AndroidAppAdmin
comment: Java API part implementing the android.app.admin package for Android 2.3

AndroidAppAdminAPI
type: Class
subclass of: AndroidAppAdminAPI
comment: platform:comprisesInterfacePart some AndroidAppAdmin
comment: JavaLibrary implementing the android.app.admin package for Android 2.3

AndroidAppAdminClassLibrary
type: Class
subclass of: AndroidAppAdminClassLibrary
comment: platform:implementsInterface some AndroidAppAdminAPI
comment: JavaLibrary implementing the android.app.admin package for Android 2.3

AndroidAppBackup
type: Class
subclass of: AndroidAppBackup
comment: Java API part implementing the android.app.backup package for Android 2.3

AndroidAppBackupAPI
type: Class
subclass of: AndroidAppBackupAPI
comment: platform:comprisesInterfacePart some AndroidAppBackup
comment: JavaLibrary implementing the android.app.backup package for Android 2.3

AndroidAppBackupClassLibrary
type: Class
subclass of: AndroidAppBackupClassLibrary
comment: platform:implementsInterface some AndroidAppBackupAPI
comment: JavaLibrary implementing the android.app.backup package for Android 2.3

AndroidAppClassLibrary
type: Class
subclass of: AndroidAppClassLibrary
comment: platform:implementsInterface some AndroidAppAPI
comment: JavaLibrary implementing the android.app package for Android 2.3

AndroidAppwidget
type: Class
subclass of: AndroidAppwidget
comment: Java API part implementing the android.appwidget package for Android 2.3

AndroidAppwidgetAPI
type: Class
subclass of: AndroidAppwidgetAPI
comment: platform:comprisesInterfacePart some AndroidAppwidget
comment: JavaLibrary implementing the android.appwidget package for Android 2.3

AndroidAppwidgetClassLibrary
type: Class
subclass of: AndroidAppwidgetClassLibrary
comment: platform:implementsInterface some AndroidAppwidgetAPI
comment: JavaLibrary implementing the android.appwidget package for Android 2.3

AndroidBluetooth
type: Class
subclass of: JavaAPIPart
comment: Java API part implementing the android.bluetooth package for Android 2.3

AndroidBluetoothAPI
type: Class
subclass of: JavaAPI
comment: platform:comprisesInterfacePart some AndroidBluetooth
comment: JavaLibrary implementing the android.bluetooth package for Android 2.3

AndroidBluetoothClassLibrary
type: Class
subclass of: JavaClassLibrary
comment: platform:implementsInterface some AndroidBluetoothAPI
comment: JavaLibrary implementing the android.bluetooth package for Android 2.3

AndroidClassLibrary
type: Class
subclass of: JavaClassLibrary
comment: platform:implementsInterface some AndroidAPI
comment: JavaLibrary implementing the android package for Android 2.3

AndroidContent
type: Class
subclass of: AndroidContent
comment: Java API part implementing the android.content package for Android 2.3

AndroidContentAPI
type: Class
subclass of: AndroidContentAPI
comment: platform:comprisesInterfacePart some AndroidContent
comment: JavaLibrary implementing the android.content package for Android 2.3

AndroidContentClassLibrary
type: Class
subclass of: AndroidContentClassLibrary
comment: platform:implementsInterface some AndroidContentAPI
comment: JavaLibrary implementing the android.content package for Android 2.3

AndroidContentPm
type: Class
subclass of: AndroidContentPm
comment: Java API part implementing the android.content.pm package for Android 2.3

AndroidContentPmAPI
type: Class
subclass of: AndroidContentPmAPI
comment: platform:comprisesInterfacePart some AndroidContentPm
comment: JavaLibrary implementing the android.content.pm package for Android 2.3

AndroidContentPmClassLibrary
type: Class
subclass of: AndroidContentPmClassLibrary
comment: platform:implementsInterface some AndroidContentPmAPI
comment: JavaLibrary implementing the android.content.pm package for Android 2.3

AndroidContentRes
type: Class
subclass of: AndroidContentRes
comment: Java API part implementing the android.content.res package for Android 2.3

AndroidContentResAPI
type: Class
subclass of: AndroidContentResAPI
comment: platform:comprisesInterfacePart some AndroidContentRes
comment: JavaLibrary implementing the android.content.res package for Android 2.3

AndroidContentResClassLibrary
type: Class
subclass of: AndroidContentResClassLibrary
comment: platform:implementsInterface some AndroidContentResAPI
comment: JavaLibrary implementing the android.content.res package for Android 2.3

AndroidDatabase
type: Class
subclass of: AndroidDatabase
comment: Java API part implementing the android.database package for Android 2.3

AndroidDatabaseAPI
type: Class
subclass of: AndroidDatabaseAPI
comment: platform:comprisesInterfacePart some AndroidDatabase
comment: JavaLibrary implementing the android.database package for Android 2.3

AndroidDatabaseClassLibrary
type: Class
subclass of: AndroidDatabaseClassLibrary
comment: platform:implementsInterface some AndroidDatabaseAPI
comment: JavaLibrary implementing the android.database package for Android 2.3

AndroidDatabaseSqlite
type: Class
subclass of: JavaAPIPart
comment: Java API part implementing the android.database.sqlite package for Android 2.3

AndroidDatabaseSqliteAPI
type: Class
subclass of: JavaAPI
comment: platform:comprisesInterfacePart some AndroidDatabaseSqlite
comment: JavaLibrary implementing the android.database.sqlite package for Android 2.3

AndroidDatabaseSqliteClassLibrary
type: Class
subclass of: JavaClassLibrary
comment: platform:implementsInterface some AndroidDatabaseSqliteAPI
comment: JavaLibrary implementing the android.database.sqlite package for Android 2.3

AndroidGesture
type: Class
subclass of: AndroidGesture
comment: Java API part implementing the android.gesture package for Android 2.3

AndroidGestureAPI
type: Class
subclass of: AndroidGestureAPI
comment: platform:comprisesInterfacePart some AndroidGesture
comment: JavaLibrary implementing the android.gesture package for Android 2.3

AndroidGestureClassLibrary
type: Class
subclass of: AndroidGestureClassLibrary
comment: platform:implementsInterface some AndroidGestureAPI
comment: JavaLibrary implementing the android.gesture package for Android 2.3

AndroidGraphics
type: Class
subclass of: AndroidGraphics
comment: Java API part implementing the android.graphics package for Android 2.3

AndroidGraphicsAPI
type: Class
subclass of: AndroidGraphicsAPI
comment: platform:comprisesInterfacePart some AndroidGraphics
comment: JavaLibrary implementing the android.graphics package for Android 2.3

AndroidGraphicsClassLibrary
type: Class
subclass of: AndroidGraphicsClassLibrary
comment: platform:implementsInterface some AndroidGraphicsAPI
comment: JavaLibrary implementing the android.graphics package for Android 2.3

AndroidGraphicsDrawable
type: Class
subclass of: AndroidGraphicsDrawable
comment: Java API part implementing the android.graphics.drawable package for Android 2.3

AndroidGraphicsDrawableAPI
type: Class
subclass of: AndroidGraphicsDrawableAPI
comment: platform:comprisesInterfacePart some AndroidGraphicsDrawable
comment: JavaLibrary implementing the android.graphics.drawable package for Android 2.3

AndroidGraphicsDrawableClassLibrary
type: Class
subclass of: AndroidGraphicsDrawableClassLibrary
comment: platform:implementsInterface some AndroidGraphicsDrawableAPI
comment: JavaLibrary implementing the android.graphics.drawable package for Android 2.3

AndroidGraphicsDrawableShapes
type: Class
subclass of: JavaAPIPart
comment: Java API part implementing the android.graphics.drawable.shapes package for Android 2.3

AndroidGraphicsDrawableShapesAPI
type: Class
subclass of: JavaAPI
comment: platform:comprisesInterfacePart some AndroidGraphicsDrawableShapes
comment: JavaLibrary implementing the android.graphics.drawable.shapes package for Android 2.3

AndroidGraphicsDrawableShapesClassLibrary
type: Class
subclass of: JavaClassLibrary
comment: platform:implementsInterface some AndroidGraphicsDrawableShapesAPI
comment: JavaLibrary implementing the android.graphics.drawable.shapes package for Android 2.3

AndroidHardware
type: Class
subclass of: AndroidHardware
comment: Java API part implementing the android.hardware package for Android 2.3

AndroidHardwareAPI
type: Class
subclass of: AndroidHardwareAPI
comment: platform:comprisesInterfacePart some AndroidHardware
comment: JavaLibrary implementing the android.hardware package for Android 2.3

AndroidHardwareClassLibrary
type: Class
subclass of: AndroidHardwareClassLibrary
comment: platform:implementsInterface some AndroidHardwareAPI
comment: JavaLibrary implementing the android.hardware package for Android 2.3

AndroidInputmethodservice
type: Class
subclass of: AndroidInputmethodservice
comment: Java API part implementing the android.inputmethodservice package for Android 2.3

AndroidInputmethodserviceAPI
type: Class
subclass of: AndroidInputmethodserviceAPI
comment: platform:comprisesInterfacePart some AndroidInputmethodservice
comment: JavaLibrary implementing the android.inputmethodservice package for Android 2.3

AndroidInputmethodserviceClassLibrary
type: Class
subclass of: AndroidInputmethodserviceClassLibrary
comment: platform:implementsInterface some AndroidInputmethodserviceAPI
comment: JavaLibrary implementing the android.inputmethodservice package for Android 2.3

AndroidLocation
type: Class
subclass of: AndroidLocation
comment: Java API part implementing the android.location package for Android 2.3

AndroidLocationAPI
type: Class
subclass of: AndroidLocationAPI
comment: platform:comprisesInterfacePart some AndroidLocation
comment: JavaLibrary implementing the android.location package for Android 2.3

AndroidLocationClassLibrary
type: Class
subclass of: AndroidLocationClassLibrary
comment: platform:implementsInterface some AndroidLocationAPI
comment: JavaLibrary implementing the android.location package for Android 2.3

AndroidMedia
type: Class
subclass of: AndroidMedia
comment: Java API part implementing the android.media package for Android 2.3

AndroidMediaAPI
type: Class
subclass of: AndroidMediaAPI
comment: platform:comprisesInterfacePart some AndroidMedia
comment: JavaLibrary implementing the android.media package for Android 2.3

AndroidMediaAudiofx
type: Class
subclass of: JavaAPIPart
comment: Java API part implementing the android.media.audiofx package for Android 2.3

AndroidMediaAudiofxAPI
type: Class
subclass of: JavaAPI
comment: platform:comprisesInterfacePart some AndroidMediaAudiofx
comment: JavaLibrary implementing the android.media.audiofx package for Android 2.3

AndroidMediaAudiofxClassLibrary
type: Class
subclass of: JavaClassLibrary
comment: platform:implementsInterface some AndroidMediaAudiofxAPI
comment: JavaLibrary implementing the android.media.audiofx package for Android 2.3

AndroidMediaClassLibrary
type: Class
subclass of: AndroidMediaClassLibrary
comment: platform:implementsInterface some AndroidMediaAPI
comment: JavaLibrary implementing the android.media package for Android 2.3

AndroidNet
type: Class
subclass of: AndroidNet
comment: Java API part implementing the android.net package for Android 2.3

AndroidNetAPI
type: Class
subclass of: AndroidNetAPI
comment: platform:comprisesInterfacePart some AndroidNet
comment: JavaLibrary implementing the android.net package for Android 2.3

AndroidNetClassLibrary
type: Class
subclass of: AndroidNetClassLibrary
comment: platform:implementsInterface some AndroidNetAPI
comment: JavaLibrary implementing the android.net package for Android 2.3

AndroidNetHttp
type: Class
subclass of: JavaAPIPart
comment: Java API part implementing the android.net.http package for Android 2.3

AndroidNetHttpAPI
type: Class
subclass of: JavaAPI
comment: platform:comprisesInterfacePart some AndroidNetHttp
comment: JavaLibrary implementing the android.net.http package for Android 2.3

AndroidNetHttpClassLibrary
type: Class
subclass of: JavaClassLibrary
comment: platform:implementsInterface some AndroidNetHttpAPI
comment: JavaLibrary implementing the android.net.http package for Android 2.3

AndroidNetSip
type: Class
subclass of: JavaAPIPart
comment: Java API part implementing the android.net.sip package for Android 2.3

AndroidNetSipAPI
type: Class
subclass of: JavaAPI
comment: platform:comprisesInterfacePart some AndroidNetSip
comment: JavaLibrary implementing the android.net.sip package for Android 2.3

AndroidNetSipClassLibrary
type: Class
subclass of: JavaClassLibrary
comment: platform:implementsInterface some AndroidNetSipAPI
comment: JavaLibrary implementing the android.net.sip package for Android 2.3

AndroidNetWifi
type: Class
subclass of: AndroidNetWifi
comment: Java API part implementing the android.net.wifi package for Android 2.3

AndroidNetWifiAPI
type: Class
subclass of: AndroidNetWifiAPI
comment: platform:comprisesInterfacePart some AndroidNetWifi
comment: JavaLibrary implementing the android.net.wifi package for Android 2.3

AndroidNetWifiClassLibrary
type: Class
subclass of: AndroidNetWifiClassLibrary
comment: platform:implementsInterface some AndroidNetWifiAPI
comment: JavaLibrary implementing the android.net.wifi package for Android 2.3

AndroidNfc
type: Class
subclass of: JavaAPIPart
comment: Java API part implementing the android.nfc package for Android 2.3

AndroidNfcAPI
type: Class
subclass of: JavaAPI
comment: platform:comprisesInterfacePart some AndroidNfc
comment: JavaLibrary implementing the android.nfc package for Android 2.3

AndroidNfcClassLibrary
type: Class
subclass of: JavaClassLibrary
comment: platform:implementsInterface some AndroidNfcAPI
comment: JavaLibrary implementing the android.nfc package for Android 2.3

AndroidOpengl
type: Class
subclass of: AndroidOpengl
comment: Java API part implementing the android.opengl package for Android 2.3

AndroidOpenglAPI
type: Class
subclass of: AndroidOpenglAPI
comment: platform:comprisesInterfacePart some AndroidOpengl
comment: JavaLibrary implementing the android.opengl package for Android 2.3

AndroidOpenglClassLibrary
type: Class
subclass of: AndroidOpenglClassLibrary
comment: platform:implementsInterface some AndroidOpenglAPI
comment: JavaLibrary implementing the android.opengl package for Android 2.3

AndroidOs
type: Class
subclass of: AndroidOs
comment: Java API part implementing the android.os package for Android 2.3

AndroidOsAPI
type: Class
subclass of: AndroidOsAPI
comment: platform:comprisesInterfacePart some AndroidOs
comment: JavaLibrary implementing the android.os package for Android 2.3

AndroidOsClassLibrary
type: Class
subclass of: AndroidOsClassLibrary
comment: platform:implementsInterface some AndroidOsAPI
comment: JavaLibrary implementing the android.os package for Android 2.3

AndroidOsStorage
type: Class
subclass of: JavaAPIPart
comment: Java API part implementing the android.os.storage package for Android 2.3

AndroidOsStorageAPI
type: Class
subclass of: JavaAPI
comment: platform:comprisesInterfacePart some AndroidOsStorage
comment: JavaLibrary implementing the android.os.storage package for Android 2.3

AndroidOsStorageClassLibrary
type: Class
subclass of: JavaClassLibrary
comment: platform:implementsInterface some AndroidOsStorageAPI
comment: JavaLibrary implementing the android.os.storage package for Android 2.3

AndroidPreference
type: Class
subclass of: AndroidPreference
comment: Java API part implementing the android.preference package for Android 2.3

AndroidPreferenceAPI
type: Class
subclass of: AndroidPreferenceAPI
comment: platform:comprisesInterfacePart some AndroidPreference
comment: JavaLibrary implementing the android.preference package for Android 2.3

AndroidPreferenceClassLibrary
type: Class
subclass of: AndroidPreferenceClassLibrary
comment: platform:implementsInterface some AndroidPreferenceAPI
comment: JavaLibrary implementing the android.preference package for Android 2.3

AndroidProvider
type: Class
subclass of: AndroidProvider
comment: Java API part implementing the android.provider package for Android 2.3

AndroidProviderAPI
type: Class
subclass of: AndroidProviderAPI
comment: platform:comprisesInterfacePart some AndroidProvider
comment: JavaLibrary implementing the android.provider package for Android 2.3

AndroidProviderClassLibrary
type: Class
subclass of: AndroidProviderClassLibrary
comment: platform:implementsInterface some AndroidProviderAPI
comment: JavaLibrary implementing the android.provider package for Android 2.3

AndroidSax
type: Class
subclass of: JavaAPIPart
comment: Java API part implementing the android.sax package for Android 2.3

AndroidSaxAPI
type: Class
subclass of: JavaAPI
comment: platform:comprisesInterfacePart some AndroidSax
comment: JavaLibrary implementing the android.sax package for Android 2.3

AndroidSaxClassLibrary
type: Class
subclass of: JavaClassLibrary
comment: platform:implementsInterface some AndroidSaxAPI
comment: JavaLibrary implementing the android.sax package for Android 2.3

AndroidServiceWallpaper
type: Class
subclass of: AndroidServiceWallpaper
comment: Java API part implementing the android.service.wallpaper package for Android 2.3

AndroidServiceWallpaperAPI
type: Class
subclass of: AndroidServiceWallpaperAPI
comment: platform:comprisesInterfacePart some AndroidServiceWallpaper
comment: JavaLibrary implementing the android.service.wallpaper package for Android 2.3

AndroidServiceWallpaperClassLibrary
type: Class
subclass of: AndroidServiceWallpaperClassLibrary
comment: platform:implementsInterface some AndroidServiceWallpaperAPI
comment: JavaLibrary implementing the android.service.wallpaper package for Android 2.3

AndroidSpeech
type: Class
subclass of: AndroidSpeech
comment: Java API part implementing the android.speech package for Android 2.3

AndroidSpeechAPI
type: Class
subclass of: AndroidSpeechAPI
comment: platform:comprisesInterfacePart some AndroidSpeech
comment: JavaLibrary implementing the android.speech package for Android 2.3

AndroidSpeechClassLibrary
type: Class
subclass of: AndroidSpeechClassLibrary
comment: platform:implementsInterface some AndroidSpeechAPI
comment: JavaLibrary implementing the android.speech package for Android 2.3

AndroidSpeechTts
type: Class
subclass of: JavaAPIPart
comment: Java API part implementing the android.speech.tts package for Android 2.3

AndroidSpeechTtsAPI
type: Class
subclass of: JavaAPI
comment: platform:comprisesInterfacePart some AndroidSpeechTts
comment: JavaLibrary implementing the android.speech.tts package for Android 2.3

AndroidSpeechTtsClassLibrary
type: Class
subclass of: JavaClassLibrary
comment: platform:implementsInterface some AndroidSpeechTtsAPI
comment: JavaLibrary implementing the android.speech.tts package for Android 2.3

AndroidTelephony
type: Class
subclass of: AndroidTelephony
comment: Java API part implementing the android.telephony package for Android 2.3

AndroidTelephonyAPI
type: Class
subclass of: AndroidTelephonyAPI
comment: platform:comprisesInterfacePart some AndroidTelephony
comment: JavaLibrary implementing the android.telephony package for Android 2.3

AndroidTelephonyCdma
type: Class
subclass of: JavaAPIPart
comment: Java API part implementing the android.telephony.cdma package for Android 2.3

AndroidTelephonyCdmaAPI
type: Class
subclass of: JavaAPI
comment: platform:comprisesInterfacePart some AndroidTelephonyCdma
comment: JavaLibrary implementing the android.telephony.cdma package for Android 2.3

AndroidTelephonyCdmaClassLibrary
type: Class
subclass of: JavaClassLibrary
comment: platform:implementsInterface some AndroidTelephonyCdmaAPI
comment: JavaLibrary implementing the android.telephony.cdma package for Android 2.3

AndroidTelephonyClassLibrary
type: Class
subclass of: AndroidTelephonyClassLibrary
comment: platform:implementsInterface some AndroidTelephonyAPI
comment: JavaLibrary implementing the android.telephony package for Android 2.3

AndroidTelephonyGsm
type: Class
subclass of: AndroidTelephonyGsm
comment: Java API part implementing the android.telephony.gsm package for Android 2.3

AndroidTelephonyGsmAPI
type: Class
subclass of: AndroidTelephonyGsmAPI
comment: platform:comprisesInterfacePart some AndroidTelephonyGsm
comment: JavaLibrary implementing the android.telephony.gsm package for Android 2.3

AndroidTelephonyGsmClassLibrary
type: Class
subclass of: AndroidTelephonyGsmClassLibrary
comment: platform:implementsInterface some AndroidTelephonyGsmAPI
comment: JavaLibrary implementing the android.telephony.gsm package for Android 2.3

AndroidTest
type: Class
subclass of: AndroidTest
comment: Java API part implementing the android.test package for Android 2.3

AndroidTestAPI
type: Class
subclass of: AndroidTestAPI
comment: platform:comprisesInterfacePart some AndroidTest
comment: JavaLibrary implementing the android.test package for Android 2.3

AndroidTestClassLibrary
type: Class
subclass of: AndroidTestClassLibrary
comment: platform:implementsInterface some AndroidTestAPI
comment: JavaLibrary implementing the android.test package for Android 2.3

AndroidTestMock
type: Class
subclass of: AndroidTestMock
comment: Java API part implementing the android.test.mock package for Android 2.3

AndroidTestMockAPI
type: Class
subclass of: AndroidTestMockAPI
comment: platform:comprisesInterfacePart some AndroidTestMock
comment: JavaLibrary implementing the android.test.mock package for Android 2.3

AndroidTestMockClassLibrary
type: Class
subclass of: AndroidTestMockClassLibrary
comment: platform:implementsInterface some AndroidTestMockAPI
comment: JavaLibrary implementing the android.test.mock package for Android 2.3

AndroidTestSuitebuilder
type: Class
subclass of: JavaAPIPart
comment: Java API part implementing the android.test.suitebuilder package for Android 2.3

AndroidTestSuitebuilderAPI
type: Class
subclass of: JavaAPI
comment: platform:comprisesInterfacePart some AndroidTestSuitebuilder
comment: JavaLibrary implementing the android.test.suitebuilder package for Android 2.3

AndroidTestSuitebuilderAnnotation
type: Class
subclass of: JavaAPIPart
comment: Java API part implementing the android.test.suitebuilder.annotation package for Android 2.3

AndroidTestSuitebuilderAnnotationAPI
type: Class
subclass of: JavaAPI
comment: platform:comprisesInterfacePart some AndroidTestSuitebuilderAnnotation
comment: JavaLibrary implementing the android.test.suitebuilder.annotation package for Android 2.3

AndroidTestSuitebuilderAnnotationClassLibrary
type: Class
subclass of: JavaClassLibrary
comment: platform:implementsInterface some AndroidTestSuitebuilderAnnotationAPI
comment: JavaLibrary implementing the android.test.suitebuilder.annotation package for Android 2.3

AndroidTestSuitebuilderClassLibrary
type: Class
subclass of: JavaClassLibrary
comment: platform:implementsInterface some AndroidTestSuitebuilderAPI
comment: JavaLibrary implementing the android.test.suitebuilder package for Android 2.3

AndroidText
type: Class
subclass of: AndroidText
comment: Java API part implementing the android.text package for Android 2.3

AndroidTextAPI
type: Class
subclass of: AndroidTextAPI
comment: platform:comprisesInterfacePart some AndroidText
comment: JavaLibrary implementing the android.text package for Android 2.3

AndroidTextClassLibrary
type: Class
subclass of: AndroidTextClassLibrary
comment: platform:implementsInterface some AndroidTextAPI
comment: JavaLibrary implementing the android.text package for Android 2.3

AndroidTextFormat
type: Class
subclass of: AndroidTextFormat
comment: Java API part implementing the android.text.format package for Android 2.3

AndroidTextFormatAPI
type: Class
subclass of: AndroidTextFormatAPI
comment: platform:comprisesInterfacePart some AndroidTextFormat
comment: JavaLibrary implementing the android.text.format package for Android 2.3

AndroidTextFormatClassLibrary
type: Class
subclass of: AndroidTextFormatClassLibrary
comment: platform:implementsInterface some AndroidTextFormatAPI
comment: JavaLibrary implementing the android.text.format package for Android 2.3

AndroidTextMethod
type: Class
subclass of: AndroidTextMethod
comment: Java API part implementing the android.text.method package for Android 2.3

AndroidTextMethodAPI
type: Class
subclass of: AndroidTextMethodAPI
comment: platform:comprisesInterfacePart some AndroidTextMethod
comment: JavaLibrary implementing the android.text.method package for Android 2.3

AndroidTextMethodClassLibrary
type: Class
subclass of: AndroidTextMethodClassLibrary
comment: platform:implementsInterface some AndroidTextMethodAPI
comment: JavaLibrary implementing the android.text.method package for Android 2.3

AndroidTextStyle
type: Class
subclass of: JavaAPIPart
comment: Java API part implementing the android.text.style package for Android 2.3

AndroidTextStyleAPI
type: Class
subclass of: JavaAPI
comment: platform:comprisesInterfacePart some AndroidTextStyle
comment: JavaLibrary implementing the android.text.style package for Android 2.3

AndroidTextStyleClassLibrary
type: Class
subclass of: JavaClassLibrary
comment: platform:implementsInterface some AndroidTextStyleAPI
comment: JavaLibrary implementing the android.text.style package for Android 2.3

AndroidTextUtil
type: Class
subclass of: JavaAPIPart
comment: Java API part implementing the android.text.util package for Android 2.3

AndroidTextUtilAPI
type: Class
subclass of: JavaAPI
comment: platform:comprisesInterfacePart some AndroidTextUtil
comment: JavaLibrary implementing the android.text.util package for Android 2.3

AndroidTextUtilClassLibrary
type: Class
subclass of: JavaClassLibrary
comment: platform:implementsInterface some AndroidTextUtilAPI
comment: JavaLibrary implementing the android.text.util package for Android 2.3

AndroidUtil
type: Class
subclass of: AndroidUtil
comment: Java API part implementing the android.util package for Android 2.3

AndroidUtilAPI
type: Class
subclass of: AndroidUtilAPI
comment: platform:comprisesInterfacePart some AndroidUtil
comment: JavaLibrary implementing the android.util package for Android 2.3

AndroidUtilClassLibrary
type: Class
subclass of: AndroidUtilClassLibrary
comment: platform:implementsInterface some AndroidUtilAPI
comment: JavaLibrary implementing the android.util package for Android 2.3

AndroidView
type: Class
subclass of: JavaAPIPart
comment: Java API part implementing the android.view package for Android 2.3

AndroidViewAPI
type: Class
subclass of: JavaAPI
comment: platform:comprisesInterfacePart some AndroidView
comment: JavaLibrary implementing the android.view package for Android 2.3

AndroidViewAccessibility
type: Class
subclass of: JavaAPIPart
comment: Java API part implementing the android.view.accessibility package for Android 2.3

AndroidViewAccessibilityAPI
type: Class
subclass of: JavaAPI
comment: platform:comprisesInterfacePart some AndroidViewAccessibility
comment: JavaLibrary implementing the android.view.accessibility package for Android 2.3

AndroidViewAccessibilityClassLibrary
type: Class
subclass of: JavaClassLibrary
comment: platform:implementsInterface some AndroidViewAccessibilityAPI
comment: JavaLibrary implementing the android.view.accessibility package for Android 2.3

AndroidViewAnimation
type: Class
subclass of: JavaAPIPart
comment: Java API part implementing the android.view.animation package for Android 2.3

AndroidViewAnimationAPI
type: Class
subclass of: JavaAPI
comment: platform:comprisesInterfacePart some AndroidViewAnimation
comment: JavaLibrary implementing the android.view.animation package for Android 2.3

AndroidViewAnimationClassLibrary
type: Class
subclass of: JavaClassLibrary
comment: platform:implementsInterface some AndroidViewAnimationAPI
comment: JavaLibrary implementing the android.view.animation package for Android 2.3

AndroidViewClassLibrary
type: Class
subclass of: JavaClassLibrary
comment: platform:implementsInterface some AndroidViewAPI
comment: JavaLibrary implementing the android.view package for Android 2.3

AndroidViewInputmethod
type: Class
subclass of: AndroidViewInputmethod
comment: Java API part implementing the android.view.inputmethod package for Android 2.3

AndroidViewInputmethodAPI
type: Class
subclass of: AndroidViewInputmethodAPI
comment: platform:comprisesInterfacePart some AndroidViewInputmethod
comment: JavaLibrary implementing the android.view.inputmethod package for Android 2.3

AndroidViewInputmethodClassLibrary
type: Class
subclass of: AndroidViewInputmethodClassLibrary
comment: platform:implementsInterface some AndroidViewInputmethodAPI
comment: JavaLibrary implementing the android.view.inputmethod package for Android 2.3

AndroidWebkit
type: Class
subclass of: AndroidWebkit
comment: Java API part implementing the android.webkit package for Android 2.3

AndroidWebkitAPI
type: Class
subclass of: AndroidWebkitAPI
comment: platform:comprisesInterfacePart some AndroidWebkit
comment: JavaLibrary implementing the android.webkit package for Android 2.3

AndroidWebkitClassLibrary
type: Class
subclass of: AndroidWebkitClassLibrary
comment: platform:implementsInterface some AndroidWebkitAPI
comment: JavaLibrary implementing the android.webkit package for Android 2.3

AndroidWidget
type: Class
subclass of: AndroidWidget
comment: Java API part implementing the android.widget package for Android 2.3

AndroidWidgetAPI
type: Class
subclass of: AndroidWidgetAPI
comment: platform:comprisesInterfacePart some AndroidWidget
comment: JavaLibrary implementing the android.widget package for Android 2.3

AndroidWidgetClassLibrary
type: Class
subclass of: AndroidWidgetClassLibrary
comment: platform:implementsInterface some AndroidWidgetAPI
comment: JavaLibrary implementing the android.widget package for Android 2.3

DalvikAnnotation
type: Class
subclass of: JavaAPIPart
comment: Java API part implementing the dalvik.annotation package for Android 2.3

DalvikAnnotationAPI
type: Class
subclass of: JavaAPI
comment: platform:comprisesInterfacePart some DalvikAnnotation
comment: JavaLibrary implementing the dalvik.annotation package for Android 2.3

DalvikAnnotationClassLibrary
type: Class
subclass of: JavaClassLibrary
comment: platform:implementsInterface some DalvikAnnotationAPI
comment: JavaLibrary implementing the dalvik.annotation package for Android 2.3

DalvikBytecode
type: Class
subclass of: DalvikBytecode
comment: Java API part implementing the dalvik.bytecode package for Android 2.3

DalvikBytecodeAPI
type: Class
subclass of: DalvikBytecodeAPI
comment: platform:comprisesInterfacePart some DalvikBytecode
comment: JavaLibrary implementing the dalvik.bytecode package for Android 2.3

DalvikBytecodeClassLibrary
type: Class
subclass of: DalvikBytecodeClassLibrary
comment: platform:implementsInterface some DalvikBytecodeAPI
comment: JavaLibrary implementing the dalvik.bytecode package for Android 2.3

DalvikSystem
type: Class
subclass of: JavaAPIPart
comment: Java API part implementing the dalvik.system package for Android 2.3

DalvikSystemAPI
type: Class
subclass of: JavaAPI
comment: platform:comprisesInterfacePart some DalvikSystem
comment: JavaLibrary implementing the dalvik.system package for Android 2.3

DalvikSystemClassLibrary
type: Class
subclass of: JavaClassLibrary
comment: platform:implementsInterface some DalvikSystemAPI
comment: JavaLibrary implementing the dalvik.system package for Android 2.3

JavaAwtFont
type: Class
subclass of: JavaAwtFont
comment: Java API part implementing the java.awt.font package for Android 2.3

JavaAwtFontAPI
type: Class
subclass of: JavaAwtFontAPI
comment: platform:comprisesInterfacePart some JavaAwtFont
comment: JavaLibrary implementing the java.awt.font package for Android 2.3

JavaAwtFontClassLibrary
type: Class
subclass of: JavaAwtFontClassLibrary
comment: platform:implementsInterface some JavaAwtFontAPI
comment: JavaLibrary implementing the java.awt.font package for Android 2.3

JavaBeans
type: Class
subclass of: JavaAPIPart
comment: Java API part implementing the java.beans package for Android 2.3

JavaBeansAPI
type: Class
subclass of: JavaAPI
comment: platform:comprisesInterfacePart some JavaBeans
comment: JavaLibrary implementing the java.beans package for Android 2.3

JavaBeansClassLibrary
type: Class
subclass of: JavaClassLibrary
comment: platform:implementsInterface some JavaBeansAPI
comment: JavaLibrary implementing the java.beans package for Android 2.3

JavaIo
type: Class
equivalent class: JavaIo
subclass of: JavaIo
comment: Java API part implementing the java.io package for Android 2.3

JavaIoAPI
type: Class
equivalent class: JavaIoAPI
subclass of: JavaIoAPI
comment: platform:comprisesInterfacePart some JavaIo
comment: JavaLibrary implementing the java.io package for Android 2.3

JavaIoClassLibrary
type: Class
equivalent class: JavaIoClassLibrary
subclass of: JavaIoClassLibrary
comment: platform:implementsInterface some JavaIoAPI
comment: JavaLibrary implementing the java.io package for Android 2.3

JavaLang
type: Class
subclass of: JavaAPIPart
comment: Java API part implementing the java.lang package for Android 2.3

JavaLangAPI
type: Class
subclass of: JavaAPI
comment: platform:comprisesInterfacePart some JavaLang
comment: JavaLibrary implementing the java.lang package for Android 2.3

JavaLangAnnotation
type: Class
equivalent class: JavaLangAnnotation
subclass of: JavaLangAnnotation
comment: Java API part implementing the java.lang.annotation package for Android 2.3

JavaLangAnnotationAPI
type: Class
equivalent class: JavaLangAnnotationAPI
subclass of: JavaLangAnnotationAPI
comment: platform:comprisesInterfacePart some JavaLangAnnotation
comment: JavaLibrary implementing the java.lang.annotation package for Android 2.3

JavaLangAnnotationClassLibrary
type: Class
equivalent class: JavaLangAnnotationClassLibrary
subclass of: JavaLangAnnotationClassLibrary
comment: platform:implementsInterface some JavaLangAnnotationAPI
comment: JavaLibrary implementing the java.lang.annotation package for Android 2.3

JavaLangClassLibrary
type: Class
subclass of: JavaClassLibrary
comment: platform:implementsInterface some JavaLangAPI
comment: JavaLibrary implementing the java.lang package for Android 2.3

JavaLangRef
type: Class
equivalent class: JavaLangRef
subclass of: JavaAPIPart
comment: Java API part implementing the java.lang.ref package for Android 2.3

JavaLangRefAPI
type: Class
equivalent class: JavaLangRefAPI
subclass of: JavaAPI
comment: platform:comprisesInterfacePart some JavaLangRef
comment: JavaLibrary implementing the java.lang.ref package for Android 2.3

JavaLangRefClassLibrary
type: Class
equivalent class: JavaLangRefClassLibrary
subclass of: JavaClassLibrary
comment: platform:implementsInterface some JavaLangRefAPI
comment: JavaLibrary implementing the java.lang.ref package for Android 2.3

JavaLangReflect
type: Class
equivalent class: JavaLangReflect
subclass of: JavaAPIPart
comment: Java API part implementing the java.lang.reflect package for Android 2.3

JavaLangReflectAPI
type: Class
equivalent class: JavaLangReflectAPI
subclass of: JavaAPI
comment: platform:comprisesInterfacePart some JavaLangReflect
comment: JavaLibrary implementing the java.lang.reflect package for Android 2.3

JavaLangReflectClassLibrary
type: Class
equivalent class: JavaLangReflectClassLibrary
subclass of: JavaClassLibrary
comment: platform:implementsInterface some JavaLangReflectAPI
comment: JavaLibrary implementing the java.lang.reflect package for Android 2.3

JavaMath
type: Class
equivalent class: JavaMath
subclass of: JavaMath
comment: Java API part implementing the java.math package for Android 2.3

JavaMathAPI
type: Class
equivalent class: JavaMathAPI
subclass of: JavaMathAPI
comment: platform:comprisesInterfacePart some JavaMath
comment: JavaLibrary implementing the java.math package for Android 2.3

JavaMathClassLibrary
type: Class
equivalent class: JavaMathClassLibrary
subclass of: JavaMathClassLibrary
comment: platform:implementsInterface some JavaMathAPI
comment: JavaLibrary implementing the java.math package for Android 2.3

JavaNet
type: Class
equivalent class: JavaNet
subclass of: JavaNet
comment: Java API part implementing the java.net package for Android 2.3

JavaNetAPI
type: Class
equivalent class: JavaNetAPI
subclass of: JavaNetAPI
comment: platform:comprisesInterfacePart some JavaNet
comment: JavaLibrary implementing the java.net package for Android 2.3

JavaNetClassLibrary
type: Class
equivalent class: JavaNetClassLibrary
subclass of: JavaNetClassLibrary
comment: platform:implementsInterface some JavaNetAPI
comment: JavaLibrary implementing the java.net package for Android 2.3

JavaNio
type: Class
equivalent class: JavaNio
subclass of: JavaNio
comment: Java API part implementing the java.nio package for Android 2.3

JavaNioAPI
type: Class
equivalent class: JavaNioAPI
subclass of: JavaNioAPI
comment: platform:comprisesInterfacePart some JavaNio
comment: JavaLibrary implementing the java.nio package for Android 2.3

JavaNioChannels
type: Class
equivalent class: JavaNioChannels
subclass of: JavaAPIPart
comment: Java API part implementing the java.nio.channels package for Android 2.3

JavaNioChannelsAPI
type: Class
equivalent class: JavaNioChannelsAPI
subclass of: JavaAPI
comment: platform:comprisesInterfacePart some JavaNioChannels
comment: JavaLibrary implementing the java.nio.channels package for Android 2.3

JavaNioChannelsClassLibrary
type: Class
equivalent class: JavaNioChannelsClassLibrary
subclass of: JavaClassLibrary
comment: platform:implementsInterface some JavaNioChannelsAPI
comment: JavaLibrary implementing the java.nio.channels package for Android 2.3

JavaNioChannelsSpi
type: Class
equivalent class: JavaNioChannelsSpi
subclass of: JavaAPIPart
comment: Java API part implementing the java.nio.channels.spi package for Android 2.3

JavaNioChannelsSpiAPI
type: Class
equivalent class: JavaNioChannelsSpiAPI
subclass of: JavaAPI
comment: platform:comprisesInterfacePart some JavaNioChannelsSpi
comment: JavaLibrary implementing the java.nio.channels.spi package for Android 2.3

JavaNioChannelsSpiClassLibrary
type: Class
equivalent class: JavaNioChannelsSpiClassLibrary
subclass of: JavaClassLibrary
comment: platform:implementsInterface some JavaNioChannelsSpiAPI
comment: JavaLibrary implementing the java.nio.channels.spi package for Android 2.3

JavaNioCharset
type: Class
equivalent class: JavaNioCharset
subclass of: JavaAPIPart
comment: Java API part implementing the java.nio.charset package for Android 2.3

JavaNioCharsetAPI
type: Class
equivalent class: JavaNioCharsetAPI
subclass of: JavaAPI
comment: platform:comprisesInterfacePart some JavaNioCharset
comment: JavaLibrary implementing the java.nio.charset package for Android 2.3

JavaNioCharsetClassLibrary
type: Class
equivalent class: JavaNioCharsetClassLibrary
subclass of: JavaClassLibrary
comment: platform:implementsInterface some JavaNioCharsetAPI
comment: JavaLibrary implementing the java.nio.charset package for Android 2.3

JavaNioCharsetSpi
type: Class
equivalent class: JavaNioCharsetSpi
subclass of: JavaAPIPart
comment: Java API part implementing the java.nio.charset.spi package for Android 2.3

JavaNioCharsetSpiAPI
type: Class
equivalent class: JavaNioCharsetSpiAPI
subclass of: JavaAPI
comment: platform:comprisesInterfacePart some JavaNioCharsetSpi
comment: JavaLibrary implementing the java.nio.charset.spi package for Android 2.3

JavaNioCharsetSpiClassLibrary
type: Class
equivalent class: JavaNioCharsetSpiClassLibrary
subclass of: JavaClassLibrary
comment: platform:implementsInterface some JavaNioCharsetSpiAPI
comment: JavaLibrary implementing the java.nio.charset.spi package for Android 2.3

JavaNioClassLibrary
type: Class
equivalent class: JavaNioClassLibrary
subclass of: JavaNioClassLibrary
comment: platform:implementsInterface some JavaNioAPI
comment: JavaLibrary implementing the java.nio package for Android 2.3

JavaSecurity
type: Class
subclass of: JavaSecurity
comment: Java API part implementing the java.security package for Android 2.3

JavaSecurityAPI
type: Class
subclass of: JavaSecurityAPI
comment: platform:comprisesInterfacePart some JavaSecurity
comment: JavaLibrary implementing the java.security package for Android 2.3

JavaSecurityAcl
type: Class
equivalent class: JavaSecurityAcl
subclass of: JavaAPIPart
comment: Java API part implementing the java.security.acl package for Android 2.3

JavaSecurityAclAPI
type: Class
equivalent class: JavaSecurityAclAPI
subclass of: JavaAPI
comment: platform:comprisesInterfacePart some JavaSecurityAcl
comment: JavaLibrary implementing the java.security.acl package for Android 2.3

JavaSecurityAclClassLibrary
type: Class
equivalent class: JavaSecurityAclClassLibrary
subclass of: JavaClassLibrary
comment: platform:implementsInterface some JavaSecurityAclAPI
comment: JavaLibrary implementing the java.security.acl package for Android 2.3

JavaSecurityCert
type: Class
equivalent class: JavaSecurityCert
subclass of: JavaAPIPart
comment: Java API part implementing the java.security.cert package for Android 2.3

JavaSecurityCertAPI
type: Class
equivalent class: JavaSecurityCertAPI
subclass of: JavaAPI
comment: platform:comprisesInterfacePart some JavaSecurityCert
comment: JavaLibrary implementing the java.security.cert package for Android 2.3

JavaSecurityCertClassLibrary
type: Class
equivalent class: JavaSecurityCertClassLibrary
subclass of: JavaClassLibrary
comment: platform:implementsInterface some JavaSecurityCertAPI
comment: JavaLibrary implementing the java.security.cert package for Android 2.3

JavaSecurityClassLibrary
type: Class
subclass of: JavaSecurityClassLibrary
comment: platform:implementsInterface some JavaSecurityAPI
comment: JavaLibrary implementing the java.security package for Android 2.3

JavaSecurityInterfaces
type: Class
equivalent class: JavaSecurityInterfaces
subclass of: JavaAPIPart
comment: Java API part implementing the java.security.interfaces package for Android 2.3

JavaSecurityInterfacesAPI
type: Class
equivalent class: JavaSecurityInterfacesAPI
subclass of: JavaAPI
comment: platform:comprisesInterfacePart some JavaSecurityInterfaces
comment: JavaLibrary implementing the java.security.interfaces package for Android 2.3

JavaSecurityInterfacesClassLibrary
type: Class
equivalent class: JavaSecurityInterfacesClassLibrary
subclass of: JavaClassLibrary
comment: platform:implementsInterface some JavaSecurityInterfacesAPI
comment: JavaLibrary implementing the java.security.interfaces package for Android 2.3

JavaSecuritySpec
type: Class
equivalent class: JavaSecuritySpec
subclass of: JavaAPIPart
comment: Java API part implementing the java.security.spec package for Android 2.3

JavaSecuritySpecAPI
type: Class
equivalent class: JavaSecuritySpecAPI
subclass of: JavaAPI
comment: platform:comprisesInterfacePart some JavaSecuritySpec
comment: JavaLibrary implementing the java.security.spec package for Android 2.3

JavaSecuritySpecClassLibrary
type: Class
equivalent class: JavaSecuritySpecClassLibrary
subclass of: JavaClassLibrary
comment: platform:implementsInterface some JavaSecuritySpecAPI
comment: JavaLibrary implementing the java.security.spec package for Android 2.3

JavaSql
type: Class
equivalent class: JavaSql
subclass of: JavaSql
comment: Java API part implementing the java.sql package for Android 2.3

JavaSqlAPI
type: Class
equivalent class: JavaSqlAPI
subclass of: JavaSqlAPI
comment: platform:comprisesInterfacePart some JavaSql
comment: JavaLibrary implementing the java.sql package for Android 2.3

JavaSqlClassLibrary
type: Class
equivalent class: JavaSqlClassLibrary
subclass of: JavaSqlClassLibrary
comment: platform:implementsInterface some JavaSqlAPI
comment: JavaLibrary implementing the java.sql package for Android 2.3

JavaText
type: Class
subclass of: JavaText
comment: Java API part implementing the java.text package for Android 2.3

JavaTextAPI
type: Class
subclass of: JavaTextAPI
comment: platform:comprisesInterfacePart some JavaText
comment: JavaLibrary implementing the java.text package for Android 2.3

JavaTextClassLibrary
type: Class
subclass of: JavaTextClassLibrary
comment: platform:implementsInterface some JavaTextAPI
comment: JavaLibrary implementing the java.text package for Android 2.3

JavaUtil
type: Class
equivalent class: JavaUtil
subclass of: JavaUtil
comment: Java API part implementing the java.util package for Android 2.3

JavaUtilAPI
type: Class
equivalent class: JavaUtilAPI
subclass of: JavaUtilAPI
comment: platform:comprisesInterfacePart some JavaUtil
comment: JavaLibrary implementing the java.util package for Android 2.3

JavaUtilClassLibrary
type: Class
equivalent class: JavaUtilClassLibrary
subclass of: JavaUtilClassLibrary
comment: platform:implementsInterface some JavaUtilAPI
comment: JavaLibrary implementing the java.util package for Android 2.3

JavaUtilConcurrent
type: Class
subclass of: JavaUtilConcurrent
comment: Java API part implementing the java.util.concurrent package for Android 2.3

JavaUtilConcurrentAPI
type: Class
subclass of: JavaUtilConcurrentAPI
comment: platform:comprisesInterfacePart some JavaUtilConcurrent
comment: JavaLibrary implementing the java.util.concurrent package for Android 2.3

JavaUtilConcurrentAtomic
type: Class
equivalent class: JavaUtilConcurrentAtomic
subclass of: JavaUtilConcurrentAtomic
comment: Java API part implementing the java.util.concurrent.atomic package for Android 2.3

JavaUtilConcurrentAtomicAPI
type: Class
equivalent class: JavaUtilConcurrentAtomicAPI
subclass of: JavaUtilConcurrentAtomicAPI
comment: platform:comprisesInterfacePart some JavaUtilConcurrentAtomic
comment: JavaLibrary implementing the java.util.concurrent.atomic package for Android 2.3

JavaUtilConcurrentAtomicClassLibrary
type: Class
equivalent class: JavaUtilConcurrentAtomicClassLibrary
subclass of: JavaUtilConcurrentAtomicClassLibrary
comment: platform:implementsInterface some JavaUtilConcurrentAtomicAPI
comment: JavaLibrary implementing the java.util.concurrent.atomic package for Android 2.3

JavaUtilConcurrentClassLibrary
type: Class
subclass of: JavaUtilConcurrentClassLibrary
comment: platform:implementsInterface some JavaUtilConcurrentAPI
comment: JavaLibrary implementing the java.util.concurrent package for Android 2.3

JavaUtilConcurrentLocks
type: Class
equivalent class: JavaUtilConcurrentLocks
subclass of: JavaUtilConcurrentLocks
comment: Java API part implementing the java.util.concurrent.locks package for Android 2.3

JavaUtilConcurrentLocksAPI
type: Class
equivalent class: JavaUtilConcurrentLocksAPI
subclass of: JavaUtilConcurrentLocksAPI
comment: platform:comprisesInterfacePart some JavaUtilConcurrentLocks
comment: JavaLibrary implementing the java.util.concurrent.locks package for Android 2.3

JavaUtilConcurrentLocksClassLibrary
type: Class
equivalent class: JavaUtilConcurrentLocksClassLibrary
subclass of: JavaUtilConcurrentLocksClassLibrary
comment: platform:implementsInterface some JavaUtilConcurrentLocksAPI
comment: JavaLibrary implementing the java.util.concurrent.locks package for Android 2.3

JavaUtilJar
type: Class
equivalent class: JavaUtilJar
subclass of: JavaAPIPart
comment: Java API part implementing the java.util.jar package for Android 2.3

JavaUtilJarAPI
type: Class
equivalent class: JavaUtilJarAPI
subclass of: JavaAPI
comment: platform:comprisesInterfacePart some JavaUtilJar
comment: JavaLibrary implementing the java.util.jar package for Android 2.3

JavaUtilJarClassLibrary
type: Class
equivalent class: JavaUtilJarClassLibrary
subclass of: JavaClassLibrary
comment: platform:implementsInterface some JavaUtilJarAPI
comment: JavaLibrary implementing the java.util.jar package for Android 2.3

JavaUtilLogging
type: Class
equivalent class: JavaUtilLogging
subclass of: JavaUtilLogging
comment: Java API part implementing the java.util.logging package for Android 2.3

JavaUtilLoggingAPI
type: Class
equivalent class: JavaUtilLoggingAPI
subclass of: JavaUtilLoggingAPI
comment: platform:comprisesInterfacePart some JavaUtilLogging
comment: JavaLibrary implementing the java.util.logging package for Android 2.3

JavaUtilLoggingClassLibrary
type: Class
equivalent class: JavaUtilLoggingClassLibrary
subclass of: JavaUtilLoggingClassLibrary
comment: platform:implementsInterface some JavaUtilLoggingAPI
comment: JavaLibrary implementing the java.util.logging package for Android 2.3

JavaUtilPrefs
type: Class
equivalent class: JavaUtilPrefs
subclass of: JavaAPIPart
comment: Java API part implementing the java.util.prefs package for Android 2.3

JavaUtilPrefsAPI
type: Class
equivalent class: JavaUtilPrefsAPI
subclass of: JavaAPI
comment: platform:comprisesInterfacePart some JavaUtilPrefs
comment: JavaLibrary implementing the java.util.prefs package for Android 2.3

JavaUtilPrefsClassLibrary
type: Class
equivalent class: JavaUtilPrefsClassLibrary
subclass of: JavaClassLibrary
comment: platform:implementsInterface some JavaUtilPrefsAPI
comment: JavaLibrary implementing the java.util.prefs package for Android 2.3

JavaUtilRegex
type: Class
equivalent class: JavaUtilRegex
subclass of: JavaAPIPart
comment: Java API part implementing the java.util.regex package for Android 2.3

JavaUtilRegexAPI
type: Class
equivalent class: JavaUtilRegexAPI
subclass of: JavaAPI
comment: platform:comprisesInterfacePart some JavaUtilRegex
comment: JavaLibrary implementing the java.util.regex package for Android 2.3

JavaUtilRegexClassLibrary
type: Class
equivalent class: JavaUtilRegexClassLibrary
subclass of: JavaClassLibrary
comment: platform:implementsInterface some JavaUtilRegexAPI
comment: JavaLibrary implementing the java.util.regex package for Android 2.3

JavaUtilZip
type: Class
equivalent class: JavaUtilZip
subclass of: JavaUtilZip
comment: Java API part implementing the java.util.zip package for Android 2.3

JavaUtilZipAPI
type: Class
equivalent class: JavaUtilZipAPI
subclass of: JavaUtilZipAPI
comment: platform:comprisesInterfacePart some JavaUtilZip
comment: JavaLibrary implementing the java.util.zip package for Android 2.3

JavaUtilZipClassLibrary
type: Class
equivalent class: JavaUtilZipClassLibrary
subclass of: JavaUtilZipClassLibrary
comment: platform:implementsInterface some JavaUtilZipAPI
comment: JavaLibrary implementing the java.util.zip package for Android 2.3

JavaxCrypto
type: Class
equivalent class: JavaxCrypto
subclass of: JavaAPIPart
comment: Java API part implementing the javax.crypto package for Android 2.3

JavaxCryptoAPI
type: Class
equivalent class: JavaxCryptoAPI
subclass of: JavaAPI
comment: platform:comprisesInterfacePart some JavaxCrypto
comment: JavaLibrary implementing the javax.crypto package for Android 2.3

JavaxCryptoClassLibrary
type: Class
equivalent class: JavaxCryptoClassLibrary
subclass of: JavaClassLibrary
comment: platform:implementsInterface some JavaxCryptoAPI
comment: JavaLibrary implementing the javax.crypto package for Android 2.3

JavaxCryptoInterfaces
type: Class
equivalent class: JavaxCryptoInterfaces
subclass of: JavaAPIPart
comment: Java API part implementing the javax.crypto.interfaces package for Android 2.3

JavaxCryptoInterfacesAPI
type: Class
equivalent class: JavaxCryptoInterfacesAPI
subclass of: JavaAPI
comment: platform:comprisesInterfacePart some JavaxCryptoInterfaces
comment: JavaLibrary implementing the javax.crypto.interfaces package for Android 2.3

JavaxCryptoInterfacesClassLibrary
type: Class
equivalent class: JavaxCryptoInterfacesClassLibrary
subclass of: JavaClassLibrary
comment: platform:implementsInterface some JavaxCryptoInterfacesAPI
comment: JavaLibrary implementing the javax.crypto.interfaces package for Android 2.3

JavaxCryptoSpec
type: Class
equivalent class: JavaxCryptoSpec
subclass of: JavaAPIPart
comment: Java API part implementing the javax.crypto.spec package for Android 2.3

JavaxCryptoSpecAPI
type: Class
equivalent class: JavaxCryptoSpecAPI
subclass of: JavaAPI
comment: platform:comprisesInterfacePart some JavaxCryptoSpec
comment: JavaLibrary implementing the javax.crypto.spec package for Android 2.3

JavaxCryptoSpecClassLibrary
type: Class
equivalent class: JavaxCryptoSpecClassLibrary
subclass of: JavaClassLibrary
comment: platform:implementsInterface some JavaxCryptoSpecAPI
comment: JavaLibrary implementing the javax.crypto.spec package for Android 2.3

JavaxMicroeditionKhronosEgl
type: Class
subclass of: JavaAPIPart
comment: Java API part implementing the javax.microedition.khronos.egl package for Android 2.3

JavaxMicroeditionKhronosEglAPI
type: Class
subclass of: JavaAPI
comment: platform:comprisesInterfacePart some JavaxMicroeditionKhronosEgl
comment: JavaLibrary implementing the javax.microedition.khronos.egl package for Android 2.3

JavaxMicroeditionKhronosEglClassLibrary
type: Class
subclass of: JavaClassLibrary
comment: platform:implementsInterface some JavaxMicroeditionKhronosEglAPI
comment: JavaLibrary implementing the javax.microedition.khronos.egl package for Android 2.3

JavaxMicroeditionKhronosOpengles
type: Class
subclass of: JavaAPIPart
comment: Java API part implementing the javax.microedition.khronos.opengles package for Android 2.3

JavaxMicroeditionKhronosOpenglesAPI
type: Class
subclass of: JavaAPI
comment: platform:comprisesInterfacePart some JavaxMicroeditionKhronosOpengles
comment: JavaLibrary implementing the javax.microedition.khronos.opengles package for Android 2.3

JavaxMicroeditionKhronosOpenglesClassLibrary
type: Class
subclass of: JavaClassLibrary
comment: platform:implementsInterface some JavaxMicroeditionKhronosOpenglesAPI
comment: JavaLibrary implementing the javax.microedition.khronos.opengles package for Android 2.3

JavaxNet
type: Class
equivalent class: JavaxNet
subclass of: JavaAPIPart
comment: Java API part implementing the javax.net package for Android 2.3

JavaxNetAPI
type: Class
equivalent class: JavaxNetAPI
subclass of: JavaAPI
comment: platform:comprisesInterfacePart some JavaxNet
comment: JavaLibrary implementing the javax.net package for Android 2.3

JavaxNetClassLibrary
type: Class
equivalent class: JavaxNetClassLibrary
subclass of: JavaClassLibrary
comment: platform:implementsInterface some JavaxNetAPI
comment: JavaLibrary implementing the javax.net package for Android 2.3

JavaxNetSsl
type: Class
equivalent class: JavaxNetSsl
subclass of: JavaxNetSsl
comment: Java API part implementing the javax.net.ssl package for Android 2.3

JavaxNetSslAPI
type: Class
equivalent class: JavaxNetSslAPI
subclass of: JavaxNetSslAPI
comment: platform:comprisesInterfacePart some JavaxNetSsl
comment: JavaLibrary implementing the javax.net.ssl package for Android 2.3

JavaxNetSslClassLibrary
type: Class
equivalent class: JavaxNetSslClassLibrary
subclass of: JavaxNetSslClassLibrary
comment: platform:implementsInterface some JavaxNetSslAPI
comment: JavaLibrary implementing the javax.net.ssl package for Android 2.3

JavaxSecurityAuth
type: Class
subclass of: JavaAPIPart
comment: Java API part implementing the javax.security.auth package for Android 2.3

JavaxSecurityAuthAPI
type: Class
subclass of: JavaAPI
comment: platform:comprisesInterfacePart some JavaxSecurityAuth
comment: JavaLibrary implementing the javax.security.auth package for Android 2.3

JavaxSecurityAuthCallback
type: Class
subclass of: JavaAPIPart
comment: Java API part implementing the javax.security.auth.callback package for Android 2.3

JavaxSecurityAuthCallbackAPI
type: Class
subclass of: JavaAPI
comment: platform:comprisesInterfacePart some JavaxSecurityAuthCallback
comment: JavaLibrary implementing the javax.security.auth.callback package for Android 2.3

JavaxSecurityAuthCallbackClassLibrary
type: Class
subclass of: JavaClassLibrary
comment: platform:implementsInterface some JavaxSecurityAuthCallbackAPI
comment: JavaLibrary implementing the javax.security.auth.callback package for Android 2.3

JavaxSecurityAuthClassLibrary
type: Class
subclass of: JavaClassLibrary
comment: platform:implementsInterface some JavaxSecurityAuthAPI
comment: JavaLibrary implementing the javax.security.auth package for Android 2.3

JavaxSecurityAuthLogin
type: Class
subclass of: JavaAPIPart
comment: Java API part implementing the javax.security.auth.login package for Android 2.3

JavaxSecurityAuthLoginAPI
type: Class
subclass of: JavaAPI
comment: platform:comprisesInterfacePart some JavaxSecurityAuthLogin
comment: JavaLibrary implementing the javax.security.auth.login package for Android 2.3

JavaxSecurityAuthLoginClassLibrary
type: Class
subclass of: JavaClassLibrary
comment: platform:implementsInterface some JavaxSecurityAuthLoginAPI
comment: JavaLibrary implementing the javax.security.auth.login package for Android 2.3

JavaxSecurityAuthX500
type: Class
subclass of: JavaxSecurityAuthX500
comment: Java API part implementing the javax.security.auth.x500 package for Android 2.3

JavaxSecurityAuthX500API
type: Class
subclass of: JavaxSecurityAuthX500API
comment: platform:comprisesInterfacePart some JavaxSecurityAuthX500
comment: JavaLibrary implementing the javax.security.auth.x500 package for Android 2.3

JavaxSecurityAuthX500ClassLibrary
type: Class
subclass of: JavaxSecurityAuthX500ClassLibrary
comment: platform:implementsInterface some JavaxSecurityAuthX500API
comment: JavaLibrary implementing the javax.security.auth.x500 package for Android 2.3

JavaxSecurityCert
type: Class
equivalent class: JavaxSecurityCert
subclass of: JavaAPIPart
comment: Java API part implementing the javax.security.cert package for Android 2.3

JavaxSecurityCertAPI
type: Class
equivalent class: JavaxSecurityCertAPI
subclass of: JavaAPI
comment: platform:comprisesInterfacePart some JavaxSecurityCert
comment: JavaLibrary implementing the javax.security.cert package for Android 2.3

JavaxSecurityCertClassLibrary
type: Class
equivalent class: JavaxSecurityCertClassLibrary
subclass of: JavaClassLibrary
comment: platform:implementsInterface some JavaxSecurityCertAPI
comment: JavaLibrary implementing the javax.security.cert package for Android 2.3

JavaxSql
type: Class
subclass of: JavaxSql
comment: Java API part implementing the javax.sql package for Android 2.3

JavaxSqlAPI
type: Class
subclass of: JavaxSqlAPI
comment: platform:comprisesInterfacePart some JavaxSql
comment: JavaLibrary implementing the javax.sql package for Android 2.3

JavaxSqlClassLibrary
type: Class
subclass of: JavaxSqlClassLibrary
comment: platform:implementsInterface some JavaxSqlAPI
comment: JavaLibrary implementing the javax.sql package for Android 2.3

JavaxXml
type: Class
equivalent class: JavaxXml
subclass of: JavaAPIPart
comment: Java API part implementing the javax.xml package for Android 2.3

JavaxXmlAPI
type: Class
equivalent class: JavaxXmlAPI
subclass of: JavaAPI
comment: platform:comprisesInterfacePart some JavaxXml
comment: JavaLibrary implementing the javax.xml package for Android 2.3

JavaxXmlClassLibrary
type: Class
equivalent class: JavaxXmlClassLibrary
subclass of: JavaClassLibrary
comment: platform:implementsInterface some JavaxXmlAPI
comment: JavaLibrary implementing the javax.xml package for Android 2.3

JavaxXmlDatatype
type: Class
equivalent class: JavaxXmlDatatype
subclass of: JavaxXmlDatatype
comment: Java API part implementing the javax.xml.datatype package for Android 2.3

JavaxXmlDatatypeAPI
type: Class
equivalent class: JavaxXmlDatatypeAPI
subclass of: JavaxXmlDatatypeAPI
comment: platform:comprisesInterfacePart some JavaxXmlDatatype
comment: JavaLibrary implementing the javax.xml.datatype package for Android 2.3

JavaxXmlDatatypeClassLibrary
type: Class
equivalent class: JavaxXmlDatatypeClassLibrary
subclass of: JavaxXmlDatatypeClassLibrary
comment: platform:implementsInterface some JavaxXmlDatatypeAPI
comment: JavaLibrary implementing the javax.xml.datatype package for Android 2.3

JavaxXmlNamespace
type: Class
equivalent class: JavaxXmlNamespace
subclass of: JavaAPIPart
comment: Java API part implementing the javax.xml.namespace package for Android 2.3

JavaxXmlNamespaceAPI
type: Class
equivalent class: JavaxXmlNamespaceAPI
subclass of: JavaAPI
comment: platform:comprisesInterfacePart some JavaxXmlNamespace
comment: JavaLibrary implementing the javax.xml.namespace package for Android 2.3

JavaxXmlNamespaceClassLibrary
type: Class
equivalent class: JavaxXmlNamespaceClassLibrary
subclass of: JavaClassLibrary
comment: platform:implementsInterface some JavaxXmlNamespaceAPI
comment: JavaLibrary implementing the javax.xml.namespace package for Android 2.3

JavaxXmlParsers
type: Class
equivalent class: JavaxXmlParsers
subclass of: JavaxXmlParsers
comment: Java API part implementing the javax.xml.parsers package for Android 2.3

JavaxXmlParsersAPI
type: Class
equivalent class: JavaxXmlParsersAPI
subclass of: JavaxXmlParsersAPI
comment: platform:comprisesInterfacePart some JavaxXmlParsers
comment: JavaLibrary implementing the javax.xml.parsers package for Android 2.3

JavaxXmlParsersClassLibrary
type: Class
equivalent class: JavaxXmlParsersClassLibrary
subclass of: JavaxXmlParsersClassLibrary
comment: platform:implementsInterface some JavaxXmlParsersAPI
comment: JavaLibrary implementing the javax.xml.parsers package for Android 2.3

JavaxXmlTransform
type: Class
equivalent class: JavaxXmlTransform
subclass of: JavaxXmlTransform
comment: Java API part implementing the javax.xml.transform package for Android 2.3

JavaxXmlTransformAPI
type: Class
equivalent class: JavaxXmlTransformAPI
subclass of: JavaxXmlTransformAPI
comment: platform:comprisesInterfacePart some JavaxXmlTransform
comment: JavaLibrary implementing the javax.xml.transform package for Android 2.3

JavaxXmlTransformClassLibrary
type: Class
equivalent class: JavaxXmlTransformClassLibrary
subclass of: JavaxXmlTransformClassLibrary
comment: platform:implementsInterface some JavaxXmlTransformAPI
comment: JavaLibrary implementing the javax.xml.transform package for Android 2.3

JavaxXmlTransformDom
type: Class
equivalent class: JavaxXmlTransformDom
subclass of: JavaAPIPart
comment: Java API part implementing the javax.xml.transform.dom package for Android 2.3

JavaxXmlTransformDomAPI
type: Class
equivalent class: JavaxXmlTransformDomAPI
subclass of: JavaAPI
comment: platform:comprisesInterfacePart some JavaxXmlTransformDom
comment: JavaLibrary implementing the javax.xml.transform.dom package for Android 2.3

JavaxXmlTransformDomClassLibrary
type: Class
equivalent class: JavaxXmlTransformDomClassLibrary
subclass of: JavaClassLibrary
comment: platform:implementsInterface some JavaxXmlTransformDomAPI
comment: JavaLibrary implementing the javax.xml.transform.dom package for Android 2.3

JavaxXmlTransformSax
type: Class
equivalent class: JavaxXmlTransformSax
subclass of: JavaxXmlTransformSax
comment: Java API part implementing the javax.xml.transform.sax package for Android 2.3

JavaxXmlTransformSaxAPI
type: Class
equivalent class: JavaxXmlTransformSaxAPI
subclass of: JavaxXmlTransformSaxAPI
comment: platform:comprisesInterfacePart some JavaxXmlTransformSax
comment: JavaLibrary implementing the javax.xml.transform.sax package for Android 2.3

JavaxXmlTransformSaxClassLibrary
type: Class
equivalent class: JavaxXmlTransformSaxClassLibrary
subclass of: JavaxXmlTransformSaxClassLibrary
comment: platform:implementsInterface some JavaxXmlTransformSaxAPI
comment: JavaLibrary implementing the javax.xml.transform.sax package for Android 2.3

JavaxXmlTransformStream
type: Class
equivalent class: JavaxXmlTransformStream
subclass of: JavaAPIPart
comment: Java API part implementing the javax.xml.transform.stream package for Android 2.3

JavaxXmlTransformStreamAPI
type: Class
equivalent class: JavaxXmlTransformStreamAPI
subclass of: JavaAPI
comment: platform:comprisesInterfacePart some JavaxXmlTransformStream
comment: JavaLibrary implementing the javax.xml.transform.stream package for Android 2.3

JavaxXmlTransformStreamClassLibrary
type: Class
equivalent class: JavaxXmlTransformStreamClassLibrary
subclass of: JavaClassLibrary
comment: platform:implementsInterface some JavaxXmlTransformStreamAPI
comment: JavaLibrary implementing the javax.xml.transform.stream package for Android 2.3

JavaxXmlValidation
type: Class
subclass of: JavaxXmlValidation
comment: Java API part implementing the javax.xml.validation package for Android 2.3

JavaxXmlValidationAPI
type: Class
subclass of: JavaxXmlValidationAPI
comment: platform:comprisesInterfacePart some JavaxXmlValidation
comment: JavaLibrary implementing the javax.xml.validation package for Android 2.3

JavaxXmlValidationClassLibrary
type: Class
subclass of: JavaxXmlValidationClassLibrary
comment: platform:implementsInterface some JavaxXmlValidationAPI
comment: JavaLibrary implementing the javax.xml.validation package for Android 2.3

JavaxXmlXpath
type: Class
equivalent class: JavaxXmlXpath
subclass of: JavaAPIPart
comment: Java API part implementing the javax.xml.xpath package for Android 2.3

JavaxXmlXpathAPI
type: Class
equivalent class: JavaxXmlXpathAPI
subclass of: JavaAPI
comment: platform:comprisesInterfacePart some JavaxXmlXpath
comment: JavaLibrary implementing the javax.xml.xpath package for Android 2.3

JavaxXmlXpathClassLibrary
type: Class
equivalent class: JavaxXmlXpathClassLibrary
subclass of: JavaClassLibrary
comment: platform:implementsInterface some JavaxXmlXpathAPI
comment: JavaLibrary implementing the javax.xml.xpath package for Android 2.3

JunitFramework
type: Class
subclass of: JavaAPIPart
comment: Java API part implementing the junit.framework package for Android 2.3

JunitFrameworkAPI
type: Class
subclass of: JavaAPI
comment: platform:comprisesInterfacePart some JunitFramework
comment: JavaLibrary implementing the junit.framework package for Android 2.3

JunitFrameworkClassLibrary
type: Class
subclass of: JavaClassLibrary
comment: platform:implementsInterface some JunitFrameworkAPI
comment: JavaLibrary implementing the junit.framework package for Android 2.3

JunitRunner
type: Class
subclass of: JavaAPIPart
comment: Java API part implementing the junit.runner package for Android 2.3

JunitRunnerAPI
type: Class
subclass of: JavaAPI
comment: platform:comprisesInterfacePart some JunitRunner
comment: JavaLibrary implementing the junit.runner package for Android 2.3

JunitRunnerClassLibrary
type: Class
subclass of: JavaClassLibrary
comment: platform:implementsInterface some JunitRunnerAPI
comment: JavaLibrary implementing the junit.runner package for Android 2.3

OrgApacheCommonsLogging
type: Class
subclass of: JavaAPIPart
comment: Java API part implementing the org.apache.commons.logging package for Android 2.3

OrgApacheCommonsLoggingAPI
type: Class
subclass of: JavaAPI
comment: platform:comprisesInterfacePart some OrgApacheCommonsLogging
comment: JavaLibrary implementing the org.apache.commons.logging package for Android 2.3

OrgApacheCommonsLoggingClassLibrary
type: Class
subclass of: JavaClassLibrary
comment: platform:implementsInterface some OrgApacheCommonsLoggingAPI
comment: JavaLibrary implementing the org.apache.commons.logging package for Android 2.3

OrgApacheHttp
type: Class
subclass of: JavaAPIPart
comment: Java API part implementing the org.apache.http package for Android 2.3

OrgApacheHttpAPI
type: Class
subclass of: JavaAPI
comment: platform:comprisesInterfacePart some OrgApacheHttp
comment: JavaLibrary implementing the org.apache.http package for Android 2.3

OrgApacheHttpAuth
type: Class
subclass of: JavaAPIPart
comment: Java API part implementing the org.apache.http.auth package for Android 2.3

OrgApacheHttpAuthAPI
type: Class
subclass of: JavaAPI
comment: platform:comprisesInterfacePart some OrgApacheHttpAuth
comment: JavaLibrary implementing the org.apache.http.auth package for Android 2.3

OrgApacheHttpAuthClassLibrary
type: Class
subclass of: JavaClassLibrary
comment: platform:implementsInterface some OrgApacheHttpAuthAPI
comment: JavaLibrary implementing the org.apache.http.auth package for Android 2.3

OrgApacheHttpAuthParams
type: Class
subclass of: JavaAPIPart
comment: Java API part implementing the org.apache.http.auth.params package for Android 2.3

OrgApacheHttpAuthParamsAPI
type: Class
subclass of: JavaAPI
comment: platform:comprisesInterfacePart some OrgApacheHttpAuthParams
comment: JavaLibrary implementing the org.apache.http.auth.params package for Android 2.3

OrgApacheHttpAuthParamsClassLibrary
type: Class
subclass of: JavaClassLibrary
comment: platform:implementsInterface some OrgApacheHttpAuthParamsAPI
comment: JavaLibrary implementing the org.apache.http.auth.params package for Android 2.3

OrgApacheHttpClassLibrary
type: Class
subclass of: JavaClassLibrary
comment: platform:implementsInterface some OrgApacheHttpAPI
comment: JavaLibrary implementing the org.apache.http package for Android 2.3

OrgApacheHttpClient
type: Class
subclass of: JavaAPIPart
comment: Java API part implementing the org.apache.http.client package for Android 2.3

OrgApacheHttpClientAPI
type: Class
subclass of: JavaAPI
comment: platform:comprisesInterfacePart some OrgApacheHttpClient
comment: JavaLibrary implementing the org.apache.http.client package for Android 2.3

OrgApacheHttpClientClassLibrary
type: Class
subclass of: JavaClassLibrary
comment: platform:implementsInterface some OrgApacheHttpClientAPI
comment: JavaLibrary implementing the org.apache.http.client package for Android 2.3

OrgApacheHttpClientEntity
type: Class
subclass of: JavaAPIPart
comment: Java API part implementing the org.apache.http.client.entity package for Android 2.3

OrgApacheHttpClientEntityAPI
type: Class
subclass of: JavaAPI
comment: platform:comprisesInterfacePart some OrgApacheHttpClientEntity
comment: JavaLibrary implementing the org.apache.http.client.entity package for Android 2.3

OrgApacheHttpClientEntityClassLibrary
type: Class
subclass of: JavaClassLibrary
comment: platform:implementsInterface some OrgApacheHttpClientEntityAPI
comment: JavaLibrary implementing the org.apache.http.client.entity package for Android 2.3

OrgApacheHttpClientMethods
type: Class
subclass of: JavaAPIPart
comment: Java API part implementing the org.apache.http.client.methods package for Android 2.3

OrgApacheHttpClientMethodsAPI
type: Class
subclass of: JavaAPI
comment: platform:comprisesInterfacePart some OrgApacheHttpClientMethods
comment: JavaLibrary implementing the org.apache.http.client.methods package for Android 2.3

OrgApacheHttpClientMethodsClassLibrary
type: Class
subclass of: JavaClassLibrary
comment: platform:implementsInterface some OrgApacheHttpClientMethodsAPI
comment: JavaLibrary implementing the org.apache.http.client.methods package for Android 2.3

OrgApacheHttpClientParams
type: Class
subclass of: JavaAPIPart
comment: Java API part implementing the org.apache.http.client.params package for Android 2.3

OrgApacheHttpClientParamsAPI
type: Class
subclass of: JavaAPI
comment: platform:comprisesInterfacePart some OrgApacheHttpClientParams
comment: JavaLibrary implementing the org.apache.http.client.params package for Android 2.3

OrgApacheHttpClientParamsClassLibrary
type: Class
subclass of: JavaClassLibrary
comment: platform:implementsInterface some OrgApacheHttpClientParamsAPI
comment: JavaLibrary implementing the org.apache.http.client.params package for Android 2.3

OrgApacheHttpClientProtocol
type: Class
subclass of: JavaAPIPart
comment: Java API part implementing the org.apache.http.client.protocol package for Android 2.3

OrgApacheHttpClientProtocolAPI
type: Class
subclass of: JavaAPI
comment: platform:comprisesInterfacePart some OrgApacheHttpClientProtocol
comment: JavaLibrary implementing the org.apache.http.client.protocol package for Android 2.3

OrgApacheHttpClientProtocolClassLibrary
type: Class
subclass of: JavaClassLibrary
comment: platform:implementsInterface some OrgApacheHttpClientProtocolAPI
comment: JavaLibrary implementing the org.apache.http.client.protocol package for Android 2.3

OrgApacheHttpClientUtils
type: Class
subclass of: JavaAPIPart
comment: Java API part implementing the org.apache.http.client.utils package for Android 2.3

OrgApacheHttpClientUtilsAPI
type: Class
subclass of: JavaAPI
comment: platform:comprisesInterfacePart some OrgApacheHttpClientUtils
comment: JavaLibrary implementing the org.apache.http.client.utils package for Android 2.3

OrgApacheHttpClientUtilsClassLibrary
type: Class
subclass of: JavaClassLibrary
comment: platform:implementsInterface some OrgApacheHttpClientUtilsAPI
comment: JavaLibrary implementing the org.apache.http.client.utils package for Android 2.3

OrgApacheHttpConn
type: Class
subclass of: JavaAPIPart
comment: Java API part implementing the org.apache.http.conn package for Android 2.3

OrgApacheHttpConnAPI
type: Class
subclass of: JavaAPI
comment: platform:comprisesInterfacePart some OrgApacheHttpConn
comment: JavaLibrary implementing the org.apache.http.conn package for Android 2.3

OrgApacheHttpConnClassLibrary
type: Class
subclass of: JavaClassLibrary
comment: platform:implementsInterface some OrgApacheHttpConnAPI
comment: JavaLibrary implementing the org.apache.http.conn package for Android 2.3

OrgApacheHttpConnParams
type: Class
subclass of: JavaAPIPart
comment: Java API part implementing the org.apache.http.conn.params package for Android 2.3

OrgApacheHttpConnParamsAPI
type: Class
subclass of: JavaAPI
comment: platform:comprisesInterfacePart some OrgApacheHttpConnParams
comment: JavaLibrary implementing the org.apache.http.conn.params package for Android 2.3

OrgApacheHttpConnParamsClassLibrary
type: Class
subclass of: JavaClassLibrary
comment: platform:implementsInterface some OrgApacheHttpConnParamsAPI
comment: JavaLibrary implementing the org.apache.http.conn.params package for Android 2.3

OrgApacheHttpConnRouting
type: Class
subclass of: OrgApacheHttpConnRouting
comment: Java API part implementing the org.apache.http.conn.routing package for Android 2.3

OrgApacheHttpConnRoutingAPI
type: Class
subclass of: OrgApacheHttpConnRoutingAPI
comment: platform:comprisesInterfacePart some OrgApacheHttpConnRouting
comment: JavaLibrary implementing the org.apache.http.conn.routing package for Android 2.3

OrgApacheHttpConnRoutingClassLibrary
type: Class
subclass of: OrgApacheHttpConnRoutingClassLibrary
comment: platform:implementsInterface some OrgApacheHttpConnRoutingAPI
comment: JavaLibrary implementing the org.apache.http.conn.routing package for Android 2.3

OrgApacheHttpConnScheme
type: Class
subclass of: JavaAPIPart
comment: Java API part implementing the org.apache.http.conn.scheme package for Android 2.3

OrgApacheHttpConnSchemeAPI
type: Class
subclass of: JavaAPI
comment: platform:comprisesInterfacePart some OrgApacheHttpConnScheme
comment: JavaLibrary implementing the org.apache.http.conn.scheme package for Android 2.3

OrgApacheHttpConnSchemeClassLibrary
type: Class
subclass of: JavaClassLibrary
comment: platform:implementsInterface some OrgApacheHttpConnSchemeAPI
comment: JavaLibrary implementing the org.apache.http.conn.scheme package for Android 2.3

OrgApacheHttpConnSsl
type: Class
subclass of: JavaAPIPart
comment: Java API part implementing the org.apache.http.conn.ssl package for Android 2.3

OrgApacheHttpConnSslAPI
type: Class
subclass of: JavaAPI
comment: platform:comprisesInterfacePart some OrgApacheHttpConnSsl
comment: JavaLibrary implementing the org.apache.http.conn.ssl package for Android 2.3

OrgApacheHttpConnSslClassLibrary
type: Class
subclass of: JavaClassLibrary
comment: platform:implementsInterface some OrgApacheHttpConnSslAPI
comment: JavaLibrary implementing the org.apache.http.conn.ssl package for Android 2.3

OrgApacheHttpConnUtil
type: Class
subclass of: JavaAPIPart
comment: Java API part implementing the org.apache.http.conn.util package for Android 2.3

OrgApacheHttpConnUtilAPI
type: Class
subclass of: JavaAPI
comment: platform:comprisesInterfacePart some OrgApacheHttpConnUtil
comment: JavaLibrary implementing the org.apache.http.conn.util package for Android 2.3

OrgApacheHttpConnUtilClassLibrary
type: Class
subclass of: JavaClassLibrary
comment: platform:implementsInterface some OrgApacheHttpConnUtilAPI
comment: JavaLibrary implementing the org.apache.http.conn.util package for Android 2.3

OrgApacheHttpCookie
type: Class
subclass of: JavaAPIPart
comment: Java API part implementing the org.apache.http.cookie package for Android 2.3

OrgApacheHttpCookieAPI
type: Class
subclass of: JavaAPI
comment: platform:comprisesInterfacePart some OrgApacheHttpCookie
comment: JavaLibrary implementing the org.apache.http.cookie package for Android 2.3

OrgApacheHttpCookieClassLibrary
type: Class
subclass of: JavaClassLibrary
comment: platform:implementsInterface some OrgApacheHttpCookieAPI
comment: JavaLibrary implementing the org.apache.http.cookie package for Android 2.3

OrgApacheHttpCookieParams
type: Class
subclass of: JavaAPIPart
comment: Java API part implementing the org.apache.http.cookie.params package for Android 2.3

OrgApacheHttpCookieParamsAPI
type: Class
subclass of: JavaAPI
comment: platform:comprisesInterfacePart some OrgApacheHttpCookieParams
comment: JavaLibrary implementing the org.apache.http.cookie.params package for Android 2.3

OrgApacheHttpCookieParamsClassLibrary
type: Class
subclass of: JavaClassLibrary
comment: platform:implementsInterface some OrgApacheHttpCookieParamsAPI
comment: JavaLibrary implementing the org.apache.http.cookie.params package for Android 2.3

OrgApacheHttpEntity
type: Class
subclass of: JavaAPIPart
comment: Java API part implementing the org.apache.http.entity package for Android 2.3

OrgApacheHttpEntityAPI
type: Class
subclass of: JavaAPI
comment: platform:comprisesInterfacePart some OrgApacheHttpEntity
comment: JavaLibrary implementing the org.apache.http.entity package for Android 2.3

OrgApacheHttpEntityClassLibrary
type: Class
subclass of: JavaClassLibrary
comment: platform:implementsInterface some OrgApacheHttpEntityAPI
comment: JavaLibrary implementing the org.apache.http.entity package for Android 2.3

OrgApacheHttpImpl
type: Class
subclass of: JavaAPIPart
comment: Java API part implementing the org.apache.http.impl package for Android 2.3

OrgApacheHttpImplAPI
type: Class
subclass of: JavaAPI
comment: platform:comprisesInterfacePart some OrgApacheHttpImpl
comment: JavaLibrary implementing the org.apache.http.impl package for Android 2.3

OrgApacheHttpImplAuth
type: Class
subclass of: JavaAPIPart
comment: Java API part implementing the org.apache.http.impl.auth package for Android 2.3

OrgApacheHttpImplAuthAPI
type: Class
subclass of: JavaAPI
comment: platform:comprisesInterfacePart some OrgApacheHttpImplAuth
comment: JavaLibrary implementing the org.apache.http.impl.auth package for Android 2.3

OrgApacheHttpImplAuthClassLibrary
type: Class
subclass of: JavaClassLibrary
comment: platform:implementsInterface some OrgApacheHttpImplAuthAPI
comment: JavaLibrary implementing the org.apache.http.impl.auth package for Android 2.3

OrgApacheHttpImplClassLibrary
type: Class
subclass of: JavaClassLibrary
comment: platform:implementsInterface some OrgApacheHttpImplAPI
comment: JavaLibrary implementing the org.apache.http.impl package for Android 2.3

OrgApacheHttpImplClient
type: Class
subclass of: JavaAPIPart
comment: Java API part implementing the org.apache.http.impl.client package for Android 2.3

OrgApacheHttpImplClientAPI
type: Class
subclass of: JavaAPI
comment: platform:comprisesInterfacePart some OrgApacheHttpImplClient
comment: JavaLibrary implementing the org.apache.http.impl.client package for Android 2.3

OrgApacheHttpImplClientClassLibrary
type: Class
subclass of: JavaClassLibrary
comment: platform:implementsInterface some OrgApacheHttpImplClientAPI
comment: JavaLibrary implementing the org.apache.http.impl.client package for Android 2.3

OrgApacheHttpImplConn
type: Class
subclass of: JavaAPIPart
comment: Java API part implementing the org.apache.http.impl.conn package for Android 2.3

OrgApacheHttpImplConnAPI
type: Class
subclass of: JavaAPI
comment: platform:comprisesInterfacePart some OrgApacheHttpImplConn
comment: JavaLibrary implementing the org.apache.http.impl.conn package for Android 2.3

OrgApacheHttpImplConnClassLibrary
type: Class
subclass of: JavaClassLibrary
comment: platform:implementsInterface some OrgApacheHttpImplConnAPI
comment: JavaLibrary implementing the org.apache.http.impl.conn package for Android 2.3

OrgApacheHttpImplConnTsccm
type: Class
subclass of: JavaAPIPart
comment: Java API part implementing the org.apache.http.impl.conn.tsccm package for Android 2.3

OrgApacheHttpImplConnTsccmAPI
type: Class
subclass of: JavaAPI
comment: platform:comprisesInterfacePart some OrgApacheHttpImplConnTsccm
comment: JavaLibrary implementing the org.apache.http.impl.conn.tsccm package for Android 2.3

OrgApacheHttpImplConnTsccmClassLibrary
type: Class
subclass of: JavaClassLibrary
comment: platform:implementsInterface some OrgApacheHttpImplConnTsccmAPI
comment: JavaLibrary implementing the org.apache.http.impl.conn.tsccm package for Android 2.3

OrgApacheHttpImplCookie
type: Class
subclass of: JavaAPIPart
comment: Java API part implementing the org.apache.http.impl.cookie package for Android 2.3

OrgApacheHttpImplCookieAPI
type: Class
subclass of: JavaAPI
comment: platform:comprisesInterfacePart some OrgApacheHttpImplCookie
comment: JavaLibrary implementing the org.apache.http.impl.cookie package for Android 2.3

OrgApacheHttpImplCookieClassLibrary
type: Class
subclass of: JavaClassLibrary
comment: platform:implementsInterface some OrgApacheHttpImplCookieAPI
comment: JavaLibrary implementing the org.apache.http.impl.cookie package for Android 2.3

OrgApacheHttpImplEntity
type: Class
subclass of: JavaAPIPart
comment: Java API part implementing the org.apache.http.impl.entity package for Android 2.3

OrgApacheHttpImplEntityAPI
type: Class
subclass of: JavaAPI
comment: platform:comprisesInterfacePart some OrgApacheHttpImplEntity
comment: JavaLibrary implementing the org.apache.http.impl.entity package for Android 2.3

OrgApacheHttpImplEntityClassLibrary
type: Class
subclass of: JavaClassLibrary
comment: platform:implementsInterface some OrgApacheHttpImplEntityAPI
comment: JavaLibrary implementing the org.apache.http.impl.entity package for Android 2.3

OrgApacheHttpImplIo
type: Class
subclass of: JavaAPIPart
comment: Java API part implementing the org.apache.http.impl.io package for Android 2.3

OrgApacheHttpImplIoAPI
type: Class
subclass of: JavaAPI
comment: platform:comprisesInterfacePart some OrgApacheHttpImplIo
comment: JavaLibrary implementing the org.apache.http.impl.io package for Android 2.3

OrgApacheHttpImplIoClassLibrary
type: Class
subclass of: JavaClassLibrary
comment: platform:implementsInterface some OrgApacheHttpImplIoAPI
comment: JavaLibrary implementing the org.apache.http.impl.io package for Android 2.3

OrgApacheHttpIo
type: Class
subclass of: JavaAPIPart
comment: Java API part implementing the org.apache.http.io package for Android 2.3

OrgApacheHttpIoAPI
type: Class
subclass of: JavaAPI
comment: platform:comprisesInterfacePart some OrgApacheHttpIo
comment: JavaLibrary implementing the org.apache.http.io package for Android 2.3

OrgApacheHttpIoClassLibrary
type: Class
subclass of: JavaClassLibrary
comment: platform:implementsInterface some OrgApacheHttpIoAPI
comment: JavaLibrary implementing the org.apache.http.io package for Android 2.3

OrgApacheHttpMessage
type: Class
subclass of: JavaAPIPart
comment: Java API part implementing the org.apache.http.message package for Android 2.3

OrgApacheHttpMessageAPI
type: Class
subclass of: JavaAPI
comment: platform:comprisesInterfacePart some OrgApacheHttpMessage
comment: JavaLibrary implementing the org.apache.http.message package for Android 2.3

OrgApacheHttpMessageClassLibrary
type: Class
subclass of: JavaClassLibrary
comment: platform:implementsInterface some OrgApacheHttpMessageAPI
comment: JavaLibrary implementing the org.apache.http.message package for Android 2.3

OrgApacheHttpParams
type: Class
subclass of: JavaAPIPart
comment: Java API part implementing the org.apache.http.params package for Android 2.3

OrgApacheHttpParamsAPI
type: Class
subclass of: JavaAPI
comment: platform:comprisesInterfacePart some OrgApacheHttpParams
comment: JavaLibrary implementing the org.apache.http.params package for Android 2.3

OrgApacheHttpParamsClassLibrary
type: Class
subclass of: JavaClassLibrary
comment: platform:implementsInterface some OrgApacheHttpParamsAPI
comment: JavaLibrary implementing the org.apache.http.params package for Android 2.3

OrgApacheHttpProtocol
type: Class
subclass of: JavaAPIPart
comment: Java API part implementing the org.apache.http.protocol package for Android 2.3

OrgApacheHttpProtocolAPI
type: Class
subclass of: JavaAPI
comment: platform:comprisesInterfacePart some OrgApacheHttpProtocol
comment: JavaLibrary implementing the org.apache.http.protocol package for Android 2.3

OrgApacheHttpProtocolClassLibrary
type: Class
subclass of: JavaClassLibrary
comment: platform:implementsInterface some OrgApacheHttpProtocolAPI
comment: JavaLibrary implementing the org.apache.http.protocol package for Android 2.3

OrgApacheHttpUtil
type: Class
subclass of: JavaAPIPart
comment: Java API part implementing the org.apache.http.util package for Android 2.3

OrgApacheHttpUtilAPI
type: Class
subclass of: JavaAPI
comment: platform:comprisesInterfacePart some OrgApacheHttpUtil
comment: JavaLibrary implementing the org.apache.http.util package for Android 2.3

OrgApacheHttpUtilClassLibrary
type: Class
subclass of: JavaClassLibrary
comment: platform:implementsInterface some OrgApacheHttpUtilAPI
comment: JavaLibrary implementing the org.apache.http.util package for Android 2.3

OrgJson
type: Class
subclass of: JavaAPIPart
comment: Java API part implementing the org.json package for Android 2.3

OrgJsonAPI
type: Class
subclass of: JavaAPI
comment: platform:comprisesInterfacePart some OrgJson
comment: JavaLibrary implementing the org.json package for Android 2.3

OrgJsonClassLibrary
type: Class
subclass of: JavaClassLibrary
comment: platform:implementsInterface some OrgJsonAPI
comment: JavaLibrary implementing the org.json package for Android 2.3

OrgW3cDom
type: Class
equivalent class: OrgW3cDom
subclass of: JavaAPIPart
comment: Java API part implementing the org.w3c.dom package for Android 2.3

OrgW3cDomAPI
type: Class
equivalent class: OrgW3cDomAPI
subclass of: JavaAPI
comment: platform:comprisesInterfacePart some OrgW3cDom
comment: JavaLibrary implementing the org.w3c.dom package for Android 2.3

OrgW3cDomClassLibrary
type: Class
equivalent class: OrgW3cDomClassLibrary
subclass of: JavaClassLibrary
comment: platform:implementsInterface some OrgW3cDomAPI
comment: JavaLibrary implementing the org.w3c.dom package for Android 2.3

OrgW3cDomLs
type: Class
subclass of: JavaAPIPart
comment: Java API part implementing the org.w3c.dom.ls package for Android 2.3

OrgW3cDomLsAPI
type: Class
subclass of: JavaAPI
comment: platform:comprisesInterfacePart some OrgW3cDomLs
comment: JavaLibrary implementing the org.w3c.dom.ls package for Android 2.3

OrgW3cDomLsClassLibrary
type: Class
subclass of: JavaClassLibrary
comment: platform:implementsInterface some OrgW3cDomLsAPI
comment: JavaLibrary implementing the org.w3c.dom.ls package for Android 2.3

OrgXmlSax
type: Class
equivalent class: OrgXmlSax
subclass of: JavaAPIPart
comment: Java API part implementing the org.xml.sax package for Android 2.3

OrgXmlSaxAPI
type: Class
equivalent class: OrgXmlSaxAPI
subclass of: JavaAPI
comment: platform:comprisesInterfacePart some OrgXmlSax
comment: JavaLibrary implementing the org.xml.sax package for Android 2.3

OrgXmlSaxClassLibrary
type: Class
equivalent class: OrgXmlSaxClassLibrary
subclass of: JavaClassLibrary
comment: platform:implementsInterface some OrgXmlSaxAPI
comment: JavaLibrary implementing the org.xml.sax package for Android 2.3

OrgXmlSaxExt
type: Class
equivalent class: OrgXmlSaxExt
subclass of: JavaAPIPart
comment: Java API part implementing the org.xml.sax.ext package for Android 2.3

OrgXmlSaxExtAPI
type: Class
equivalent class: OrgXmlSaxExtAPI
subclass of: JavaAPI
comment: platform:comprisesInterfacePart some OrgXmlSaxExt
comment: JavaLibrary implementing the org.xml.sax.ext package for Android 2.3

OrgXmlSaxExtClassLibrary
type: Class
equivalent class: OrgXmlSaxExtClassLibrary
subclass of: JavaClassLibrary
comment: platform:implementsInterface some OrgXmlSaxExtAPI
comment: JavaLibrary implementing the org.xml.sax.ext package for Android 2.3

OrgXmlSaxHelpers
type: Class
equivalent class: OrgXmlSaxHelpers
subclass of: JavaAPIPart
comment: Java API part implementing the org.xml.sax.helpers package for Android 2.3

OrgXmlSaxHelpersAPI
type: Class
equivalent class: OrgXmlSaxHelpersAPI
subclass of: JavaAPI
comment: platform:comprisesInterfacePart some OrgXmlSaxHelpers
comment: JavaLibrary implementing the org.xml.sax.helpers package for Android 2.3

OrgXmlSaxHelpersClassLibrary
type: Class
equivalent class: OrgXmlSaxHelpersClassLibrary
subclass of: JavaClassLibrary
comment: platform:implementsInterface some OrgXmlSaxHelpersAPI
comment: JavaLibrary implementing the org.xml.sax.helpers package for Android 2.3

OrgXmlpullV1
type: Class
subclass of: JavaAPIPart
comment: Java API part implementing the org.xmlpull.v1 package for Android 2.3

OrgXmlpullV1API
type: Class
subclass of: JavaAPI
comment: platform:comprisesInterfacePart some OrgXmlpullV1
comment: JavaLibrary implementing the org.xmlpull.v1 package for Android 2.3

OrgXmlpullV1ClassLibrary
type: Class
subclass of: JavaClassLibrary
comment: platform:implementsInterface some OrgXmlpullV1API
comment: JavaLibrary implementing the org.xmlpull.v1 package for Android 2.3

OrgXmlpullV1Sax2
type: Class
subclass of: JavaAPIPart
comment: Java API part implementing the org.xmlpull.v1.sax2 package for Android 2.3

OrgXmlpullV1Sax2API
type: Class
subclass of: JavaAPI
comment: platform:comprisesInterfacePart some OrgXmlpullV1Sax2
comment: JavaLibrary implementing the org.xmlpull.v1.sax2 package for Android 2.3

OrgXmlpullV1Sax2ClassLibrary
type: Class
subclass of: JavaClassLibrary
comment: platform:implementsInterface some OrgXmlpullV1Sax2API
comment: JavaLibrary implementing the org.xmlpull.v1.sax2 package for Android 2.3