J2SE 1.4
type: Ontology
version info: $Id: UML2ToPackageAPIOntology.atl 8082 2010-03-18 21:11:00Z dwagelaa $
imports: platform.owl
imports: java.owl
imports: j2se-1 3.owl#
imports: isa.owl
imports: j2me-pp-1 1.owl#
comment: Generated by [UML2ToSimplifiedPackageAPIOntology.atl 8080 2010-03-18 10:46:40Z dwagelaa], [UML2ToPackageAPIOntology.atl 8082 2010-03-18 21:11:00Z dwagelaa], [UML2ToAPIOntology.atl 8082 2010-03-18 21:11:00Z dwagelaa], and [UML2Comparison.atl 8082 2010-03-18 21:11:00Z dwagelaa]
comment: Dennis Wagelaar <dennis.wagelaar@vub.ac.be>
comment: © 2010, Vrije Universiteit Brussel. All rights reserved.

J2SE1 4API
type: Class
subclass of: JavaLangAPI
subclass of: JavaLangReflectAPI
subclass of: JavaLangRefAPI
subclass of: JavaIoAPI
subclass of: JavaUtilAPI
subclass of: JavaUtilLoggingAPI
subclass of: JavaUtilJarAPI
subclass of: JavaUtilZipAPI
subclass of: JavaUtilPrefsAPI
subclass of: JavaUtilRegexAPI
subclass of: JavaNetAPI
subclass of: JavaSecurityAPI
subclass of: JavaSecurityCertAPI
subclass of: JavaSecuritySpecAPI
subclass of: JavaSecurityAclAPI
subclass of: JavaSecurityInterfacesAPI
subclass of: JavaNioAPI
subclass of: JavaNioChannelsAPI
subclass of: JavaNioChannelsSpiAPI
subclass of: JavaNioCharsetAPI
subclass of: JavaNioCharsetSpiAPI
subclass of: JavaBeansAPI
subclass of: JavaBeansBeancontextAPI
subclass of: JavaAwtAPI
subclass of: JavaAwtImageAPI
subclass of: JavaAwtImageRenderableAPI
subclass of: JavaAwtDatatransferAPI
subclass of: JavaAwtDndAPI
subclass of: JavaAwtEventAPI
subclass of: JavaAwtImAPI
subclass of: JavaAwtImSpiAPI
subclass of: JavaAwtFontAPI
subclass of: JavaAwtGeomAPI
subclass of: JavaAwtColorAPI
subclass of: JavaAwtPrintAPI
subclass of: JavaTextAPI
subclass of: JavaMathAPI
subclass of: JavaAppletAPI
subclass of: JavaRmiAPI
subclass of: JavaRmiActivationAPI
subclass of: JavaRmiServerAPI
subclass of: JavaRmiDgcAPI
subclass of: JavaRmiRegistryAPI
subclass of: JavaSqlAPI
subclass of: JavaxImageioAPI
subclass of: JavaxImageioSpiAPI
subclass of: JavaxImageioMetadataAPI
subclass of: JavaxImageioStreamAPI
subclass of: JavaxImageioEventAPI
subclass of: JavaxImageioPluginsJpegAPI
subclass of: JavaxAccessibilityAPI
subclass of: JavaxSwingAPI
subclass of: JavaxSwingPlafAPI
subclass of: JavaxSwingPlafBasicAPI
subclass of: JavaxSwingPlafMetalAPI
subclass of: JavaxSwingPlafMultiAPI
subclass of: JavaxSwingEventAPI
subclass of: JavaxSwingBorderAPI
subclass of: JavaxSwingTextAPI
subclass of: JavaxSwingTextHtmlAPI
subclass of: JavaxSwingTextHtmlParserAPI
subclass of: JavaxSwingTextRtfAPI
subclass of: JavaxSwingTableAPI
subclass of: JavaxSwingUndoAPI
subclass of: JavaxSwingTreeAPI
subclass of: JavaxSwingFilechooserAPI
subclass of: JavaxSwingColorchooserAPI
subclass of: JavaxSoundSampledAPI
subclass of: JavaxSoundSampledSpiAPI
subclass of: JavaxSoundMidiAPI
subclass of: JavaxSoundMidiSpiAPI
subclass of: JavaxPrintAPI
subclass of: JavaxPrintAttributeAPI
subclass of: JavaxPrintAttributeStandardAPI
subclass of: JavaxPrintEventAPI
subclass of: JavaxSecurityAuthAPI
subclass of: JavaxSecurityAuthX500API
subclass of: JavaxSecurityAuthCallbackAPI
subclass of: JavaxSecurityAuthKerberosAPI

J2SE1 4ClassLibrary
type: Class
subclass of: JavaLangClassLibrary
subclass of: JavaLangReflectClassLibrary
subclass of: JavaLangRefClassLibrary
subclass of: JavaIoClassLibrary
subclass of: JavaUtilClassLibrary
subclass of: JavaUtilLoggingClassLibrary
subclass of: JavaUtilJarClassLibrary
subclass of: JavaUtilZipClassLibrary
subclass of: JavaUtilPrefsClassLibrary
subclass of: JavaUtilRegexClassLibrary
subclass of: JavaNetClassLibrary
subclass of: JavaSecurityClassLibrary
subclass of: JavaSecurityCertClassLibrary
subclass of: JavaSecuritySpecClassLibrary
subclass of: JavaSecurityAclClassLibrary
subclass of: JavaSecurityInterfacesClassLibrary
subclass of: JavaNioClassLibrary
subclass of: JavaNioChannelsClassLibrary
subclass of: JavaNioChannelsSpiClassLibrary
subclass of: JavaNioCharsetClassLibrary
subclass of: JavaNioCharsetSpiClassLibrary
subclass of: JavaBeansClassLibrary
subclass of: JavaBeansBeancontextClassLibrary
subclass of: JavaAwtClassLibrary
subclass of: JavaAwtImageClassLibrary
subclass of: JavaAwtImageRenderableClassLibrary
subclass of: JavaAwtDatatransferClassLibrary
subclass of: JavaAwtDndClassLibrary
subclass of: JavaAwtEventClassLibrary
subclass of: JavaAwtImClassLibrary
subclass of: JavaAwtImSpiClassLibrary
subclass of: JavaAwtFontClassLibrary
subclass of: JavaAwtGeomClassLibrary
subclass of: JavaAwtColorClassLibrary
subclass of: JavaAwtPrintClassLibrary
subclass of: JavaTextClassLibrary
subclass of: JavaMathClassLibrary
subclass of: JavaAppletClassLibrary
subclass of: JavaRmiClassLibrary
subclass of: JavaRmiActivationClassLibrary
subclass of: JavaRmiServerClassLibrary
subclass of: JavaRmiDgcClassLibrary
subclass of: JavaRmiRegistryClassLibrary
subclass of: JavaSqlClassLibrary
subclass of: JavaxImageioClassLibrary
subclass of: JavaxImageioSpiClassLibrary
subclass of: JavaxImageioMetadataClassLibrary
subclass of: JavaxImageioStreamClassLibrary
subclass of: JavaxImageioEventClassLibrary
subclass of: JavaxImageioPluginsJpegClassLibrary
subclass of: JavaxAccessibilityClassLibrary
subclass of: JavaxSwingClassLibrary
subclass of: JavaxSwingPlafClassLibrary
subclass of: JavaxSwingPlafBasicClassLibrary
subclass of: JavaxSwingPlafMetalClassLibrary
subclass of: JavaxSwingPlafMultiClassLibrary
subclass of: JavaxSwingEventClassLibrary
subclass of: JavaxSwingBorderClassLibrary
subclass of: JavaxSwingTextClassLibrary
subclass of: JavaxSwingTextHtmlClassLibrary
subclass of: JavaxSwingTextHtmlParserClassLibrary
subclass of: JavaxSwingTextRtfClassLibrary
subclass of: JavaxSwingTableClassLibrary
subclass of: JavaxSwingUndoClassLibrary
subclass of: JavaxSwingTreeClassLibrary
subclass of: JavaxSwingFilechooserClassLibrary
subclass of: JavaxSwingColorchooserClassLibrary
subclass of: JavaxSoundSampledClassLibrary
subclass of: JavaxSoundSampledSpiClassLibrary
subclass of: JavaxSoundMidiClassLibrary
subclass of: JavaxSoundMidiSpiClassLibrary
subclass of: JavaxPrintClassLibrary
subclass of: JavaxPrintAttributeClassLibrary
subclass of: JavaxPrintAttributeStandardClassLibrary
subclass of: JavaxPrintEventClassLibrary
subclass of: JavaxSecurityAuthClassLibrary
subclass of: JavaxSecurityAuthX500ClassLibrary
subclass of: JavaxSecurityAuthCallbackClassLibrary
subclass of: JavaxSecurityAuthKerberosClassLibrary

J2SE1 4BytecodeFormat
type: Class
equivalent class: J2MEPP1 1BytecodeFormat
subclass of: J2SE1 3BytecodeFormat
comment: J2SE 1.4 bytecode format
comment: java:majorVersionNumber some xsd:integer[>="48"^^xsd:integer] and java:preverified value false

theJ2SE1 4BytecodeFormat
type: J2SE1 4BytecodeFormat
preverified: false
minor version number: 3
major version number: 48

J2SE1 4VM
type: Class
equivalent class: Restriction
  on property: implementsInterface
  some values from: J2SE1 4BytecodeFormat
subclass of: JavaVM
comment: J2SE 1.4 virtual machine

J2SE1 4JRE
type: Class
equivalent class: Class
  intersection of: Restriction
    on property: providesFeature
    some values from: J2SE1 4ClassLibrary
  intersection of: Restriction
    on property: providesFeature
    some values from: J2SE1 4VM
subclass of: JRE
comment: J2SE 1.4 Java Runtime Environment

JavaLang
type: Class
subclass of: JavaLang
comment: Java API part implementing the java.lang package for J2SE 1.4

JavaLangReflect
type: Class
equivalent class: JavaLangReflect
subclass of: JavaLangReflect
comment: Java API part implementing the java.lang.reflect package for J2SE 1.4

JavaLangRef
type: Class
equivalent class: JavaLangRef
subclass of: JavaAPIPart
comment: Java API part implementing the java.lang.ref package for J2SE 1.4

JavaIo
type: Class
subclass of: JavaIo
comment: Java API part implementing the java.io package for J2SE 1.4

JavaUtil
type: Class
subclass of: JavaUtil
comment: Java API part implementing the java.util package for J2SE 1.4

JavaUtilLogging
type: Class
subclass of: JavaAPIPart
comment: Java API part implementing the java.util.logging package for J2SE 1.4

JavaUtilJar
type: Class
equivalent class: JavaUtilJar
subclass of: JavaUtilJar
comment: Java API part implementing the java.util.jar package for J2SE 1.4

JavaUtilZip
type: Class
equivalent class: JavaUtilZip
subclass of: JavaUtilZip
comment: Java API part implementing the java.util.zip package for J2SE 1.4

JavaUtilPrefs
type: Class
subclass of: JavaAPIPart
comment: Java API part implementing the java.util.prefs package for J2SE 1.4

JavaUtilRegex
type: Class
subclass of: JavaAPIPart
comment: Java API part implementing the java.util.regex package for J2SE 1.4

JavaNet
type: Class
subclass of: JavaNet
comment: Java API part implementing the java.net package for J2SE 1.4

JavaSecurity
type: Class
subclass of: JavaSecurity
comment: Java API part implementing the java.security package for J2SE 1.4

JavaSecurityCert
type: Class
subclass of: JavaSecurityCert
comment: Java API part implementing the java.security.cert package for J2SE 1.4

JavaSecuritySpec
type: Class
subclass of: JavaSecuritySpec
comment: Java API part implementing the java.security.spec package for J2SE 1.4

JavaSecurityAcl
type: Class
equivalent class: JavaSecurityAcl
subclass of: JavaSecurityAcl
comment: Java API part implementing the java.security.acl package for J2SE 1.4

JavaSecurityInterfaces
type: Class
subclass of: JavaSecurityInterfaces
comment: Java API part implementing the java.security.interfaces package for J2SE 1.4

JavaNio
type: Class
subclass of: JavaAPIPart
comment: Java API part implementing the java.nio package for J2SE 1.4

JavaNioChannels
type: Class
subclass of: JavaAPIPart
comment: Java API part implementing the java.nio.channels package for J2SE 1.4

JavaNioChannelsSpi
type: Class
subclass of: JavaAPIPart
comment: Java API part implementing the java.nio.channels.spi package for J2SE 1.4

JavaNioCharset
type: Class
subclass of: JavaAPIPart
comment: Java API part implementing the java.nio.charset package for J2SE 1.4

JavaNioCharsetSpi
type: Class
subclass of: JavaAPIPart
comment: Java API part implementing the java.nio.charset.spi package for J2SE 1.4

JavaBeans
type: Class
subclass of: JavaBeans
comment: Java API part implementing the java.beans package for J2SE 1.4

JavaBeansBeancontext
type: Class
equivalent class: JavaBeansBeancontext
subclass of: JavaAPIPart
comment: Java API part implementing the java.beans.beancontext package for J2SE 1.4

JavaAwt
type: Class
subclass of: JavaAwt
comment: Java API part implementing the java.awt package for J2SE 1.4

JavaAwtImage
type: Class
subclass of: JavaAwtImage
comment: Java API part implementing the java.awt.image package for J2SE 1.4

JavaAwtImageRenderable
type: Class
equivalent class: JavaAwtImageRenderable
subclass of: JavaAPIPart
comment: Java API part implementing the java.awt.image.renderable package for J2SE 1.4

JavaAwtDatatransfer
type: Class
subclass of: JavaAwtDatatransfer
comment: Java API part implementing the java.awt.datatransfer package for J2SE 1.4

JavaAwtDnd
type: Class
subclass of: JavaAwtDnd
comment: Java API part implementing the java.awt.dnd package for J2SE 1.4

JavaAwtEvent
type: Class
subclass of: JavaAwtEvent
comment: Java API part implementing the java.awt.event package for J2SE 1.4

JavaAwtIm
type: Class
equivalent class: JavaAwtIm
subclass of: JavaAwtIm
comment: Java API part implementing the java.awt.im package for J2SE 1.4

JavaAwtImSpi
type: Class
subclass of: JavaAwtImSpi
comment: Java API part implementing the java.awt.im.spi package for J2SE 1.4

JavaAwtFont
type: Class
subclass of: JavaAwtFont
comment: Java API part implementing the java.awt.font package for J2SE 1.4

JavaAwtGeom
type: Class
subclass of: JavaAwtGeom
comment: Java API part implementing the java.awt.geom package for J2SE 1.4

JavaAwtColor
type: Class
subclass of: JavaAwtColor
comment: Java API part implementing the java.awt.color package for J2SE 1.4

JavaAwtPrint
type: Class
subclass of: JavaAwtPrint
comment: Java API part implementing the java.awt.print package for J2SE 1.4

JavaText
type: Class
subclass of: JavaText
comment: Java API part implementing the java.text package for J2SE 1.4

JavaMath
type: Class
subclass of: JavaMath
comment: Java API part implementing the java.math package for J2SE 1.4

JavaApplet
type: Class
subclass of: JavaApplet
comment: Java API part implementing the java.applet package for J2SE 1.4

JavaRmi
type: Class
subclass of: JavaRmi
comment: Java API part implementing the java.rmi package for J2SE 1.4

JavaRmiActivation
type: Class
subclass of: JavaRmiActivation
comment: Java API part implementing the java.rmi.activation package for J2SE 1.4

JavaRmiServer
type: Class
subclass of: JavaRmiServer
comment: Java API part implementing the java.rmi.server package for J2SE 1.4

JavaRmiDgc
type: Class
equivalent class: JavaRmiDgc
subclass of: JavaAPIPart
comment: Java API part implementing the java.rmi.dgc package for J2SE 1.4

JavaRmiRegistry
type: Class
equivalent class: JavaRmiRegistry
subclass of: JavaRmiRegistry
comment: Java API part implementing the java.rmi.registry package for J2SE 1.4

JavaSql
type: Class
subclass of: JavaSql
comment: Java API part implementing the java.sql package for J2SE 1.4

JavaxImageio
type: Class
subclass of: JavaAPIPart
comment: Java API part implementing the javax.imageio package for J2SE 1.4

JavaxImageioSpi
type: Class
subclass of: JavaAPIPart
comment: Java API part implementing the javax.imageio.spi package for J2SE 1.4

JavaxImageioMetadata
type: Class
subclass of: JavaAPIPart
comment: Java API part implementing the javax.imageio.metadata package for J2SE 1.4

JavaxImageioStream
type: Class
subclass of: JavaAPIPart
comment: Java API part implementing the javax.imageio.stream package for J2SE 1.4

JavaxImageioEvent
type: Class
subclass of: JavaAPIPart
comment: Java API part implementing the javax.imageio.event package for J2SE 1.4

JavaxImageioPluginsJpeg
type: Class
subclass of: JavaAPIPart
comment: Java API part implementing the javax.imageio.plugins.jpeg package for J2SE 1.4

JavaxAccessibility
type: Class
subclass of: JavaxAccessibility
comment: Java API part implementing the javax.accessibility package for J2SE 1.4

JavaxSwing
type: Class
subclass of: JavaAPIPart
comment: Java API part implementing the javax.swing package for J2SE 1.4

JavaxSwingPlaf
type: Class
subclass of: JavaxSwingPlaf
comment: Java API part implementing the javax.swing.plaf package for J2SE 1.4

JavaxSwingPlafBasic
type: Class
subclass of: JavaxSwingPlafBasic
comment: Java API part implementing the javax.swing.plaf.basic package for J2SE 1.4

JavaxSwingPlafMetal
type: Class
subclass of: JavaxSwingPlafMetal
comment: Java API part implementing the javax.swing.plaf.metal package for J2SE 1.4

JavaxSwingPlafMulti
type: Class
subclass of: JavaxSwingPlafMulti
comment: Java API part implementing the javax.swing.plaf.multi package for J2SE 1.4

JavaxSwingEvent
type: Class
subclass of: JavaxSwingEvent
comment: Java API part implementing the javax.swing.event package for J2SE 1.4

JavaxSwingBorder
type: Class
equivalent class: JavaxSwingBorder
subclass of: JavaAPIPart
comment: Java API part implementing the javax.swing.border package for J2SE 1.4

JavaxSwingText
type: Class
subclass of: JavaxSwingText
comment: Java API part implementing the javax.swing.text package for J2SE 1.4

JavaxSwingTextHtml
type: Class
subclass of: JavaxSwingTextHtml
comment: Java API part implementing the javax.swing.text.html package for J2SE 1.4

JavaxSwingTextHtmlParser
type: Class
equivalent class: JavaxSwingTextHtmlParser
subclass of: JavaAPIPart
comment: Java API part implementing the javax.swing.text.html.parser package for J2SE 1.4

JavaxSwingTextRtf
type: Class
equivalent class: JavaxSwingTextRtf
subclass of: JavaAPIPart
comment: Java API part implementing the javax.swing.text.rtf package for J2SE 1.4

JavaxSwingTable
type: Class
subclass of: JavaxSwingTable
comment: Java API part implementing the javax.swing.table package for J2SE 1.4

JavaxSwingUndo
type: Class
subclass of: JavaxSwingUndo
comment: Java API part implementing the javax.swing.undo package for J2SE 1.4

JavaxSwingTree
type: Class
subclass of: JavaxSwingTree
comment: Java API part implementing the javax.swing.tree package for J2SE 1.4

JavaxSwingFilechooser
type: Class
subclass of: JavaxSwingFilechooser
comment: Java API part implementing the javax.swing.filechooser package for J2SE 1.4

JavaxSwingColorchooser
type: Class
subclass of: JavaxSwingColorchooser
comment: Java API part implementing the javax.swing.colorchooser package for J2SE 1.4

JavaxSoundSampled
type: Class
subclass of: JavaxSoundSampled
comment: Java API part implementing the javax.sound.sampled package for J2SE 1.4

JavaxSoundSampledSpi
type: Class
equivalent class: JavaxSoundSampledSpi
subclass of: JavaAPIPart
comment: Java API part implementing the javax.sound.sampled.spi package for J2SE 1.4

JavaxSoundMidi
type: Class
subclass of: JavaxSoundMidi
comment: Java API part implementing the javax.sound.midi package for J2SE 1.4

JavaxSoundMidiSpi
type: Class
equivalent class: JavaxSoundMidiSpi
subclass of: JavaAPIPart
comment: Java API part implementing the javax.sound.midi.spi package for J2SE 1.4

JavaxPrint
type: Class
subclass of: JavaAPIPart
comment: Java API part implementing the javax.print package for J2SE 1.4

JavaxPrintAttribute
type: Class
subclass of: JavaAPIPart
comment: Java API part implementing the javax.print.attribute package for J2SE 1.4

JavaxPrintAttributeStandard
type: Class
subclass of: JavaAPIPart
comment: Java API part implementing the javax.print.attribute.standard package for J2SE 1.4

JavaxPrintEvent
type: Class
subclass of: JavaAPIPart
comment: Java API part implementing the javax.print.event package for J2SE 1.4

JavaxSecurityAuth
type: Class
subclass of: JavaAPIPart
comment: Java API part implementing the javax.security.auth package for J2SE 1.4

JavaxSecurityAuthX500
type: Class
subclass of: JavaxSecurityAuthX500
comment: Java API part implementing the javax.security.auth.x500 package for J2SE 1.4

JavaxSecurityAuthCallback
type: Class
subclass of: JavaAPIPart
comment: Java API part implementing the javax.security.auth.callback package for J2SE 1.4

JavaxSecurityAuthKerberos
type: Class
subclass of: JavaAPIPart
comment: Java API part implementing the javax.security.auth.kerberos package for J2SE 1.4

JavaxSecurityAuthLogin
type: Class
subclass of: JavaAPIPart
comment: Java API part implementing the javax.security.auth.login package for J2SE 1.4

JavaxSecurityAuthSpi
type: Class
subclass of: JavaAPIPart
comment: Java API part implementing the javax.security.auth.spi package for J2SE 1.4

JavaxSecurityCert
type: Class
subclass of: JavaAPIPart
comment: Java API part implementing the javax.security.cert package for J2SE 1.4

JavaxNaming
type: Class
subclass of: JavaxNaming
comment: Java API part implementing the javax.naming package for J2SE 1.4

JavaxNamingDirectory
type: Class
subclass of: JavaxNamingDirectory
comment: Java API part implementing the javax.naming.directory package for J2SE 1.4

JavaxNamingEvent
type: Class
equivalent class: JavaxNamingEvent
subclass of: JavaAPIPart
comment: Java API part implementing the javax.naming.event package for J2SE 1.4

JavaxNamingLdap
type: Class
subclass of: JavaxNamingLdap
comment: Java API part implementing the javax.naming.ldap package for J2SE 1.4

JavaxNamingSpi
type: Class
equivalent class: JavaxNamingSpi
subclass of: JavaAPIPart
comment: Java API part implementing the javax.naming.spi package for J2SE 1.4

JavaxNet
type: Class
subclass of: JavaAPIPart
comment: Java API part implementing the javax.net package for J2SE 1.4

JavaxNetSsl
type: Class
subclass of: JavaAPIPart
comment: Java API part implementing the javax.net.ssl package for J2SE 1.4

JavaxRmi
type: Class
equivalent class: JavaxRmi
subclass of: JavaAPIPart
comment: Java API part implementing the javax.rmi package for J2SE 1.4

JavaxRmiCORBA
type: Class
equivalent class: JavaxRmiCORBA
subclass of: JavaAPIPart
comment: Java API part implementing the javax.rmi.CORBA package for J2SE 1.4

JavaxCrypto
type: Class
subclass of: JavaAPIPart
comment: Java API part implementing the javax.crypto package for J2SE 1.4

JavaxCryptoInterfaces
type: Class
subclass of: JavaAPIPart
comment: Java API part implementing the javax.crypto.interfaces package for J2SE 1.4

JavaxCryptoSpec
type: Class
subclass of: JavaAPIPart
comment: Java API part implementing the javax.crypto.spec package for J2SE 1.4

JavaxSql
type: Class
subclass of: JavaAPIPart
comment: Java API part implementing the javax.sql package for J2SE 1.4

JavaxTransaction
type: Class
subclass of: JavaxTransaction
comment: Java API part implementing the javax.transaction package for J2SE 1.4

JavaxTransactionXa
type: Class
subclass of: JavaAPIPart
comment: Java API part implementing the javax.transaction.xa package for J2SE 1.4

JavaxXmlParsers
type: Class
subclass of: JavaAPIPart
comment: Java API part implementing the javax.xml.parsers package for J2SE 1.4

JavaxXmlTransform
type: Class
subclass of: JavaAPIPart
comment: Java API part implementing the javax.xml.transform package for J2SE 1.4

JavaxXmlTransformDom
type: Class
subclass of: JavaAPIPart
comment: Java API part implementing the javax.xml.transform.dom package for J2SE 1.4

JavaxXmlTransformSax
type: Class
subclass of: JavaAPIPart
comment: Java API part implementing the javax.xml.transform.sax package for J2SE 1.4

JavaxXmlTransformStream
type: Class
subclass of: JavaAPIPart
comment: Java API part implementing the javax.xml.transform.stream package for J2SE 1.4

OrgW3cDom
type: Class
subclass of: JavaAPIPart
comment: Java API part implementing the org.w3c.dom package for J2SE 1.4

OrgW3cDomCss
type: Class
subclass of: JavaAPIPart
comment: Java API part implementing the org.w3c.dom.css package for J2SE 1.4

OrgW3cDomStylesheets
type: Class
subclass of: JavaAPIPart
comment: Java API part implementing the org.w3c.dom.stylesheets package for J2SE 1.4

OrgW3cDomViews
type: Class
subclass of: JavaAPIPart
comment: Java API part implementing the org.w3c.dom.views package for J2SE 1.4

OrgW3cDomEvents
type: Class
subclass of: JavaAPIPart
comment: Java API part implementing the org.w3c.dom.events package for J2SE 1.4

OrgW3cDomHtml
type: Class
subclass of: JavaAPIPart
comment: Java API part implementing the org.w3c.dom.html package for J2SE 1.4

OrgW3cDomTraversal
type: Class
subclass of: JavaAPIPart
comment: Java API part implementing the org.w3c.dom.traversal package for J2SE 1.4

OrgOmgCORBA 2 3
type: Class
equivalent class: OrgOmgCORBA 2 3
subclass of: JavaAPIPart
comment: Java API part implementing the org.omg.CORBA_2_3 package for J2SE 1.4

OrgOmgCORBA 2 3Portable
type: Class
subclass of: JavaAPIPart
comment: Java API part implementing the org.omg.CORBA_2_3.portable package for J2SE 1.4

OrgOmgCORBA
type: Class
subclass of: JavaAPIPart
comment: Java API part implementing the org.omg.CORBA package for J2SE 1.4

OrgOmgCORBAPortable
type: Class
subclass of: JavaAPIPart
comment: Java API part implementing the org.omg.CORBA.portable package for J2SE 1.4

OrgOmgCORBADynAnyPackage
type: Class
subclass of: OrgOmgCORBADynAnyPackage
comment: Java API part implementing the org.omg.CORBA.DynAnyPackage package for J2SE 1.4

OrgOmgCORBAORBPackage
type: Class
subclass of: OrgOmgCORBAORBPackage
comment: Java API part implementing the org.omg.CORBA.ORBPackage package for J2SE 1.4

OrgOmgCORBATypeCodePackage
type: Class
subclass of: OrgOmgCORBATypeCodePackage
comment: Java API part implementing the org.omg.CORBA.TypeCodePackage package for J2SE 1.4

OrgOmgSendingContext
type: Class
equivalent class: OrgOmgSendingContext
subclass of: JavaAPIPart
comment: Java API part implementing the org.omg.SendingContext package for J2SE 1.4

OrgOmgCosNaming
type: Class
subclass of: JavaAPIPart
comment: Java API part implementing the org.omg.CosNaming package for J2SE 1.4

OrgOmgCosNamingNamingContextExtPackage
type: Class
subclass of: JavaAPIPart
comment: Java API part implementing the org.omg.CosNaming.NamingContextExtPackage package for J2SE 1.4

OrgOmgCosNamingNamingContextPackage
type: Class
subclass of: JavaAPIPart
comment: Java API part implementing the org.omg.CosNaming.NamingContextPackage package for J2SE 1.4

OrgOmgPortableServer
type: Class
subclass of: JavaAPIPart
comment: Java API part implementing the org.omg.PortableServer package for J2SE 1.4

OrgOmgPortableServerCurrentPackage
type: Class
subclass of: JavaAPIPart
comment: Java API part implementing the org.omg.PortableServer.CurrentPackage package for J2SE 1.4

OrgOmgPortableServerPOAManagerPackage
type: Class
subclass of: JavaAPIPart
comment: Java API part implementing the org.omg.PortableServer.POAManagerPackage package for J2SE 1.4

OrgOmgPortableServerPOAPackage
type: Class
subclass of: JavaAPIPart
comment: Java API part implementing the org.omg.PortableServer.POAPackage package for J2SE 1.4

OrgOmgPortableServerPortable
type: Class
subclass of: JavaAPIPart
comment: Java API part implementing the org.omg.PortableServer.portable package for J2SE 1.4

OrgOmgPortableServerServantLocatorPackage
type: Class
subclass of: JavaAPIPart
comment: Java API part implementing the org.omg.PortableServer.ServantLocatorPackage package for J2SE 1.4

OrgOmgDynamic
type: Class
subclass of: JavaAPIPart
comment: Java API part implementing the org.omg.Dynamic package for J2SE 1.4

OrgOmgDynamicAny
type: Class
subclass of: JavaAPIPart
comment: Java API part implementing the org.omg.DynamicAny package for J2SE 1.4

OrgOmgDynamicAnyDynAnyFactoryPackage
type: Class
subclass of: JavaAPIPart
comment: Java API part implementing the org.omg.DynamicAny.DynAnyFactoryPackage package for J2SE 1.4

OrgOmgDynamicAnyDynAnyPackage
type: Class
subclass of: JavaAPIPart
comment: Java API part implementing the org.omg.DynamicAny.DynAnyPackage package for J2SE 1.4

OrgOmgIOP
type: Class
subclass of: JavaAPIPart
comment: Java API part implementing the org.omg.IOP package for J2SE 1.4

OrgOmgIOPCodecFactoryPackage
type: Class
subclass of: JavaAPIPart
comment: Java API part implementing the org.omg.IOP.CodecFactoryPackage package for J2SE 1.4

OrgOmgIOPCodecPackage
type: Class
subclass of: JavaAPIPart
comment: Java API part implementing the org.omg.IOP.CodecPackage package for J2SE 1.4

OrgOmgMessaging
type: Class
subclass of: JavaAPIPart
comment: Java API part implementing the org.omg.Messaging package for J2SE 1.4

OrgOmgPortableInterceptor
type: Class
subclass of: JavaAPIPart
comment: Java API part implementing the org.omg.PortableInterceptor package for J2SE 1.4

OrgOmgPortableInterceptorORBInitInfoPackage
type: Class
subclass of: JavaAPIPart
comment: Java API part implementing the org.omg.PortableInterceptor.ORBInitInfoPackage package for J2SE 1.4

OrgOmgStubJavaRmi
type: Class
equivalent class: OrgOmgStubJavaRmi
subclass of: JavaAPIPart
comment: Java API part implementing the org.omg.stub.java.rmi package for J2SE 1.4

OrgXmlSax
type: Class
subclass of: JavaAPIPart
comment: Java API part implementing the org.xml.sax package for J2SE 1.4

OrgXmlSaxHelpers
type: Class
subclass of: JavaAPIPart
comment: Java API part implementing the org.xml.sax.helpers package for J2SE 1.4

OrgXmlSaxExt
type: Class
subclass of: JavaAPIPart
comment: Java API part implementing the org.xml.sax.ext package for J2SE 1.4

OrgIetfJgss
type: Class
subclass of: JavaAPIPart
comment: Java API part implementing the org.ietf.jgss package for J2SE 1.4

JavaLangAPI
type: Class
subclass of: JavaLangAPI
comment: JavaLibrary implementing the java.lang package for J2SE 1.4
comment: platform:comprisesInterfacePart some JavaLang

JavaLangReflectAPI
type: Class
equivalent class: JavaLangReflectAPI
subclass of: JavaLangReflectAPI
comment: JavaLibrary implementing the java.lang.reflect package for J2SE 1.4
comment: platform:comprisesInterfacePart some JavaLangReflect

JavaLangRefAPI
type: Class
equivalent class: JavaLangRefAPI
subclass of: JavaAPI
comment: JavaLibrary implementing the java.lang.ref package for J2SE 1.4
comment: platform:comprisesInterfacePart some JavaLangRef

JavaIoAPI
type: Class
subclass of: JavaIoAPI
comment: JavaLibrary implementing the java.io package for J2SE 1.4
comment: platform:comprisesInterfacePart some JavaIo

JavaUtilAPI
type: Class
subclass of: JavaUtilAPI
comment: JavaLibrary implementing the java.util package for J2SE 1.4
comment: platform:comprisesInterfacePart some JavaUtil

JavaUtilLoggingAPI
type: Class
subclass of: JavaAPI
comment: JavaLibrary implementing the java.util.logging package for J2SE 1.4
comment: platform:comprisesInterfacePart some JavaUtilLogging

JavaUtilJarAPI
type: Class
equivalent class: JavaUtilJarAPI
subclass of: JavaUtilJarAPI
comment: JavaLibrary implementing the java.util.jar package for J2SE 1.4
comment: platform:comprisesInterfacePart some JavaUtilJar

JavaUtilZipAPI
type: Class
equivalent class: JavaUtilZipAPI
subclass of: JavaUtilZipAPI
comment: JavaLibrary implementing the java.util.zip package for J2SE 1.4
comment: platform:comprisesInterfacePart some JavaUtilZip

JavaUtilPrefsAPI
type: Class
subclass of: JavaAPI
comment: JavaLibrary implementing the java.util.prefs package for J2SE 1.4
comment: platform:comprisesInterfacePart some JavaUtilPrefs

JavaUtilRegexAPI
type: Class
subclass of: JavaAPI
comment: JavaLibrary implementing the java.util.regex package for J2SE 1.4
comment: platform:comprisesInterfacePart some JavaUtilRegex

JavaNetAPI
type: Class
subclass of: JavaNetAPI
comment: JavaLibrary implementing the java.net package for J2SE 1.4
comment: platform:comprisesInterfacePart some JavaNet

JavaSecurityAPI
type: Class
subclass of: JavaSecurityAPI
comment: JavaLibrary implementing the java.security package for J2SE 1.4
comment: platform:comprisesInterfacePart some JavaSecurity

JavaSecurityCertAPI
type: Class
subclass of: JavaSecurityCertAPI
comment: JavaLibrary implementing the java.security.cert package for J2SE 1.4
comment: platform:comprisesInterfacePart some JavaSecurityCert

JavaSecuritySpecAPI
type: Class
subclass of: JavaSecuritySpecAPI
comment: JavaLibrary implementing the java.security.spec package for J2SE 1.4
comment: platform:comprisesInterfacePart some JavaSecuritySpec

JavaSecurityAclAPI
type: Class
equivalent class: JavaSecurityAclAPI
subclass of: JavaSecurityAclAPI
comment: JavaLibrary implementing the java.security.acl package for J2SE 1.4
comment: platform:comprisesInterfacePart some JavaSecurityAcl

JavaSecurityInterfacesAPI
type: Class
subclass of: JavaSecurityInterfacesAPI
comment: JavaLibrary implementing the java.security.interfaces package for J2SE 1.4
comment: platform:comprisesInterfacePart some JavaSecurityInterfaces

JavaNioAPI
type: Class
subclass of: JavaAPI
comment: JavaLibrary implementing the java.nio package for J2SE 1.4
comment: platform:comprisesInterfacePart some JavaNio

JavaNioChannelsAPI
type: Class
subclass of: JavaAPI
comment: JavaLibrary implementing the java.nio.channels package for J2SE 1.4
comment: platform:comprisesInterfacePart some JavaNioChannels

JavaNioChannelsSpiAPI
type: Class
subclass of: JavaAPI
comment: JavaLibrary implementing the java.nio.channels.spi package for J2SE 1.4
comment: platform:comprisesInterfacePart some JavaNioChannelsSpi

JavaNioCharsetAPI
type: Class
subclass of: JavaAPI
comment: JavaLibrary implementing the java.nio.charset package for J2SE 1.4
comment: platform:comprisesInterfacePart some JavaNioCharset

JavaNioCharsetSpiAPI
type: Class
subclass of: JavaAPI
comment: JavaLibrary implementing the java.nio.charset.spi package for J2SE 1.4
comment: platform:comprisesInterfacePart some JavaNioCharsetSpi

JavaBeansAPI
type: Class
subclass of: JavaBeansAPI
comment: JavaLibrary implementing the java.beans package for J2SE 1.4
comment: platform:comprisesInterfacePart some JavaBeans

JavaBeansBeancontextAPI
type: Class
equivalent class: JavaBeansBeancontextAPI
subclass of: JavaAPI
comment: JavaLibrary implementing the java.beans.beancontext package for J2SE 1.4
comment: platform:comprisesInterfacePart some JavaBeansBeancontext

JavaAwtAPI
type: Class
subclass of: JavaAwtAPI
comment: JavaLibrary implementing the java.awt package for J2SE 1.4
comment: platform:comprisesInterfacePart some JavaAwt

JavaAwtImageAPI
type: Class
subclass of: JavaAwtImageAPI
comment: JavaLibrary implementing the java.awt.image package for J2SE 1.4
comment: platform:comprisesInterfacePart some JavaAwtImage

JavaAwtImageRenderableAPI
type: Class
equivalent class: JavaAwtImageRenderableAPI
subclass of: JavaAPI
comment: JavaLibrary implementing the java.awt.image.renderable package for J2SE 1.4
comment: platform:comprisesInterfacePart some JavaAwtImageRenderable

JavaAwtDatatransferAPI
type: Class
subclass of: JavaAwtDatatransferAPI
comment: JavaLibrary implementing the java.awt.datatransfer package for J2SE 1.4
comment: platform:comprisesInterfacePart some JavaAwtDatatransfer

JavaAwtDndAPI
type: Class
subclass of: JavaAwtDndAPI
comment: JavaLibrary implementing the java.awt.dnd package for J2SE 1.4
comment: platform:comprisesInterfacePart some JavaAwtDnd

JavaAwtEventAPI
type: Class
subclass of: JavaAwtEventAPI
comment: JavaLibrary implementing the java.awt.event package for J2SE 1.4
comment: platform:comprisesInterfacePart some JavaAwtEvent

JavaAwtImAPI
type: Class
equivalent class: JavaAwtImAPI
subclass of: JavaAwtImAPI
comment: JavaLibrary implementing the java.awt.im package for J2SE 1.4
comment: platform:comprisesInterfacePart some JavaAwtIm

JavaAwtImSpiAPI
type: Class
subclass of: JavaAwtImSpiAPI
comment: JavaLibrary implementing the java.awt.im.spi package for J2SE 1.4
comment: platform:comprisesInterfacePart some JavaAwtImSpi

JavaAwtFontAPI
type: Class
subclass of: JavaAwtFontAPI
comment: JavaLibrary implementing the java.awt.font package for J2SE 1.4
comment: platform:comprisesInterfacePart some JavaAwtFont

JavaAwtGeomAPI
type: Class
subclass of: JavaAwtGeomAPI
comment: JavaLibrary implementing the java.awt.geom package for J2SE 1.4
comment: platform:comprisesInterfacePart some JavaAwtGeom

JavaAwtColorAPI
type: Class
subclass of: JavaAwtColorAPI
comment: JavaLibrary implementing the java.awt.color package for J2SE 1.4
comment: platform:comprisesInterfacePart some JavaAwtColor

JavaAwtPrintAPI
type: Class
subclass of: JavaAwtPrintAPI
comment: JavaLibrary implementing the java.awt.print package for J2SE 1.4
comment: platform:comprisesInterfacePart some JavaAwtPrint

JavaTextAPI
type: Class
subclass of: JavaTextAPI
comment: JavaLibrary implementing the java.text package for J2SE 1.4
comment: platform:comprisesInterfacePart some JavaText

JavaMathAPI
type: Class
subclass of: JavaMathAPI
comment: JavaLibrary implementing the java.math package for J2SE 1.4
comment: platform:comprisesInterfacePart some JavaMath

JavaAppletAPI
type: Class
subclass of: JavaAppletAPI
comment: JavaLibrary implementing the java.applet package for J2SE 1.4
comment: platform:comprisesInterfacePart some JavaApplet

JavaRmiAPI
type: Class
subclass of: JavaRmiAPI
comment: JavaLibrary implementing the java.rmi package for J2SE 1.4
comment: platform:comprisesInterfacePart some JavaRmi

JavaRmiActivationAPI
type: Class
subclass of: JavaRmiActivationAPI
comment: JavaLibrary implementing the java.rmi.activation package for J2SE 1.4
comment: platform:comprisesInterfacePart some JavaRmiActivation

JavaRmiServerAPI
type: Class
subclass of: JavaRmiServerAPI
comment: JavaLibrary implementing the java.rmi.server package for J2SE 1.4
comment: platform:comprisesInterfacePart some JavaRmiServer

JavaRmiDgcAPI
type: Class
equivalent class: JavaRmiDgcAPI
subclass of: JavaAPI
comment: JavaLibrary implementing the java.rmi.dgc package for J2SE 1.4
comment: platform:comprisesInterfacePart some JavaRmiDgc

JavaRmiRegistryAPI
type: Class
equivalent class: JavaRmiRegistryAPI
subclass of: JavaRmiRegistryAPI
comment: JavaLibrary implementing the java.rmi.registry package for J2SE 1.4
comment: platform:comprisesInterfacePart some JavaRmiRegistry

JavaSqlAPI
type: Class
subclass of: JavaSqlAPI
comment: JavaLibrary implementing the java.sql package for J2SE 1.4
comment: platform:comprisesInterfacePart some JavaSql

JavaxImageioAPI
type: Class
subclass of: JavaAPI
comment: JavaLibrary implementing the javax.imageio package for J2SE 1.4
comment: platform:comprisesInterfacePart some JavaxImageio

JavaxImageioSpiAPI
type: Class
subclass of: JavaAPI
comment: JavaLibrary implementing the javax.imageio.spi package for J2SE 1.4
comment: platform:comprisesInterfacePart some JavaxImageioSpi

JavaxImageioMetadataAPI
type: Class
subclass of: JavaAPI
comment: JavaLibrary implementing the javax.imageio.metadata package for J2SE 1.4
comment: platform:comprisesInterfacePart some JavaxImageioMetadata

JavaxImageioStreamAPI
type: Class
subclass of: JavaAPI
comment: JavaLibrary implementing the javax.imageio.stream package for J2SE 1.4
comment: platform:comprisesInterfacePart some JavaxImageioStream

JavaxImageioEventAPI
type: Class
subclass of: JavaAPI
comment: JavaLibrary implementing the javax.imageio.event package for J2SE 1.4
comment: platform:comprisesInterfacePart some JavaxImageioEvent

JavaxImageioPluginsJpegAPI
type: Class
subclass of: JavaAPI
comment: JavaLibrary implementing the javax.imageio.plugins.jpeg package for J2SE 1.4
comment: platform:comprisesInterfacePart some JavaxImageioPluginsJpeg

JavaxAccessibilityAPI
type: Class
subclass of: JavaxAccessibilityAPI
comment: JavaLibrary implementing the javax.accessibility package for J2SE 1.4
comment: platform:comprisesInterfacePart some JavaxAccessibility

JavaxSwingAPI
type: Class
subclass of: JavaAPI
comment: JavaLibrary implementing the javax.swing package for J2SE 1.4
comment: platform:comprisesInterfacePart some JavaxSwing

JavaxSwingPlafAPI
type: Class
subclass of: JavaxSwingPlafAPI
comment: JavaLibrary implementing the javax.swing.plaf package for J2SE 1.4
comment: platform:comprisesInterfacePart some JavaxSwingPlaf

JavaxSwingPlafBasicAPI
type: Class
subclass of: JavaxSwingPlafBasicAPI
comment: JavaLibrary implementing the javax.swing.plaf.basic package for J2SE 1.4
comment: platform:comprisesInterfacePart some JavaxSwingPlafBasic

JavaxSwingPlafMetalAPI
type: Class
subclass of: JavaxSwingPlafMetalAPI
comment: JavaLibrary implementing the javax.swing.plaf.metal package for J2SE 1.4
comment: platform:comprisesInterfacePart some JavaxSwingPlafMetal

JavaxSwingPlafMultiAPI
type: Class
subclass of: JavaxSwingPlafMultiAPI
comment: JavaLibrary implementing the javax.swing.plaf.multi package for J2SE 1.4
comment: platform:comprisesInterfacePart some JavaxSwingPlafMulti

JavaxSwingEventAPI
type: Class
subclass of: JavaxSwingEventAPI
comment: JavaLibrary implementing the javax.swing.event package for J2SE 1.4
comment: platform:comprisesInterfacePart some JavaxSwingEvent

JavaxSwingBorderAPI
type: Class
equivalent class: JavaxSwingBorderAPI
subclass of: JavaAPI
comment: JavaLibrary implementing the javax.swing.border package for J2SE 1.4
comment: platform:comprisesInterfacePart some JavaxSwingBorder

JavaxSwingTextAPI
type: Class
subclass of: JavaxSwingTextAPI
comment: JavaLibrary implementing the javax.swing.text package for J2SE 1.4
comment: platform:comprisesInterfacePart some JavaxSwingText

JavaxSwingTextHtmlAPI
type: Class
subclass of: JavaxSwingTextHtmlAPI
comment: JavaLibrary implementing the javax.swing.text.html package for J2SE 1.4
comment: platform:comprisesInterfacePart some JavaxSwingTextHtml

JavaxSwingTextHtmlParserAPI
type: Class
equivalent class: JavaxSwingTextHtmlParserAPI
subclass of: JavaAPI
comment: JavaLibrary implementing the javax.swing.text.html.parser package for J2SE 1.4
comment: platform:comprisesInterfacePart some JavaxSwingTextHtmlParser

JavaxSwingTextRtfAPI
type: Class
equivalent class: JavaxSwingTextRtfAPI
subclass of: JavaAPI
comment: JavaLibrary implementing the javax.swing.text.rtf package for J2SE 1.4
comment: platform:comprisesInterfacePart some JavaxSwingTextRtf

JavaxSwingTableAPI
type: Class
subclass of: JavaxSwingTableAPI
comment: JavaLibrary implementing the javax.swing.table package for J2SE 1.4
comment: platform:comprisesInterfacePart some JavaxSwingTable

JavaxSwingUndoAPI
type: Class
subclass of: JavaxSwingUndoAPI
comment: JavaLibrary implementing the javax.swing.undo package for J2SE 1.4
comment: platform:comprisesInterfacePart some JavaxSwingUndo

JavaxSwingTreeAPI
type: Class
subclass of: JavaxSwingTreeAPI
comment: JavaLibrary implementing the javax.swing.tree package for J2SE 1.4
comment: platform:comprisesInterfacePart some JavaxSwingTree

JavaxSwingFilechooserAPI
type: Class
subclass of: JavaxSwingFilechooserAPI
comment: JavaLibrary implementing the javax.swing.filechooser package for J2SE 1.4
comment: platform:comprisesInterfacePart some JavaxSwingFilechooser

JavaxSwingColorchooserAPI
type: Class
subclass of: JavaxSwingColorchooserAPI
comment: JavaLibrary implementing the javax.swing.colorchooser package for J2SE 1.4
comment: platform:comprisesInterfacePart some JavaxSwingColorchooser

JavaxSoundSampledAPI
type: Class
subclass of: JavaxSoundSampledAPI
comment: JavaLibrary implementing the javax.sound.sampled package for J2SE 1.4
comment: platform:comprisesInterfacePart some JavaxSoundSampled

JavaxSoundSampledSpiAPI
type: Class
equivalent class: JavaxSoundSampledSpiAPI
subclass of: JavaAPI
comment: JavaLibrary implementing the javax.sound.sampled.spi package for J2SE 1.4
comment: platform:comprisesInterfacePart some JavaxSoundSampledSpi

JavaxSoundMidiAPI
type: Class
subclass of: JavaxSoundMidiAPI
comment: JavaLibrary implementing the javax.sound.midi package for J2SE 1.4
comment: platform:comprisesInterfacePart some JavaxSoundMidi

JavaxSoundMidiSpiAPI
type: Class
equivalent class: JavaxSoundMidiSpiAPI
subclass of: JavaAPI
comment: JavaLibrary implementing the javax.sound.midi.spi package for J2SE 1.4
comment: platform:comprisesInterfacePart some JavaxSoundMidiSpi

JavaxPrintAPI
type: Class
subclass of: JavaAPI
comment: JavaLibrary implementing the javax.print package for J2SE 1.4
comment: platform:comprisesInterfacePart some JavaxPrint

JavaxPrintAttributeAPI
type: Class
subclass of: JavaAPI
comment: JavaLibrary implementing the javax.print.attribute package for J2SE 1.4
comment: platform:comprisesInterfacePart some JavaxPrintAttribute

JavaxPrintAttributeStandardAPI
type: Class
subclass of: JavaAPI
comment: JavaLibrary implementing the javax.print.attribute.standard package for J2SE 1.4
comment: platform:comprisesInterfacePart some JavaxPrintAttributeStandard

JavaxPrintEventAPI
type: Class
subclass of: JavaAPI
comment: JavaLibrary implementing the javax.print.event package for J2SE 1.4
comment: platform:comprisesInterfacePart some JavaxPrintEvent

JavaxSecurityAuthAPI
type: Class
subclass of: JavaAPI
comment: JavaLibrary implementing the javax.security.auth package for J2SE 1.4
comment: platform:comprisesInterfacePart some JavaxSecurityAuth

JavaxSecurityAuthX500API
type: Class
subclass of: JavaxSecurityAuthX500API
comment: JavaLibrary implementing the javax.security.auth.x500 package for J2SE 1.4
comment: platform:comprisesInterfacePart some JavaxSecurityAuthX500

JavaxSecurityAuthCallbackAPI
type: Class
subclass of: JavaAPI
comment: JavaLibrary implementing the javax.security.auth.callback package for J2SE 1.4
comment: platform:comprisesInterfacePart some JavaxSecurityAuthCallback

JavaxSecurityAuthKerberosAPI
type: Class
subclass of: JavaAPI
comment: JavaLibrary implementing the javax.security.auth.kerberos package for J2SE 1.4
comment: platform:comprisesInterfacePart some JavaxSecurityAuthKerberos

JavaxSecurityAuthLoginAPI
type: Class
subclass of: JavaAPI
comment: JavaLibrary implementing the javax.security.auth.login package for J2SE 1.4
comment: platform:comprisesInterfacePart some JavaxSecurityAuthLogin

JavaxSecurityAuthSpiAPI
type: Class
subclass of: JavaAPI
comment: JavaLibrary implementing the javax.security.auth.spi package for J2SE 1.4
comment: platform:comprisesInterfacePart some JavaxSecurityAuthSpi

JavaxSecurityCertAPI
type: Class
subclass of: JavaAPI
comment: JavaLibrary implementing the javax.security.cert package for J2SE 1.4
comment: platform:comprisesInterfacePart some JavaxSecurityCert

JavaxNamingAPI
type: Class
subclass of: JavaxNamingAPI
comment: JavaLibrary implementing the javax.naming package for J2SE 1.4
comment: platform:comprisesInterfacePart some JavaxNaming

JavaxNamingDirectoryAPI
type: Class
subclass of: JavaxNamingDirectoryAPI
comment: JavaLibrary implementing the javax.naming.directory package for J2SE 1.4
comment: platform:comprisesInterfacePart some JavaxNamingDirectory

JavaxNamingEventAPI
type: Class
equivalent class: JavaxNamingEventAPI
subclass of: JavaAPI
comment: JavaLibrary implementing the javax.naming.event package for J2SE 1.4
comment: platform:comprisesInterfacePart some JavaxNamingEvent

JavaxNamingLdapAPI
type: Class
subclass of: JavaxNamingLdapAPI
comment: JavaLibrary implementing the javax.naming.ldap package for J2SE 1.4
comment: platform:comprisesInterfacePart some JavaxNamingLdap

JavaxNamingSpiAPI
type: Class
equivalent class: JavaxNamingSpiAPI
subclass of: JavaAPI
comment: JavaLibrary implementing the javax.naming.spi package for J2SE 1.4
comment: platform:comprisesInterfacePart some JavaxNamingSpi

JavaxNetAPI
type: Class
subclass of: JavaAPI
comment: JavaLibrary implementing the javax.net package for J2SE 1.4
comment: platform:comprisesInterfacePart some JavaxNet

JavaxNetSslAPI
type: Class
subclass of: JavaAPI
comment: JavaLibrary implementing the javax.net.ssl package for J2SE 1.4
comment: platform:comprisesInterfacePart some JavaxNetSsl

JavaxRmiAPI
type: Class
equivalent class: JavaxRmiAPI
subclass of: JavaAPI
comment: JavaLibrary implementing the javax.rmi package for J2SE 1.4
comment: platform:comprisesInterfacePart some JavaxRmi

JavaxRmiCORBAAPI
type: Class
equivalent class: JavaxRmiCORBAAPI
subclass of: JavaAPI
comment: JavaLibrary implementing the javax.rmi.CORBA package for J2SE 1.4
comment: platform:comprisesInterfacePart some JavaxRmiCORBA

JavaxCryptoAPI
type: Class
subclass of: JavaAPI
comment: JavaLibrary implementing the javax.crypto package for J2SE 1.4
comment: platform:comprisesInterfacePart some JavaxCrypto

JavaxCryptoInterfacesAPI
type: Class
subclass of: JavaAPI
comment: JavaLibrary implementing the javax.crypto.interfaces package for J2SE 1.4
comment: platform:comprisesInterfacePart some JavaxCryptoInterfaces

JavaxCryptoSpecAPI
type: Class
subclass of: JavaAPI
comment: JavaLibrary implementing the javax.crypto.spec package for J2SE 1.4
comment: platform:comprisesInterfacePart some JavaxCryptoSpec

JavaxSqlAPI
type: Class
subclass of: JavaAPI
comment: JavaLibrary implementing the javax.sql package for J2SE 1.4
comment: platform:comprisesInterfacePart some JavaxSql

JavaxTransactionAPI
type: Class
subclass of: JavaxTransactionAPI
comment: JavaLibrary implementing the javax.transaction package for J2SE 1.4
comment: platform:comprisesInterfacePart some JavaxTransaction

JavaxTransactionXaAPI
type: Class
subclass of: JavaAPI
comment: JavaLibrary implementing the javax.transaction.xa package for J2SE 1.4
comment: platform:comprisesInterfacePart some JavaxTransactionXa

JavaxXmlParsersAPI
type: Class
subclass of: JavaAPI
comment: JavaLibrary implementing the javax.xml.parsers package for J2SE 1.4
comment: platform:comprisesInterfacePart some JavaxXmlParsers

JavaxXmlTransformAPI
type: Class
subclass of: JavaAPI
comment: JavaLibrary implementing the javax.xml.transform package for J2SE 1.4
comment: platform:comprisesInterfacePart some JavaxXmlTransform

JavaxXmlTransformDomAPI
type: Class
subclass of: JavaAPI
comment: JavaLibrary implementing the javax.xml.transform.dom package for J2SE 1.4
comment: platform:comprisesInterfacePart some JavaxXmlTransformDom

JavaxXmlTransformSaxAPI
type: Class
subclass of: JavaAPI
comment: JavaLibrary implementing the javax.xml.transform.sax package for J2SE 1.4
comment: platform:comprisesInterfacePart some JavaxXmlTransformSax

JavaxXmlTransformStreamAPI
type: Class
subclass of: JavaAPI
comment: JavaLibrary implementing the javax.xml.transform.stream package for J2SE 1.4
comment: platform:comprisesInterfacePart some JavaxXmlTransformStream

OrgW3cDomAPI
type: Class
subclass of: JavaAPI
comment: JavaLibrary implementing the org.w3c.dom package for J2SE 1.4
comment: platform:comprisesInterfacePart some OrgW3cDom

OrgW3cDomCssAPI
type: Class
subclass of: JavaAPI
comment: JavaLibrary implementing the org.w3c.dom.css package for J2SE 1.4
comment: platform:comprisesInterfacePart some OrgW3cDomCss

OrgW3cDomStylesheetsAPI
type: Class
subclass of: JavaAPI
comment: JavaLibrary implementing the org.w3c.dom.stylesheets package for J2SE 1.4
comment: platform:comprisesInterfacePart some OrgW3cDomStylesheets

OrgW3cDomViewsAPI
type: Class
subclass of: JavaAPI
comment: JavaLibrary implementing the org.w3c.dom.views package for J2SE 1.4
comment: platform:comprisesInterfacePart some OrgW3cDomViews

OrgW3cDomEventsAPI
type: Class
subclass of: JavaAPI
comment: JavaLibrary implementing the org.w3c.dom.events package for J2SE 1.4
comment: platform:comprisesInterfacePart some OrgW3cDomEvents

OrgW3cDomHtmlAPI
type: Class
subclass of: JavaAPI
comment: JavaLibrary implementing the org.w3c.dom.html package for J2SE 1.4
comment: platform:comprisesInterfacePart some OrgW3cDomHtml

OrgW3cDomTraversalAPI
type: Class
subclass of: JavaAPI
comment: JavaLibrary implementing the org.w3c.dom.traversal package for J2SE 1.4
comment: platform:comprisesInterfacePart some OrgW3cDomTraversal

OrgOmgCORBA 2 3API
type: Class
equivalent class: OrgOmgCORBA 2 3API
subclass of: JavaAPI
comment: JavaLibrary implementing the org.omg.CORBA_2_3 package for J2SE 1.4
comment: platform:comprisesInterfacePart some OrgOmgCORBA_2_3

OrgOmgCORBA 2 3PortableAPI
type: Class
subclass of: JavaAPI
comment: JavaLibrary implementing the org.omg.CORBA_2_3.portable package for J2SE 1.4
comment: platform:comprisesInterfacePart some OrgOmgCORBA_2_3Portable

OrgOmgCORBAAPI
type: Class
subclass of: JavaAPI
comment: JavaLibrary implementing the org.omg.CORBA package for J2SE 1.4
comment: platform:comprisesInterfacePart some OrgOmgCORBA

OrgOmgCORBAPortableAPI
type: Class
subclass of: JavaAPI
comment: JavaLibrary implementing the org.omg.CORBA.portable package for J2SE 1.4
comment: platform:comprisesInterfacePart some OrgOmgCORBAPortable

OrgOmgCORBADynAnyPackageAPI
type: Class
subclass of: OrgOmgCORBADynAnyPackageAPI
comment: JavaLibrary implementing the org.omg.CORBA.DynAnyPackage package for J2SE 1.4
comment: platform:comprisesInterfacePart some OrgOmgCORBADynAnyPackage

OrgOmgCORBAORBPackageAPI
type: Class
subclass of: OrgOmgCORBAORBPackageAPI
comment: JavaLibrary implementing the org.omg.CORBA.ORBPackage package for J2SE 1.4
comment: platform:comprisesInterfacePart some OrgOmgCORBAORBPackage

OrgOmgCORBATypeCodePackageAPI
type: Class
subclass of: OrgOmgCORBATypeCodePackageAPI
comment: JavaLibrary implementing the org.omg.CORBA.TypeCodePackage package for J2SE 1.4
comment: platform:comprisesInterfacePart some OrgOmgCORBATypeCodePackage

OrgOmgSendingContextAPI
type: Class
equivalent class: OrgOmgSendingContextAPI
subclass of: JavaAPI
comment: JavaLibrary implementing the org.omg.SendingContext package for J2SE 1.4
comment: platform:comprisesInterfacePart some OrgOmgSendingContext

OrgOmgCosNamingAPI
type: Class
subclass of: JavaAPI
comment: JavaLibrary implementing the org.omg.CosNaming package for J2SE 1.4
comment: platform:comprisesInterfacePart some OrgOmgCosNaming

OrgOmgCosNamingNamingContextExtPackageAPI
type: Class
subclass of: JavaAPI
comment: JavaLibrary implementing the org.omg.CosNaming.NamingContextExtPackage package for J2SE 1.4
comment: platform:comprisesInterfacePart some OrgOmgCosNamingNamingContextExtPackage

OrgOmgCosNamingNamingContextPackageAPI
type: Class
subclass of: JavaAPI
comment: JavaLibrary implementing the org.omg.CosNaming.NamingContextPackage package for J2SE 1.4
comment: platform:comprisesInterfacePart some OrgOmgCosNamingNamingContextPackage

OrgOmgPortableServerAPI
type: Class
subclass of: JavaAPI
comment: JavaLibrary implementing the org.omg.PortableServer package for J2SE 1.4
comment: platform:comprisesInterfacePart some OrgOmgPortableServer

OrgOmgPortableServerCurrentPackageAPI
type: Class
subclass of: JavaAPI
comment: JavaLibrary implementing the org.omg.PortableServer.CurrentPackage package for J2SE 1.4
comment: platform:comprisesInterfacePart some OrgOmgPortableServerCurrentPackage

OrgOmgPortableServerPOAManagerPackageAPI
type: Class
subclass of: JavaAPI
comment: JavaLibrary implementing the org.omg.PortableServer.POAManagerPackage package for J2SE 1.4
comment: platform:comprisesInterfacePart some OrgOmgPortableServerPOAManagerPackage

OrgOmgPortableServerPOAPackageAPI
type: Class
subclass of: JavaAPI
comment: JavaLibrary implementing the org.omg.PortableServer.POAPackage package for J2SE 1.4
comment: platform:comprisesInterfacePart some OrgOmgPortableServerPOAPackage

OrgOmgPortableServerPortableAPI
type: Class
subclass of: JavaAPI
comment: JavaLibrary implementing the org.omg.PortableServer.portable package for J2SE 1.4
comment: platform:comprisesInterfacePart some OrgOmgPortableServerPortable

OrgOmgPortableServerServantLocatorPackageAPI
type: Class
subclass of: JavaAPI
comment: JavaLibrary implementing the org.omg.PortableServer.ServantLocatorPackage package for J2SE 1.4
comment: platform:comprisesInterfacePart some OrgOmgPortableServerServantLocatorPackage

OrgOmgDynamicAPI
type: Class
subclass of: JavaAPI
comment: JavaLibrary implementing the org.omg.Dynamic package for J2SE 1.4
comment: platform:comprisesInterfacePart some OrgOmgDynamic

OrgOmgDynamicAnyAPI
type: Class
subclass of: JavaAPI
comment: JavaLibrary implementing the org.omg.DynamicAny package for J2SE 1.4
comment: platform:comprisesInterfacePart some OrgOmgDynamicAny

OrgOmgDynamicAnyDynAnyFactoryPackageAPI
type: Class
subclass of: JavaAPI
comment: JavaLibrary implementing the org.omg.DynamicAny.DynAnyFactoryPackage package for J2SE 1.4
comment: platform:comprisesInterfacePart some OrgOmgDynamicAnyDynAnyFactoryPackage

OrgOmgDynamicAnyDynAnyPackageAPI
type: Class
subclass of: JavaAPI
comment: JavaLibrary implementing the org.omg.DynamicAny.DynAnyPackage package for J2SE 1.4
comment: platform:comprisesInterfacePart some OrgOmgDynamicAnyDynAnyPackage

OrgOmgIOPAPI
type: Class
subclass of: JavaAPI
comment: JavaLibrary implementing the org.omg.IOP package for J2SE 1.4
comment: platform:comprisesInterfacePart some OrgOmgIOP

OrgOmgIOPCodecFactoryPackageAPI
type: Class
subclass of: JavaAPI
comment: JavaLibrary implementing the org.omg.IOP.CodecFactoryPackage package for J2SE 1.4
comment: platform:comprisesInterfacePart some OrgOmgIOPCodecFactoryPackage

OrgOmgIOPCodecPackageAPI
type: Class
subclass of: JavaAPI
comment: JavaLibrary implementing the org.omg.IOP.CodecPackage package for J2SE 1.4
comment: platform:comprisesInterfacePart some OrgOmgIOPCodecPackage

OrgOmgMessagingAPI
type: Class
subclass of: JavaAPI
comment: JavaLibrary implementing the org.omg.Messaging package for J2SE 1.4
comment: platform:comprisesInterfacePart some OrgOmgMessaging

OrgOmgPortableInterceptorAPI
type: Class
subclass of: JavaAPI
comment: JavaLibrary implementing the org.omg.PortableInterceptor package for J2SE 1.4
comment: platform:comprisesInterfacePart some OrgOmgPortableInterceptor

OrgOmgPortableInterceptorORBInitInfoPackageAPI
type: Class
subclass of: JavaAPI
comment: JavaLibrary implementing the org.omg.PortableInterceptor.ORBInitInfoPackage package for J2SE 1.4
comment: platform:comprisesInterfacePart some OrgOmgPortableInterceptorORBInitInfoPackage

OrgOmgStubJavaRmiAPI
type: Class
equivalent class: OrgOmgStubJavaRmiAPI
subclass of: JavaAPI
comment: JavaLibrary implementing the org.omg.stub.java.rmi package for J2SE 1.4
comment: platform:comprisesInterfacePart some OrgOmgStubJavaRmi

OrgXmlSaxAPI
type: Class
subclass of: JavaAPI
comment: JavaLibrary implementing the org.xml.sax package for J2SE 1.4
comment: platform:comprisesInterfacePart some OrgXmlSax

OrgXmlSaxHelpersAPI
type: Class
subclass of: JavaAPI
comment: JavaLibrary implementing the org.xml.sax.helpers package for J2SE 1.4
comment: platform:comprisesInterfacePart some OrgXmlSaxHelpers

OrgXmlSaxExtAPI
type: Class
subclass of: JavaAPI
comment: JavaLibrary implementing the org.xml.sax.ext package for J2SE 1.4
comment: platform:comprisesInterfacePart some OrgXmlSaxExt

OrgIetfJgssAPI
type: Class
subclass of: JavaAPI
comment: JavaLibrary implementing the org.ietf.jgss package for J2SE 1.4
comment: platform:comprisesInterfacePart some OrgIetfJgss

JavaLangClassLibrary
type: Class
subclass of: JavaLangClassLibrary
comment: JavaLibrary implementing the java.lang package for J2SE 1.4
comment: platform:implementsInterface some JavaLangAPI

JavaLangReflectClassLibrary
type: Class
equivalent class: JavaLangReflectClassLibrary
subclass of: JavaLangReflectClassLibrary
comment: JavaLibrary implementing the java.lang.reflect package for J2SE 1.4
comment: platform:implementsInterface some JavaLangReflectAPI

JavaLangRefClassLibrary
type: Class
equivalent class: JavaLangRefClassLibrary
subclass of: JavaClassLibrary
comment: JavaLibrary implementing the java.lang.ref package for J2SE 1.4
comment: platform:implementsInterface some JavaLangRefAPI

JavaIoClassLibrary
type: Class
subclass of: JavaIoClassLibrary
comment: JavaLibrary implementing the java.io package for J2SE 1.4
comment: platform:implementsInterface some JavaIoAPI

JavaUtilClassLibrary
type: Class
subclass of: JavaUtilClassLibrary
comment: JavaLibrary implementing the java.util package for J2SE 1.4
comment: platform:implementsInterface some JavaUtilAPI

JavaUtilLoggingClassLibrary
type: Class
subclass of: JavaClassLibrary
comment: JavaLibrary implementing the java.util.logging package for J2SE 1.4
comment: platform:implementsInterface some JavaUtilLoggingAPI

JavaUtilJarClassLibrary
type: Class
equivalent class: JavaUtilJarClassLibrary
subclass of: JavaUtilJarClassLibrary
comment: JavaLibrary implementing the java.util.jar package for J2SE 1.4
comment: platform:implementsInterface some JavaUtilJarAPI

JavaUtilZipClassLibrary
type: Class
equivalent class: JavaUtilZipClassLibrary
subclass of: JavaUtilZipClassLibrary
comment: JavaLibrary implementing the java.util.zip package for J2SE 1.4
comment: platform:implementsInterface some JavaUtilZipAPI

JavaUtilPrefsClassLibrary
type: Class
subclass of: JavaClassLibrary
comment: JavaLibrary implementing the java.util.prefs package for J2SE 1.4
comment: platform:implementsInterface some JavaUtilPrefsAPI

JavaUtilRegexClassLibrary
type: Class
subclass of: JavaClassLibrary
comment: JavaLibrary implementing the java.util.regex package for J2SE 1.4
comment: platform:implementsInterface some JavaUtilRegexAPI

JavaNetClassLibrary
type: Class
subclass of: JavaNetClassLibrary
comment: JavaLibrary implementing the java.net package for J2SE 1.4
comment: platform:implementsInterface some JavaNetAPI

JavaSecurityClassLibrary
type: Class
subclass of: JavaSecurityClassLibrary
comment: JavaLibrary implementing the java.security package for J2SE 1.4
comment: platform:implementsInterface some JavaSecurityAPI

JavaSecurityCertClassLibrary
type: Class
subclass of: JavaSecurityCertClassLibrary
comment: JavaLibrary implementing the java.security.cert package for J2SE 1.4
comment: platform:implementsInterface some JavaSecurityCertAPI

JavaSecuritySpecClassLibrary
type: Class
subclass of: JavaSecuritySpecClassLibrary
comment: JavaLibrary implementing the java.security.spec package for J2SE 1.4
comment: platform:implementsInterface some JavaSecuritySpecAPI

JavaSecurityAclClassLibrary
type: Class
equivalent class: JavaSecurityAclClassLibrary
subclass of: JavaSecurityAclClassLibrary
comment: JavaLibrary implementing the java.security.acl package for J2SE 1.4
comment: platform:implementsInterface some JavaSecurityAclAPI

JavaSecurityInterfacesClassLibrary
type: Class
subclass of: JavaSecurityInterfacesClassLibrary
comment: JavaLibrary implementing the java.security.interfaces package for J2SE 1.4
comment: platform:implementsInterface some JavaSecurityInterfacesAPI

JavaNioClassLibrary
type: Class
subclass of: JavaClassLibrary
comment: JavaLibrary implementing the java.nio package for J2SE 1.4
comment: platform:implementsInterface some JavaNioAPI

JavaNioChannelsClassLibrary
type: Class
subclass of: JavaClassLibrary
comment: JavaLibrary implementing the java.nio.channels package for J2SE 1.4
comment: platform:implementsInterface some JavaNioChannelsAPI

JavaNioChannelsSpiClassLibrary
type: Class
subclass of: JavaClassLibrary
comment: JavaLibrary implementing the java.nio.channels.spi package for J2SE 1.4
comment: platform:implementsInterface some JavaNioChannelsSpiAPI

JavaNioCharsetClassLibrary
type: Class
subclass of: JavaClassLibrary
comment: JavaLibrary implementing the java.nio.charset package for J2SE 1.4
comment: platform:implementsInterface some JavaNioCharsetAPI

JavaNioCharsetSpiClassLibrary
type: Class
subclass of: JavaClassLibrary
comment: JavaLibrary implementing the java.nio.charset.spi package for J2SE 1.4
comment: platform:implementsInterface some JavaNioCharsetSpiAPI

JavaBeansClassLibrary
type: Class
subclass of: JavaBeansClassLibrary
comment: JavaLibrary implementing the java.beans package for J2SE 1.4
comment: platform:implementsInterface some JavaBeansAPI

JavaBeansBeancontextClassLibrary
type: Class
equivalent class: JavaBeansBeancontextClassLibrary
subclass of: JavaClassLibrary
comment: JavaLibrary implementing the java.beans.beancontext package for J2SE 1.4
comment: platform:implementsInterface some JavaBeansBeancontextAPI

JavaAwtClassLibrary
type: Class
subclass of: JavaAwtClassLibrary
comment: JavaLibrary implementing the java.awt package for J2SE 1.4
comment: platform:implementsInterface some JavaAwtAPI

JavaAwtImageClassLibrary
type: Class
subclass of: JavaAwtImageClassLibrary
comment: JavaLibrary implementing the java.awt.image package for J2SE 1.4
comment: platform:implementsInterface some JavaAwtImageAPI

JavaAwtImageRenderableClassLibrary
type: Class
equivalent class: JavaAwtImageRenderableClassLibrary
subclass of: JavaClassLibrary
comment: JavaLibrary implementing the java.awt.image.renderable package for J2SE 1.4
comment: platform:implementsInterface some JavaAwtImageRenderableAPI

JavaAwtDatatransferClassLibrary
type: Class
subclass of: JavaAwtDatatransferClassLibrary
comment: JavaLibrary implementing the java.awt.datatransfer package for J2SE 1.4
comment: platform:implementsInterface some JavaAwtDatatransferAPI

JavaAwtDndClassLibrary
type: Class
subclass of: JavaAwtDndClassLibrary
comment: JavaLibrary implementing the java.awt.dnd package for J2SE 1.4
comment: platform:implementsInterface some JavaAwtDndAPI

JavaAwtEventClassLibrary
type: Class
subclass of: JavaAwtEventClassLibrary
comment: JavaLibrary implementing the java.awt.event package for J2SE 1.4
comment: platform:implementsInterface some JavaAwtEventAPI

JavaAwtImClassLibrary
type: Class
equivalent class: JavaAwtImClassLibrary
subclass of: JavaAwtImClassLibrary
comment: JavaLibrary implementing the java.awt.im package for J2SE 1.4
comment: platform:implementsInterface some JavaAwtImAPI

JavaAwtImSpiClassLibrary
type: Class
subclass of: JavaAwtImSpiClassLibrary
comment: JavaLibrary implementing the java.awt.im.spi package for J2SE 1.4
comment: platform:implementsInterface some JavaAwtImSpiAPI

JavaAwtFontClassLibrary
type: Class
subclass of: JavaAwtFontClassLibrary
comment: JavaLibrary implementing the java.awt.font package for J2SE 1.4
comment: platform:implementsInterface some JavaAwtFontAPI

JavaAwtGeomClassLibrary
type: Class
subclass of: JavaAwtGeomClassLibrary
comment: JavaLibrary implementing the java.awt.geom package for J2SE 1.4
comment: platform:implementsInterface some JavaAwtGeomAPI

JavaAwtColorClassLibrary
type: Class
subclass of: JavaAwtColorClassLibrary
comment: JavaLibrary implementing the java.awt.color package for J2SE 1.4
comment: platform:implementsInterface some JavaAwtColorAPI

JavaAwtPrintClassLibrary
type: Class
subclass of: JavaAwtPrintClassLibrary
comment: JavaLibrary implementing the java.awt.print package for J2SE 1.4
comment: platform:implementsInterface some JavaAwtPrintAPI

JavaTextClassLibrary
type: Class
subclass of: JavaTextClassLibrary
comment: JavaLibrary implementing the java.text package for J2SE 1.4
comment: platform:implementsInterface some JavaTextAPI

JavaMathClassLibrary
type: Class
subclass of: JavaMathClassLibrary
comment: JavaLibrary implementing the java.math package for J2SE 1.4
comment: platform:implementsInterface some JavaMathAPI

JavaAppletClassLibrary
type: Class
subclass of: JavaAppletClassLibrary
comment: JavaLibrary implementing the java.applet package for J2SE 1.4
comment: platform:implementsInterface some JavaAppletAPI

JavaRmiClassLibrary
type: Class
subclass of: JavaRmiClassLibrary
comment: JavaLibrary implementing the java.rmi package for J2SE 1.4
comment: platform:implementsInterface some JavaRmiAPI

JavaRmiActivationClassLibrary
type: Class
subclass of: JavaRmiActivationClassLibrary
comment: JavaLibrary implementing the java.rmi.activation package for J2SE 1.4
comment: platform:implementsInterface some JavaRmiActivationAPI

JavaRmiServerClassLibrary
type: Class
subclass of: JavaRmiServerClassLibrary
comment: JavaLibrary implementing the java.rmi.server package for J2SE 1.4
comment: platform:implementsInterface some JavaRmiServerAPI

JavaRmiDgcClassLibrary
type: Class
equivalent class: JavaRmiDgcClassLibrary
subclass of: JavaClassLibrary
comment: JavaLibrary implementing the java.rmi.dgc package for J2SE 1.4
comment: platform:implementsInterface some JavaRmiDgcAPI

JavaRmiRegistryClassLibrary
type: Class
equivalent class: JavaRmiRegistryClassLibrary
subclass of: JavaRmiRegistryClassLibrary
comment: JavaLibrary implementing the java.rmi.registry package for J2SE 1.4
comment: platform:implementsInterface some JavaRmiRegistryAPI

JavaSqlClassLibrary
type: Class
subclass of: JavaSqlClassLibrary
comment: JavaLibrary implementing the java.sql package for J2SE 1.4
comment: platform:implementsInterface some JavaSqlAPI

JavaxImageioClassLibrary
type: Class
subclass of: JavaClassLibrary
comment: JavaLibrary implementing the javax.imageio package for J2SE 1.4
comment: platform:implementsInterface some JavaxImageioAPI

JavaxImageioSpiClassLibrary
type: Class
subclass of: JavaClassLibrary
comment: JavaLibrary implementing the javax.imageio.spi package for J2SE 1.4
comment: platform:implementsInterface some JavaxImageioSpiAPI

JavaxImageioMetadataClassLibrary
type: Class
subclass of: JavaClassLibrary
comment: JavaLibrary implementing the javax.imageio.metadata package for J2SE 1.4
comment: platform:implementsInterface some JavaxImageioMetadataAPI

JavaxImageioStreamClassLibrary
type: Class
subclass of: JavaClassLibrary
comment: JavaLibrary implementing the javax.imageio.stream package for J2SE 1.4
comment: platform:implementsInterface some JavaxImageioStreamAPI

JavaxImageioEventClassLibrary
type: Class
subclass of: JavaClassLibrary
comment: JavaLibrary implementing the javax.imageio.event package for J2SE 1.4
comment: platform:implementsInterface some JavaxImageioEventAPI

JavaxImageioPluginsJpegClassLibrary
type: Class
subclass of: JavaClassLibrary
comment: JavaLibrary implementing the javax.imageio.plugins.jpeg package for J2SE 1.4
comment: platform:implementsInterface some JavaxImageioPluginsJpegAPI

JavaxAccessibilityClassLibrary
type: Class
subclass of: JavaxAccessibilityClassLibrary
comment: JavaLibrary implementing the javax.accessibility package for J2SE 1.4
comment: platform:implementsInterface some JavaxAccessibilityAPI

JavaxSwingClassLibrary
type: Class
subclass of: JavaClassLibrary
comment: JavaLibrary implementing the javax.swing package for J2SE 1.4
comment: platform:implementsInterface some JavaxSwingAPI

JavaxSwingPlafClassLibrary
type: Class
subclass of: JavaxSwingPlafClassLibrary
comment: JavaLibrary implementing the javax.swing.plaf package for J2SE 1.4
comment: platform:implementsInterface some JavaxSwingPlafAPI

JavaxSwingPlafBasicClassLibrary
type: Class
subclass of: JavaxSwingPlafBasicClassLibrary
comment: JavaLibrary implementing the javax.swing.plaf.basic package for J2SE 1.4
comment: platform:implementsInterface some JavaxSwingPlafBasicAPI

JavaxSwingPlafMetalClassLibrary
type: Class
subclass of: JavaxSwingPlafMetalClassLibrary
comment: JavaLibrary implementing the javax.swing.plaf.metal package for J2SE 1.4
comment: platform:implementsInterface some JavaxSwingPlafMetalAPI

JavaxSwingPlafMultiClassLibrary
type: Class
subclass of: JavaxSwingPlafMultiClassLibrary
comment: JavaLibrary implementing the javax.swing.plaf.multi package for J2SE 1.4
comment: platform:implementsInterface some JavaxSwingPlafMultiAPI

JavaxSwingEventClassLibrary
type: Class
subclass of: JavaxSwingEventClassLibrary
comment: JavaLibrary implementing the javax.swing.event package for J2SE 1.4
comment: platform:implementsInterface some JavaxSwingEventAPI

JavaxSwingBorderClassLibrary
type: Class
equivalent class: JavaxSwingBorderClassLibrary
subclass of: JavaClassLibrary
comment: JavaLibrary implementing the javax.swing.border package for J2SE 1.4
comment: platform:implementsInterface some JavaxSwingBorderAPI

JavaxSwingTextClassLibrary
type: Class
subclass of: JavaxSwingTextClassLibrary
comment: JavaLibrary implementing the javax.swing.text package for J2SE 1.4
comment: platform:implementsInterface some JavaxSwingTextAPI

JavaxSwingTextHtmlClassLibrary
type: Class
subclass of: JavaxSwingTextHtmlClassLibrary
comment: JavaLibrary implementing the javax.swing.text.html package for J2SE 1.4
comment: platform:implementsInterface some JavaxSwingTextHtmlAPI

JavaxSwingTextHtmlParserClassLibrary
type: Class
equivalent class: JavaxSwingTextHtmlParserClassLibrary
subclass of: JavaClassLibrary
comment: JavaLibrary implementing the javax.swing.text.html.parser package for J2SE 1.4
comment: platform:implementsInterface some JavaxSwingTextHtmlParserAPI

JavaxSwingTextRtfClassLibrary
type: Class
equivalent class: JavaxSwingTextRtfClassLibrary
subclass of: JavaClassLibrary
comment: JavaLibrary implementing the javax.swing.text.rtf package for J2SE 1.4
comment: platform:implementsInterface some JavaxSwingTextRtfAPI

JavaxSwingTableClassLibrary
type: Class
subclass of: JavaxSwingTableClassLibrary
comment: JavaLibrary implementing the javax.swing.table package for J2SE 1.4
comment: platform:implementsInterface some JavaxSwingTableAPI

JavaxSwingUndoClassLibrary
type: Class
subclass of: JavaxSwingUndoClassLibrary
comment: JavaLibrary implementing the javax.swing.undo package for J2SE 1.4
comment: platform:implementsInterface some JavaxSwingUndoAPI

JavaxSwingTreeClassLibrary
type: Class
subclass of: JavaxSwingTreeClassLibrary
comment: JavaLibrary implementing the javax.swing.tree package for J2SE 1.4
comment: platform:implementsInterface some JavaxSwingTreeAPI

JavaxSwingFilechooserClassLibrary
type: Class
subclass of: JavaxSwingFilechooserClassLibrary
comment: JavaLibrary implementing the javax.swing.filechooser package for J2SE 1.4
comment: platform:implementsInterface some JavaxSwingFilechooserAPI

JavaxSwingColorchooserClassLibrary
type: Class
subclass of: JavaxSwingColorchooserClassLibrary
comment: JavaLibrary implementing the javax.swing.colorchooser package for J2SE 1.4
comment: platform:implementsInterface some JavaxSwingColorchooserAPI

JavaxSoundSampledClassLibrary
type: Class
subclass of: JavaxSoundSampledClassLibrary
comment: JavaLibrary implementing the javax.sound.sampled package for J2SE 1.4
comment: platform:implementsInterface some JavaxSoundSampledAPI

JavaxSoundSampledSpiClassLibrary
type: Class
equivalent class: JavaxSoundSampledSpiClassLibrary
subclass of: JavaClassLibrary
comment: JavaLibrary implementing the javax.sound.sampled.spi package for J2SE 1.4
comment: platform:implementsInterface some JavaxSoundSampledSpiAPI

JavaxSoundMidiClassLibrary
type: Class
subclass of: JavaxSoundMidiClassLibrary
comment: JavaLibrary implementing the javax.sound.midi package for J2SE 1.4
comment: platform:implementsInterface some JavaxSoundMidiAPI

JavaxSoundMidiSpiClassLibrary
type: Class
equivalent class: JavaxSoundMidiSpiClassLibrary
subclass of: JavaClassLibrary
comment: JavaLibrary implementing the javax.sound.midi.spi package for J2SE 1.4
comment: platform:implementsInterface some JavaxSoundMidiSpiAPI

JavaxPrintClassLibrary
type: Class
subclass of: JavaClassLibrary
comment: JavaLibrary implementing the javax.print package for J2SE 1.4
comment: platform:implementsInterface some JavaxPrintAPI

JavaxPrintAttributeClassLibrary
type: Class
subclass of: JavaClassLibrary
comment: JavaLibrary implementing the javax.print.attribute package for J2SE 1.4
comment: platform:implementsInterface some JavaxPrintAttributeAPI

JavaxPrintAttributeStandardClassLibrary
type: Class
subclass of: JavaClassLibrary
comment: JavaLibrary implementing the javax.print.attribute.standard package for J2SE 1.4
comment: platform:implementsInterface some JavaxPrintAttributeStandardAPI

JavaxPrintEventClassLibrary
type: Class
subclass of: JavaClassLibrary
comment: JavaLibrary implementing the javax.print.event package for J2SE 1.4
comment: platform:implementsInterface some JavaxPrintEventAPI

JavaxSecurityAuthClassLibrary
type: Class
subclass of: JavaClassLibrary
comment: JavaLibrary implementing the javax.security.auth package for J2SE 1.4
comment: platform:implementsInterface some JavaxSecurityAuthAPI

JavaxSecurityAuthX500ClassLibrary
type: Class
subclass of: JavaxSecurityAuthX500ClassLibrary
comment: JavaLibrary implementing the javax.security.auth.x500 package for J2SE 1.4
comment: platform:implementsInterface some JavaxSecurityAuthX500API

JavaxSecurityAuthCallbackClassLibrary
type: Class
subclass of: JavaClassLibrary
comment: JavaLibrary implementing the javax.security.auth.callback package for J2SE 1.4
comment: platform:implementsInterface some JavaxSecurityAuthCallbackAPI

JavaxSecurityAuthKerberosClassLibrary
type: Class
subclass of: JavaClassLibrary
comment: JavaLibrary implementing the javax.security.auth.kerberos package for J2SE 1.4
comment: platform:implementsInterface some JavaxSecurityAuthKerberosAPI

JavaxSecurityAuthLoginClassLibrary
type: Class
subclass of: JavaClassLibrary
comment: JavaLibrary implementing the javax.security.auth.login package for J2SE 1.4
comment: platform:implementsInterface some JavaxSecurityAuthLoginAPI

JavaxSecurityAuthSpiClassLibrary
type: Class
subclass of: JavaClassLibrary
comment: JavaLibrary implementing the javax.security.auth.spi package for J2SE 1.4
comment: platform:implementsInterface some JavaxSecurityAuthSpiAPI

JavaxSecurityCertClassLibrary
type: Class
subclass of: JavaClassLibrary
comment: JavaLibrary implementing the javax.security.cert package for J2SE 1.4
comment: platform:implementsInterface some JavaxSecurityCertAPI

JavaxNamingClassLibrary
type: Class
subclass of: JavaxNamingClassLibrary
comment: JavaLibrary implementing the javax.naming package for J2SE 1.4
comment: platform:implementsInterface some JavaxNamingAPI

JavaxNamingDirectoryClassLibrary
type: Class
subclass of: JavaxNamingDirectoryClassLibrary
comment: JavaLibrary implementing the javax.naming.directory package for J2SE 1.4
comment: platform:implementsInterface some JavaxNamingDirectoryAPI

JavaxNamingEventClassLibrary
type: Class
equivalent class: JavaxNamingEventClassLibrary
subclass of: JavaClassLibrary
comment: JavaLibrary implementing the javax.naming.event package for J2SE 1.4
comment: platform:implementsInterface some JavaxNamingEventAPI

JavaxNamingLdapClassLibrary
type: Class
subclass of: JavaxNamingLdapClassLibrary
comment: JavaLibrary implementing the javax.naming.ldap package for J2SE 1.4
comment: platform:implementsInterface some JavaxNamingLdapAPI

JavaxNamingSpiClassLibrary
type: Class
equivalent class: JavaxNamingSpiClassLibrary
subclass of: JavaClassLibrary
comment: JavaLibrary implementing the javax.naming.spi package for J2SE 1.4
comment: platform:implementsInterface some JavaxNamingSpiAPI

JavaxNetClassLibrary
type: Class
subclass of: JavaClassLibrary
comment: JavaLibrary implementing the javax.net package for J2SE 1.4
comment: platform:implementsInterface some JavaxNetAPI

JavaxNetSslClassLibrary
type: Class
subclass of: JavaClassLibrary
comment: JavaLibrary implementing the javax.net.ssl package for J2SE 1.4
comment: platform:implementsInterface some JavaxNetSslAPI

JavaxRmiClassLibrary
type: Class
equivalent class: JavaxRmiClassLibrary
subclass of: JavaClassLibrary
comment: JavaLibrary implementing the javax.rmi package for J2SE 1.4
comment: platform:implementsInterface some JavaxRmiAPI

JavaxRmiCORBAClassLibrary
type: Class
equivalent class: JavaxRmiCORBAClassLibrary
subclass of: JavaClassLibrary
comment: JavaLibrary implementing the javax.rmi.CORBA package for J2SE 1.4
comment: platform:implementsInterface some JavaxRmiCORBAAPI

JavaxCryptoClassLibrary
type: Class
subclass of: JavaClassLibrary
comment: JavaLibrary implementing the javax.crypto package for J2SE 1.4
comment: platform:implementsInterface some JavaxCryptoAPI

JavaxCryptoInterfacesClassLibrary
type: Class
subclass of: JavaClassLibrary
comment: JavaLibrary implementing the javax.crypto.interfaces package for J2SE 1.4
comment: platform:implementsInterface some JavaxCryptoInterfacesAPI

JavaxCryptoSpecClassLibrary
type: Class
subclass of: JavaClassLibrary
comment: JavaLibrary implementing the javax.crypto.spec package for J2SE 1.4
comment: platform:implementsInterface some JavaxCryptoSpecAPI

JavaxSqlClassLibrary
type: Class
subclass of: JavaClassLibrary
comment: JavaLibrary implementing the javax.sql package for J2SE 1.4
comment: platform:implementsInterface some JavaxSqlAPI

JavaxTransactionClassLibrary
type: Class
subclass of: JavaxTransactionClassLibrary
comment: JavaLibrary implementing the javax.transaction package for J2SE 1.4
comment: platform:implementsInterface some JavaxTransactionAPI

JavaxTransactionXaClassLibrary
type: Class
subclass of: JavaClassLibrary
comment: JavaLibrary implementing the javax.transaction.xa package for J2SE 1.4
comment: platform:implementsInterface some JavaxTransactionXaAPI

JavaxXmlParsersClassLibrary
type: Class
subclass of: JavaClassLibrary
comment: JavaLibrary implementing the javax.xml.parsers package for J2SE 1.4
comment: platform:implementsInterface some JavaxXmlParsersAPI

JavaxXmlTransformClassLibrary
type: Class
subclass of: JavaClassLibrary
comment: JavaLibrary implementing the javax.xml.transform package for J2SE 1.4
comment: platform:implementsInterface some JavaxXmlTransformAPI

JavaxXmlTransformDomClassLibrary
type: Class
subclass of: JavaClassLibrary
comment: JavaLibrary implementing the javax.xml.transform.dom package for J2SE 1.4
comment: platform:implementsInterface some JavaxXmlTransformDomAPI

JavaxXmlTransformSaxClassLibrary
type: Class
subclass of: JavaClassLibrary
comment: JavaLibrary implementing the javax.xml.transform.sax package for J2SE 1.4
comment: platform:implementsInterface some JavaxXmlTransformSaxAPI

JavaxXmlTransformStreamClassLibrary
type: Class
subclass of: JavaClassLibrary
comment: JavaLibrary implementing the javax.xml.transform.stream package for J2SE 1.4
comment: platform:implementsInterface some JavaxXmlTransformStreamAPI

OrgW3cDomClassLibrary
type: Class
subclass of: JavaClassLibrary
comment: JavaLibrary implementing the org.w3c.dom package for J2SE 1.4
comment: platform:implementsInterface some OrgW3cDomAPI

OrgW3cDomCssClassLibrary
type: Class
subclass of: JavaClassLibrary
comment: JavaLibrary implementing the org.w3c.dom.css package for J2SE 1.4
comment: platform:implementsInterface some OrgW3cDomCssAPI

OrgW3cDomStylesheetsClassLibrary
type: Class
subclass of: JavaClassLibrary
comment: JavaLibrary implementing the org.w3c.dom.stylesheets package for J2SE 1.4
comment: platform:implementsInterface some OrgW3cDomStylesheetsAPI

OrgW3cDomViewsClassLibrary
type: Class
subclass of: JavaClassLibrary
comment: JavaLibrary implementing the org.w3c.dom.views package for J2SE 1.4
comment: platform:implementsInterface some OrgW3cDomViewsAPI

OrgW3cDomEventsClassLibrary
type: Class
subclass of: JavaClassLibrary
comment: JavaLibrary implementing the org.w3c.dom.events package for J2SE 1.4
comment: platform:implementsInterface some OrgW3cDomEventsAPI

OrgW3cDomHtmlClassLibrary
type: Class
subclass of: JavaClassLibrary
comment: JavaLibrary implementing the org.w3c.dom.html package for J2SE 1.4
comment: platform:implementsInterface some OrgW3cDomHtmlAPI

OrgW3cDomTraversalClassLibrary
type: Class
subclass of: JavaClassLibrary
comment: JavaLibrary implementing the org.w3c.dom.traversal package for J2SE 1.4
comment: platform:implementsInterface some OrgW3cDomTraversalAPI

OrgOmgCORBA 2 3ClassLibrary
type: Class
equivalent class: OrgOmgCORBA 2 3ClassLibrary
subclass of: JavaClassLibrary
comment: JavaLibrary implementing the org.omg.CORBA_2_3 package for J2SE 1.4
comment: platform:implementsInterface some OrgOmgCORBA_2_3API

OrgOmgCORBA 2 3PortableClassLibrary
type: Class
subclass of: JavaClassLibrary
comment: JavaLibrary implementing the org.omg.CORBA_2_3.portable package for J2SE 1.4
comment: platform:implementsInterface some OrgOmgCORBA_2_3PortableAPI

OrgOmgCORBAClassLibrary
type: Class
subclass of: JavaClassLibrary
comment: JavaLibrary implementing the org.omg.CORBA package for J2SE 1.4
comment: platform:implementsInterface some OrgOmgCORBAAPI

OrgOmgCORBAPortableClassLibrary
type: Class
subclass of: JavaClassLibrary
comment: JavaLibrary implementing the org.omg.CORBA.portable package for J2SE 1.4
comment: platform:implementsInterface some OrgOmgCORBAPortableAPI

OrgOmgCORBADynAnyPackageClassLibrary
type: Class
subclass of: OrgOmgCORBADynAnyPackageClassLibrary
comment: JavaLibrary implementing the org.omg.CORBA.DynAnyPackage package for J2SE 1.4
comment: platform:implementsInterface some OrgOmgCORBADynAnyPackageAPI

OrgOmgCORBAORBPackageClassLibrary
type: Class
subclass of: OrgOmgCORBAORBPackageClassLibrary
comment: JavaLibrary implementing the org.omg.CORBA.ORBPackage package for J2SE 1.4
comment: platform:implementsInterface some OrgOmgCORBAORBPackageAPI

OrgOmgCORBATypeCodePackageClassLibrary
type: Class
subclass of: OrgOmgCORBATypeCodePackageClassLibrary
comment: JavaLibrary implementing the org.omg.CORBA.TypeCodePackage package for J2SE 1.4
comment: platform:implementsInterface some OrgOmgCORBATypeCodePackageAPI

OrgOmgSendingContextClassLibrary
type: Class
equivalent class: OrgOmgSendingContextClassLibrary
subclass of: JavaClassLibrary
comment: JavaLibrary implementing the org.omg.SendingContext package for J2SE 1.4
comment: platform:implementsInterface some OrgOmgSendingContextAPI

OrgOmgCosNamingClassLibrary
type: Class
subclass of: JavaClassLibrary
comment: JavaLibrary implementing the org.omg.CosNaming package for J2SE 1.4
comment: platform:implementsInterface some OrgOmgCosNamingAPI

OrgOmgCosNamingNamingContextExtPackageClassLibrary
type: Class
subclass of: JavaClassLibrary
comment: JavaLibrary implementing the org.omg.CosNaming.NamingContextExtPackage package for J2SE 1.4
comment: platform:implementsInterface some OrgOmgCosNamingNamingContextExtPackageAPI

OrgOmgCosNamingNamingContextPackageClassLibrary
type: Class
subclass of: JavaClassLibrary
comment: JavaLibrary implementing the org.omg.CosNaming.NamingContextPackage package for J2SE 1.4
comment: platform:implementsInterface some OrgOmgCosNamingNamingContextPackageAPI

OrgOmgPortableServerClassLibrary
type: Class
subclass of: JavaClassLibrary
comment: JavaLibrary implementing the org.omg.PortableServer package for J2SE 1.4
comment: platform:implementsInterface some OrgOmgPortableServerAPI

OrgOmgPortableServerCurrentPackageClassLibrary
type: Class
subclass of: JavaClassLibrary
comment: JavaLibrary implementing the org.omg.PortableServer.CurrentPackage package for J2SE 1.4
comment: platform:implementsInterface some OrgOmgPortableServerCurrentPackageAPI

OrgOmgPortableServerPOAManagerPackageClassLibrary
type: Class
subclass of: JavaClassLibrary
comment: JavaLibrary implementing the org.omg.PortableServer.POAManagerPackage package for J2SE 1.4
comment: platform:implementsInterface some OrgOmgPortableServerPOAManagerPackageAPI

OrgOmgPortableServerPOAPackageClassLibrary
type: Class
subclass of: JavaClassLibrary
comment: JavaLibrary implementing the org.omg.PortableServer.POAPackage package for J2SE 1.4
comment: platform:implementsInterface some OrgOmgPortableServerPOAPackageAPI

OrgOmgPortableServerPortableClassLibrary
type: Class
subclass of: JavaClassLibrary
comment: JavaLibrary implementing the org.omg.PortableServer.portable package for J2SE 1.4
comment: platform:implementsInterface some OrgOmgPortableServerPortableAPI

OrgOmgPortableServerServantLocatorPackageClassLibrary
type: Class
subclass of: JavaClassLibrary
comment: JavaLibrary implementing the org.omg.PortableServer.ServantLocatorPackage package for J2SE 1.4
comment: platform:implementsInterface some OrgOmgPortableServerServantLocatorPackageAPI

OrgOmgDynamicClassLibrary
type: Class
subclass of: JavaClassLibrary
comment: JavaLibrary implementing the org.omg.Dynamic package for J2SE 1.4
comment: platform:implementsInterface some OrgOmgDynamicAPI

OrgOmgDynamicAnyClassLibrary
type: Class
subclass of: JavaClassLibrary
comment: JavaLibrary implementing the org.omg.DynamicAny package for J2SE 1.4
comment: platform:implementsInterface some OrgOmgDynamicAnyAPI

OrgOmgDynamicAnyDynAnyFactoryPackageClassLibrary
type: Class
subclass of: JavaClassLibrary
comment: JavaLibrary implementing the org.omg.DynamicAny.DynAnyFactoryPackage package for J2SE 1.4
comment: platform:implementsInterface some OrgOmgDynamicAnyDynAnyFactoryPackageAPI

OrgOmgDynamicAnyDynAnyPackageClassLibrary
type: Class
subclass of: JavaClassLibrary
comment: JavaLibrary implementing the org.omg.DynamicAny.DynAnyPackage package for J2SE 1.4
comment: platform:implementsInterface some OrgOmgDynamicAnyDynAnyPackageAPI

OrgOmgIOPClassLibrary
type: Class
subclass of: JavaClassLibrary
comment: JavaLibrary implementing the org.omg.IOP package for J2SE 1.4
comment: platform:implementsInterface some OrgOmgIOPAPI

OrgOmgIOPCodecFactoryPackageClassLibrary
type: Class
subclass of: JavaClassLibrary
comment: JavaLibrary implementing the org.omg.IOP.CodecFactoryPackage package for J2SE 1.4
comment: platform:implementsInterface some OrgOmgIOPCodecFactoryPackageAPI

OrgOmgIOPCodecPackageClassLibrary
type: Class
subclass of: JavaClassLibrary
comment: JavaLibrary implementing the org.omg.IOP.CodecPackage package for J2SE 1.4
comment: platform:implementsInterface some OrgOmgIOPCodecPackageAPI

OrgOmgMessagingClassLibrary
type: Class
subclass of: JavaClassLibrary
comment: JavaLibrary implementing the org.omg.Messaging package for J2SE 1.4
comment: platform:implementsInterface some OrgOmgMessagingAPI

OrgOmgPortableInterceptorClassLibrary
type: Class
subclass of: JavaClassLibrary
comment: JavaLibrary implementing the org.omg.PortableInterceptor package for J2SE 1.4
comment: platform:implementsInterface some OrgOmgPortableInterceptorAPI

OrgOmgPortableInterceptorORBInitInfoPackageClassLibrary
type: Class
subclass of: JavaClassLibrary
comment: JavaLibrary implementing the org.omg.PortableInterceptor.ORBInitInfoPackage package for J2SE 1.4
comment: platform:implementsInterface some OrgOmgPortableInterceptorORBInitInfoPackageAPI

OrgOmgStubJavaRmiClassLibrary
type: Class
equivalent class: OrgOmgStubJavaRmiClassLibrary
subclass of: JavaClassLibrary
comment: JavaLibrary implementing the org.omg.stub.java.rmi package for J2SE 1.4
comment: platform:implementsInterface some OrgOmgStubJavaRmiAPI

OrgXmlSaxClassLibrary
type: Class
subclass of: JavaClassLibrary
comment: JavaLibrary implementing the org.xml.sax package for J2SE 1.4
comment: platform:implementsInterface some OrgXmlSaxAPI

OrgXmlSaxHelpersClassLibrary
type: Class
subclass of: JavaClassLibrary
comment: JavaLibrary implementing the org.xml.sax.helpers package for J2SE 1.4
comment: platform:implementsInterface some OrgXmlSaxHelpersAPI

OrgXmlSaxExtClassLibrary
type: Class
subclass of: JavaClassLibrary
comment: JavaLibrary implementing the org.xml.sax.ext package for J2SE 1.4
comment: platform:implementsInterface some OrgXmlSaxExtAPI

OrgIetfJgssClassLibrary
type: Class
subclass of: JavaClassLibrary
comment: JavaLibrary implementing the org.ietf.jgss package for J2SE 1.4
comment: platform:implementsInterface some OrgIetfJgssAPI