J2SE 5.0
type: Ontology
version info: $Id: UML2ToPackageAPIOntology.atl 8082 2010-03-18 21:11:00Z dwagelaa $
imports: platform.owl
imports: java.owl
imports: j2se-1 4.owl#
imports: isa.owl
comment: Generated by [UML2ToSimplifiedPackageAPIOntology.atl 8080 2010-03-18 10:46:40Z dwagelaa], [UML2ToPackageAPIOntology.atl 8082 2010-03-18 21:11:00Z dwagelaa], [UML2ToAPIOntology.atl 8082 2010-03-18 21:11:00Z dwagelaa], and [UML2Comparison.atl 8082 2010-03-18 21:11:00Z dwagelaa]
comment: Dennis Wagelaar <dennis.wagelaar@vub.ac.be>
comment: © 2010, Vrije Universiteit Brussel. All rights reserved.

J2SE5 0API
type: Class
subclass of: JavaxCryptoAPI
subclass of: JavaxCryptoInterfacesAPI
subclass of: JavaxCryptoSpecAPI
subclass of: JavaxNetAPI
subclass of: JavaxNetSslAPI
subclass of: JavaxSecurityCertAPI
subclass of: JavaxSecurityAuthAPI
subclass of: JavaxSecurityAuthCallbackAPI
subclass of: JavaxSecurityAuthX500API
subclass of: JavaxSecurityAuthKerberosAPI
subclass of: JavaxSecurityAuthLoginAPI
subclass of: JavaxSecurityAuthSpiAPI
subclass of: JavaxSecuritySaslAPI
subclass of: JavaxAccessibilityAPI
subclass of: JavaxSwingAPI
subclass of: JavaxSwingTextAPI
subclass of: JavaxSwingTextHtmlAPI
subclass of: JavaxSwingTextHtmlParserAPI
subclass of: JavaxSwingTextRtfAPI
subclass of: JavaxSwingEventAPI
subclass of: JavaxSwingColorchooserAPI
subclass of: JavaxSwingPlafAPI
subclass of: JavaxSwingPlafBasicAPI
subclass of: JavaxSwingPlafMetalAPI
subclass of: JavaxSwingPlafMultiAPI
subclass of: JavaxSwingPlafSynthAPI
subclass of: JavaxSwingTreeAPI
subclass of: JavaxSwingBorderAPI
subclass of: JavaxSwingFilechooserAPI
subclass of: JavaxSwingTableAPI
subclass of: JavaxSwingUndoAPI
subclass of: JavaxManagementAPI
subclass of: JavaxManagementOpenmbeanAPI
subclass of: JavaxManagementLoadingAPI
subclass of: JavaxManagementModelmbeanAPI
subclass of: JavaxManagementMonitorAPI
subclass of: JavaxManagementRelationAPI
subclass of: JavaxManagementRemoteAPI
subclass of: JavaxManagementRemoteRmiAPI
subclass of: JavaxManagementTimerAPI
subclass of: JavaxActivityAPI
subclass of: JavaxImageioAPI
subclass of: JavaxImageioMetadataAPI
subclass of: JavaxImageioEventAPI
subclass of: JavaxImageioPluginsBmpAPI
subclass of: JavaxImageioPluginsJpegAPI
subclass of: JavaxImageioStreamAPI
subclass of: JavaxImageioSpiAPI
subclass of: JavaxNamingAPI
subclass of: JavaxNamingDirectoryAPI
subclass of: JavaxNamingEventAPI
subclass of: JavaxNamingLdapAPI
subclass of: JavaxNamingSpiAPI
subclass of: JavaxPrintAPI
subclass of: JavaxPrintAttributeAPI
subclass of: JavaxPrintAttributeStandardAPI
subclass of: JavaxPrintEventAPI
subclass of: JavaxRmiAPI
subclass of: JavaxRmiCORBAAPI
subclass of: JavaxRmiSslAPI
subclass of: JavaxSoundMidiAPI
subclass of: JavaxSoundMidiSpiAPI
subclass of: JavaxSoundSampledAPI
subclass of: JavaxSoundSampledSpiAPI
subclass of: JavaxSqlAPI
subclass of: JavaxSqlRowsetAPI
subclass of: JavaxSqlRowsetSpiAPI
subclass of: JavaxSqlRowsetSerialAPI
subclass of: JavaxTransactionAPI
subclass of: JavaxTransactionXaAPI
subclass of: JavaxXmlAPI
subclass of: JavaxXmlDatatypeAPI
subclass of: JavaxXmlNamespaceAPI
subclass of: JavaxXmlTransformAPI
subclass of: JavaxXmlTransformDomAPI
subclass of: JavaxXmlTransformSaxAPI
subclass of: JavaxXmlTransformStreamAPI
subclass of: JavaxXmlValidationAPI
subclass of: JavaxXmlXpathAPI

J2SE5 0ClassLibrary
type: Class
subclass of: JavaxCryptoClassLibrary
subclass of: JavaxCryptoInterfacesClassLibrary
subclass of: JavaxCryptoSpecClassLibrary
subclass of: JavaxNetClassLibrary
subclass of: JavaxNetSslClassLibrary
subclass of: JavaxSecurityCertClassLibrary
subclass of: JavaxSecurityAuthClassLibrary
subclass of: JavaxSecurityAuthCallbackClassLibrary
subclass of: JavaxSecurityAuthX500ClassLibrary
subclass of: JavaxSecurityAuthKerberosClassLibrary
subclass of: JavaxSecurityAuthLoginClassLibrary
subclass of: JavaxSecurityAuthSpiClassLibrary
subclass of: JavaxSecuritySaslClassLibrary
subclass of: JavaxAccessibilityClassLibrary
subclass of: JavaxSwingClassLibrary
subclass of: JavaxSwingTextClassLibrary
subclass of: JavaxSwingTextHtmlClassLibrary
subclass of: JavaxSwingTextHtmlParserClassLibrary
subclass of: JavaxSwingTextRtfClassLibrary
subclass of: JavaxSwingEventClassLibrary
subclass of: JavaxSwingColorchooserClassLibrary
subclass of: JavaxSwingPlafClassLibrary
subclass of: JavaxSwingPlafBasicClassLibrary
subclass of: JavaxSwingPlafMetalClassLibrary
subclass of: JavaxSwingPlafMultiClassLibrary
subclass of: JavaxSwingPlafSynthClassLibrary
subclass of: JavaxSwingTreeClassLibrary
subclass of: JavaxSwingBorderClassLibrary
subclass of: JavaxSwingFilechooserClassLibrary
subclass of: JavaxSwingTableClassLibrary
subclass of: JavaxSwingUndoClassLibrary
subclass of: JavaxManagementClassLibrary
subclass of: JavaxManagementOpenmbeanClassLibrary
subclass of: JavaxManagementLoadingClassLibrary
subclass of: JavaxManagementModelmbeanClassLibrary
subclass of: JavaxManagementMonitorClassLibrary
subclass of: JavaxManagementRelationClassLibrary
subclass of: JavaxManagementRemoteClassLibrary
subclass of: JavaxManagementRemoteRmiClassLibrary
subclass of: JavaxManagementTimerClassLibrary
subclass of: JavaxActivityClassLibrary
subclass of: JavaxImageioClassLibrary
subclass of: JavaxImageioMetadataClassLibrary
subclass of: JavaxImageioEventClassLibrary
subclass of: JavaxImageioPluginsBmpClassLibrary
subclass of: JavaxImageioPluginsJpegClassLibrary
subclass of: JavaxImageioStreamClassLibrary
subclass of: JavaxImageioSpiClassLibrary
subclass of: JavaxNamingClassLibrary
subclass of: JavaxNamingDirectoryClassLibrary
subclass of: JavaxNamingEventClassLibrary
subclass of: JavaxNamingLdapClassLibrary
subclass of: JavaxNamingSpiClassLibrary
subclass of: JavaxPrintClassLibrary
subclass of: JavaxPrintAttributeClassLibrary
subclass of: JavaxPrintAttributeStandardClassLibrary
subclass of: JavaxPrintEventClassLibrary
subclass of: JavaxRmiClassLibrary
subclass of: JavaxRmiCORBAClassLibrary
subclass of: JavaxRmiSslClassLibrary
subclass of: JavaxSoundMidiClassLibrary
subclass of: JavaxSoundMidiSpiClassLibrary
subclass of: JavaxSoundSampledClassLibrary
subclass of: JavaxSoundSampledSpiClassLibrary
subclass of: JavaxSqlClassLibrary
subclass of: JavaxSqlRowsetClassLibrary
subclass of: JavaxSqlRowsetSpiClassLibrary
subclass of: JavaxSqlRowsetSerialClassLibrary
subclass of: JavaxTransactionClassLibrary
subclass of: JavaxTransactionXaClassLibrary
subclass of: JavaxXmlClassLibrary
subclass of: JavaxXmlDatatypeClassLibrary
subclass of: JavaxXmlNamespaceClassLibrary
subclass of: JavaxXmlTransformClassLibrary
subclass of: JavaxXmlTransformDomClassLibrary
subclass of: JavaxXmlTransformSaxClassLibrary
subclass of: JavaxXmlTransformStreamClassLibrary
subclass of: JavaxXmlValidationClassLibrary
subclass of: JavaxXmlXpathClassLibrary

J2SE5 0BytecodeFormat
type: Class
subclass of: J2SE1 4BytecodeFormat
comment: J2SE 5.0 bytecode format
comment: java:majorVersionNumber some xsd:integer[>="49"^^xsd:integer] and java:preverified value false

theJ2SE5 0BytecodeFormat
type: J2SE5 0BytecodeFormat
preverified: false
minor version number: 3
major version number: 49

J2SE5 0VM
type: Class
equivalent class: Restriction
  on property: implementsInterface
  some values from: J2SE5 0BytecodeFormat
subclass of: JavaVM
comment: J2SE 5.0 virtual machine

J2SE5 0JRE
type: Class
equivalent class: Class
  intersection of: Restriction
    on property: providesFeature
    some values from: J2SE5 0ClassLibrary
  intersection of: Restriction
    on property: providesFeature
    some values from: J2SE5 0VM
subclass of: JRE
comment: J2SE 5.0 Java Runtime Environment

JavaxCrypto
type: Class
subclass of: JavaxCrypto
comment: Java API part implementing the javax.crypto package for J2SE 5.0

JavaxCryptoInterfaces
type: Class
equivalent class: JavaxCryptoInterfaces
subclass of: JavaAPIPart
comment: Java API part implementing the javax.crypto.interfaces package for J2SE 5.0

JavaxCryptoSpec
type: Class
subclass of: JavaxCryptoSpec
comment: Java API part implementing the javax.crypto.spec package for J2SE 5.0

JavaxNet
type: Class
equivalent class: JavaxNet
subclass of: JavaAPIPart
comment: Java API part implementing the javax.net package for J2SE 5.0

JavaxNetSsl
type: Class
subclass of: JavaxNetSsl
comment: Java API part implementing the javax.net.ssl package for J2SE 5.0

JavaxSecurityCert
type: Class
equivalent class: JavaxSecurityCert
subclass of: JavaAPIPart
comment: Java API part implementing the javax.security.cert package for J2SE 5.0

JavaxSecurityAuth
type: Class
equivalent class: JavaxSecurityAuth
subclass of: JavaAPIPart
comment: Java API part implementing the javax.security.auth package for J2SE 5.0

JavaxSecurityAuthCallback
type: Class
equivalent class: JavaxSecurityAuthCallback
subclass of: JavaAPIPart
comment: Java API part implementing the javax.security.auth.callback package for J2SE 5.0

JavaxSecurityAuthX500
type: Class
equivalent class: JavaxSecurityAuthX500
subclass of: JavaAPIPart
comment: Java API part implementing the javax.security.auth.x500 package for J2SE 5.0

JavaxSecurityAuthKerberos
type: Class
equivalent class: JavaxSecurityAuthKerberos
subclass of: JavaAPIPart
comment: Java API part implementing the javax.security.auth.kerberos package for J2SE 5.0

JavaxSecurityAuthLogin
type: Class
subclass of: JavaxSecurityAuthLogin
comment: Java API part implementing the javax.security.auth.login package for J2SE 5.0

JavaxSecurityAuthSpi
type: Class
equivalent class: JavaxSecurityAuthSpi
subclass of: JavaAPIPart
comment: Java API part implementing the javax.security.auth.spi package for J2SE 5.0

JavaxSecuritySasl
type: Class
subclass of: JavaAPIPart
comment: Java API part implementing the javax.security.sasl package for J2SE 5.0

JavaxAccessibility
type: Class
subclass of: JavaxAccessibility
comment: Java API part implementing the javax.accessibility package for J2SE 5.0

JavaxSwing
type: Class
subclass of: JavaxSwing
comment: Java API part implementing the javax.swing package for J2SE 5.0

JavaxSwingText
type: Class
subclass of: JavaxSwingText
comment: Java API part implementing the javax.swing.text package for J2SE 5.0

JavaxSwingTextHtml
type: Class
subclass of: JavaxSwingTextHtml
comment: Java API part implementing the javax.swing.text.html package for J2SE 5.0

JavaxSwingTextHtmlParser
type: Class
equivalent class: JavaxSwingTextHtmlParser
subclass of: JavaAPIPart
comment: Java API part implementing the javax.swing.text.html.parser package for J2SE 5.0

JavaxSwingTextRtf
type: Class
equivalent class: JavaxSwingTextRtf
subclass of: JavaAPIPart
comment: Java API part implementing the javax.swing.text.rtf package for J2SE 5.0

JavaxSwingEvent
type: Class
subclass of: JavaxSwingEvent
comment: Java API part implementing the javax.swing.event package for J2SE 5.0

JavaxSwingColorchooser
type: Class
subclass of: JavaxSwingColorchooser
comment: Java API part implementing the javax.swing.colorchooser package for J2SE 5.0

JavaxSwingPlaf
type: Class
subclass of: JavaxSwingPlaf
comment: Java API part implementing the javax.swing.plaf package for J2SE 5.0

JavaxSwingPlafBasic
type: Class
subclass of: JavaxSwingPlafBasic
comment: Java API part implementing the javax.swing.plaf.basic package for J2SE 5.0

JavaxSwingPlafMetal
type: Class
subclass of: JavaxSwingPlafMetal
comment: Java API part implementing the javax.swing.plaf.metal package for J2SE 5.0

JavaxSwingPlafMulti
type: Class
subclass of: JavaxSwingPlafMulti
comment: Java API part implementing the javax.swing.plaf.multi package for J2SE 5.0

JavaxSwingPlafSynth
type: Class
subclass of: JavaAPIPart
comment: Java API part implementing the javax.swing.plaf.synth package for J2SE 5.0

JavaxSwingTree
type: Class
subclass of: JavaxSwingTree
comment: Java API part implementing the javax.swing.tree package for J2SE 5.0

JavaxSwingBorder
type: Class
equivalent class: JavaxSwingBorder
subclass of: JavaAPIPart
comment: Java API part implementing the javax.swing.border package for J2SE 5.0

JavaxSwingFilechooser
type: Class
equivalent class: JavaxSwingFilechooser
subclass of: JavaAPIPart
comment: Java API part implementing the javax.swing.filechooser package for J2SE 5.0

JavaxSwingTable
type: Class
subclass of: JavaxSwingTable
comment: Java API part implementing the javax.swing.table package for J2SE 5.0

JavaxSwingUndo
type: Class
equivalent class: JavaxSwingUndo
subclass of: JavaAPIPart
comment: Java API part implementing the javax.swing.undo package for J2SE 5.0

JavaxManagement
type: Class
subclass of: JavaAPIPart
comment: Java API part implementing the javax.management package for J2SE 5.0

JavaxManagementOpenmbean
type: Class
subclass of: JavaAPIPart
comment: Java API part implementing the javax.management.openmbean package for J2SE 5.0

JavaxManagementLoading
type: Class
subclass of: JavaAPIPart
comment: Java API part implementing the javax.management.loading package for J2SE 5.0

JavaxManagementModelmbean
type: Class
subclass of: JavaAPIPart
comment: Java API part implementing the javax.management.modelmbean package for J2SE 5.0

JavaxManagementMonitor
type: Class
subclass of: JavaAPIPart
comment: Java API part implementing the javax.management.monitor package for J2SE 5.0

JavaxManagementRelation
type: Class
subclass of: JavaAPIPart
comment: Java API part implementing the javax.management.relation package for J2SE 5.0

JavaxManagementRemote
type: Class
subclass of: JavaAPIPart
comment: Java API part implementing the javax.management.remote package for J2SE 5.0

JavaxManagementRemoteRmi
type: Class
subclass of: JavaAPIPart
comment: Java API part implementing the javax.management.remote.rmi package for J2SE 5.0

JavaxManagementTimer
type: Class
subclass of: JavaAPIPart
comment: Java API part implementing the javax.management.timer package for J2SE 5.0

JavaxActivity
type: Class
subclass of: JavaAPIPart
comment: Java API part implementing the javax.activity package for J2SE 5.0

JavaxImageio
type: Class
equivalent class: JavaxImageio
subclass of: JavaAPIPart
comment: Java API part implementing the javax.imageio package for J2SE 5.0

JavaxImageioMetadata
type: Class
subclass of: JavaxImageioMetadata
comment: Java API part implementing the javax.imageio.metadata package for J2SE 5.0

JavaxImageioEvent
type: Class
equivalent class: JavaxImageioEvent
subclass of: JavaAPIPart
comment: Java API part implementing the javax.imageio.event package for J2SE 5.0

JavaxImageioPluginsBmp
type: Class
subclass of: JavaAPIPart
comment: Java API part implementing the javax.imageio.plugins.bmp package for J2SE 5.0

JavaxImageioPluginsJpeg
type: Class
equivalent class: JavaxImageioPluginsJpeg
subclass of: JavaAPIPart
comment: Java API part implementing the javax.imageio.plugins.jpeg package for J2SE 5.0

JavaxImageioStream
type: Class
equivalent class: JavaxImageioStream
subclass of: JavaAPIPart
comment: Java API part implementing the javax.imageio.stream package for J2SE 5.0

JavaxImageioSpi
type: Class
equivalent class: JavaxImageioSpi
subclass of: JavaAPIPart
comment: Java API part implementing the javax.imageio.spi package for J2SE 5.0

JavaxNaming
type: Class
subclass of: JavaxNaming
comment: Java API part implementing the javax.naming package for J2SE 5.0

JavaxNamingDirectory
type: Class
subclass of: JavaxNamingDirectory
comment: Java API part implementing the javax.naming.directory package for J2SE 5.0

JavaxNamingEvent
type: Class
equivalent class: JavaxNamingEvent
subclass of: JavaAPIPart
comment: Java API part implementing the javax.naming.event package for J2SE 5.0

JavaxNamingLdap
type: Class
subclass of: JavaxNamingLdap
comment: Java API part implementing the javax.naming.ldap package for J2SE 5.0

JavaxNamingSpi
type: Class
equivalent class: JavaxNamingSpi
subclass of: JavaAPIPart
comment: Java API part implementing the javax.naming.spi package for J2SE 5.0

JavaxPrint
type: Class
equivalent class: JavaxPrint
subclass of: JavaAPIPart
comment: Java API part implementing the javax.print package for J2SE 5.0

JavaxPrintAttribute
type: Class
equivalent class: JavaxPrintAttribute
subclass of: JavaAPIPart
comment: Java API part implementing the javax.print.attribute package for J2SE 5.0

JavaxPrintAttributeStandard
type: Class
subclass of: JavaxPrintAttributeStandard
comment: Java API part implementing the javax.print.attribute.standard package for J2SE 5.0

JavaxPrintEvent
type: Class
equivalent class: JavaxPrintEvent
subclass of: JavaAPIPart
comment: Java API part implementing the javax.print.event package for J2SE 5.0

JavaxRmi
type: Class
equivalent class: JavaxRmi
subclass of: JavaAPIPart
comment: Java API part implementing the javax.rmi package for J2SE 5.0

JavaxRmiCORBA
type: Class
subclass of: JavaxRmiCORBA
comment: Java API part implementing the javax.rmi.CORBA package for J2SE 5.0

JavaxRmiSsl
type: Class
subclass of: JavaAPIPart
comment: Java API part implementing the javax.rmi.ssl package for J2SE 5.0

JavaxSoundMidi
type: Class
subclass of: JavaAPIPart
comment: Java API part implementing the javax.sound.midi package for J2SE 5.0

JavaxSoundMidiSpi
type: Class
equivalent class: JavaxSoundMidiSpi
subclass of: JavaAPIPart
comment: Java API part implementing the javax.sound.midi.spi package for J2SE 5.0

JavaxSoundSampled
type: Class
subclass of: JavaxSoundSampled
comment: Java API part implementing the javax.sound.sampled package for J2SE 5.0

JavaxSoundSampledSpi
type: Class
equivalent class: JavaxSoundSampledSpi
subclass of: JavaAPIPart
comment: Java API part implementing the javax.sound.sampled.spi package for J2SE 5.0

JavaxSql
type: Class
equivalent class: JavaxSql
subclass of: JavaAPIPart
comment: Java API part implementing the javax.sql package for J2SE 5.0

JavaxSqlRowset
type: Class
subclass of: JavaAPIPart
comment: Java API part implementing the javax.sql.rowset package for J2SE 5.0

JavaxSqlRowsetSpi
type: Class
subclass of: JavaAPIPart
comment: Java API part implementing the javax.sql.rowset.spi package for J2SE 5.0

JavaxSqlRowsetSerial
type: Class
subclass of: JavaAPIPart
comment: Java API part implementing the javax.sql.rowset.serial package for J2SE 5.0

JavaxTransaction
type: Class
equivalent class: JavaxTransaction
subclass of: JavaAPIPart
comment: Java API part implementing the javax.transaction package for J2SE 5.0

JavaxTransactionXa
type: Class
equivalent class: JavaxTransactionXa
subclass of: JavaAPIPart
comment: Java API part implementing the javax.transaction.xa package for J2SE 5.0

JavaxXml
type: Class
subclass of: JavaAPIPart
comment: Java API part implementing the javax.xml package for J2SE 5.0

JavaxXmlDatatype
type: Class
subclass of: JavaAPIPart
comment: Java API part implementing the javax.xml.datatype package for J2SE 5.0

JavaxXmlNamespace
type: Class
subclass of: JavaAPIPart
comment: Java API part implementing the javax.xml.namespace package for J2SE 5.0

JavaxXmlTransform
type: Class
subclass of: JavaxXmlTransform
comment: Java API part implementing the javax.xml.transform package for J2SE 5.0

JavaxXmlTransformDom
type: Class
subclass of: JavaxXmlTransformDom
comment: Java API part implementing the javax.xml.transform.dom package for J2SE 5.0

JavaxXmlTransformSax
type: Class
subclass of: JavaxXmlTransformSax
comment: Java API part implementing the javax.xml.transform.sax package for J2SE 5.0

JavaxXmlTransformStream
type: Class
equivalent class: JavaxXmlTransformStream
subclass of: JavaAPIPart
comment: Java API part implementing the javax.xml.transform.stream package for J2SE 5.0

JavaxXmlValidation
type: Class
subclass of: JavaAPIPart
comment: Java API part implementing the javax.xml.validation package for J2SE 5.0

JavaxXmlXpath
type: Class
subclass of: JavaAPIPart
comment: Java API part implementing the javax.xml.xpath package for J2SE 5.0

JavaxXmlParsers
type: Class
subclass of: JavaxXmlParsers
comment: Java API part implementing the javax.xml.parsers package for J2SE 5.0

JavaLang
type: Class
subclass of: JavaLang
comment: Java API part implementing the java.lang package for J2SE 5.0

JavaLangReflect
type: Class
subclass of: JavaLangReflect
comment: Java API part implementing the java.lang.reflect package for J2SE 5.0

JavaLangAnnotation
type: Class
subclass of: JavaAPIPart
comment: Java API part implementing the java.lang.annotation package for J2SE 5.0

JavaLangInstrument
type: Class
subclass of: JavaAPIPart
comment: Java API part implementing the java.lang.instrument package for J2SE 5.0

JavaLangManagement
type: Class
subclass of: JavaAPIPart
comment: Java API part implementing the java.lang.management package for J2SE 5.0

JavaLangRef
type: Class
equivalent class: JavaLangRef
subclass of: JavaAPIPart
comment: Java API part implementing the java.lang.ref package for J2SE 5.0

JavaSecurity
type: Class
subclass of: JavaSecurity
comment: Java API part implementing the java.security package for J2SE 5.0

JavaSecuritySpec
type: Class
subclass of: JavaSecuritySpec
comment: Java API part implementing the java.security.spec package for J2SE 5.0

JavaSecurityCert
type: Class
subclass of: JavaAPIPart
comment: Java API part implementing the java.security.cert package for J2SE 5.0

JavaSecurityAcl
type: Class
equivalent class: JavaSecurityAcl
subclass of: JavaAPIPart
comment: Java API part implementing the java.security.acl package for J2SE 5.0

JavaSecurityInterfaces
type: Class
subclass of: JavaSecurityInterfaces
comment: Java API part implementing the java.security.interfaces package for J2SE 5.0

JavaMath
type: Class
subclass of: JavaMath
comment: Java API part implementing the java.math package for J2SE 5.0

JavaNio
type: Class
subclass of: JavaNio
comment: Java API part implementing the java.nio package for J2SE 5.0

JavaNioChannels
type: Class
subclass of: JavaNioChannels
comment: Java API part implementing the java.nio.channels package for J2SE 5.0

JavaNioChannelsSpi
type: Class
subclass of: JavaNioChannelsSpi
comment: Java API part implementing the java.nio.channels.spi package for J2SE 5.0

JavaNioCharset
type: Class
subclass of: JavaNioCharset
comment: Java API part implementing the java.nio.charset package for J2SE 5.0

JavaNioCharsetSpi
type: Class
equivalent class: JavaNioCharsetSpi
subclass of: JavaAPIPart
comment: Java API part implementing the java.nio.charset.spi package for J2SE 5.0

JavaIo
type: Class
subclass of: JavaIo
comment: Java API part implementing the java.io package for J2SE 5.0

JavaNet
type: Class
subclass of: JavaNet
comment: Java API part implementing the java.net package for J2SE 5.0

JavaUtil
type: Class
subclass of: JavaUtil
comment: Java API part implementing the java.util package for J2SE 5.0

JavaUtilRegex
type: Class
subclass of: JavaUtilRegex
comment: Java API part implementing the java.util.regex package for J2SE 5.0

JavaUtilConcurrent
type: Class
subclass of: JavaAPIPart
comment: Java API part implementing the java.util.concurrent package for J2SE 5.0

JavaUtilConcurrentAtomic
type: Class
subclass of: JavaAPIPart
comment: Java API part implementing the java.util.concurrent.atomic package for J2SE 5.0

JavaUtilConcurrentLocks
type: Class
subclass of: JavaAPIPart
comment: Java API part implementing the java.util.concurrent.locks package for J2SE 5.0

JavaUtilJar
type: Class
subclass of: JavaUtilJar
comment: Java API part implementing the java.util.jar package for J2SE 5.0

JavaUtilZip
type: Class
subclass of: JavaUtilZip
comment: Java API part implementing the java.util.zip package for J2SE 5.0

JavaUtilLogging
type: Class
subclass of: JavaUtilLogging
comment: Java API part implementing the java.util.logging package for J2SE 5.0

JavaUtilPrefs
type: Class
equivalent class: JavaUtilPrefs
subclass of: JavaAPIPart
comment: Java API part implementing the java.util.prefs package for J2SE 5.0

JavaApplet
type: Class
subclass of: JavaApplet
comment: Java API part implementing the java.applet package for J2SE 5.0

JavaAwt
type: Class
subclass of: JavaAwt
comment: Java API part implementing the java.awt package for J2SE 5.0

JavaAwtEvent
type: Class
subclass of: JavaAwtEvent
comment: Java API part implementing the java.awt.event package for J2SE 5.0

JavaAwtImage
type: Class
subclass of: JavaAwtImage
comment: Java API part implementing the java.awt.image package for J2SE 5.0

JavaAwtImageRenderable
type: Class
equivalent class: JavaAwtImageRenderable
subclass of: JavaAPIPart
comment: Java API part implementing the java.awt.image.renderable package for J2SE 5.0

JavaAwtGeom
type: Class
equivalent class: JavaAwtGeom
subclass of: JavaAPIPart
comment: Java API part implementing the java.awt.geom package for J2SE 5.0

JavaAwtIm
type: Class
equivalent class: JavaAwtIm
subclass of: JavaAPIPart
comment: Java API part implementing the java.awt.im package for J2SE 5.0

JavaAwtImSpi
type: Class
equivalent class: JavaAwtImSpi
subclass of: JavaAPIPart
comment: Java API part implementing the java.awt.im.spi package for J2SE 5.0

JavaAwtColor
type: Class
subclass of: JavaAwtColor
comment: Java API part implementing the java.awt.color package for J2SE 5.0

JavaAwtDatatransfer
type: Class
subclass of: JavaAwtDatatransfer
comment: Java API part implementing the java.awt.datatransfer package for J2SE 5.0

JavaAwtDnd
type: Class
subclass of: JavaAwtDnd
comment: Java API part implementing the java.awt.dnd package for J2SE 5.0

JavaAwtFont
type: Class
equivalent class: JavaAwtFont
subclass of: JavaAPIPart
comment: Java API part implementing the java.awt.font package for J2SE 5.0

JavaAwtPrint
type: Class
equivalent class: JavaAwtPrint
subclass of: JavaAPIPart
comment: Java API part implementing the java.awt.print package for J2SE 5.0

JavaText
type: Class
subclass of: JavaText
comment: Java API part implementing the java.text package for J2SE 5.0

JavaBeans
type: Class
subclass of: JavaBeans
comment: Java API part implementing the java.beans package for J2SE 5.0

JavaBeansBeancontext
type: Class
equivalent class: JavaBeansBeancontext
subclass of: JavaAPIPart
comment: Java API part implementing the java.beans.beancontext package for J2SE 5.0

JavaRmi
type: Class
equivalent class: JavaRmi
subclass of: JavaAPIPart
comment: Java API part implementing the java.rmi package for J2SE 5.0

JavaRmiActivation
type: Class
equivalent class: JavaRmiActivation
subclass of: JavaAPIPart
comment: Java API part implementing the java.rmi.activation package for J2SE 5.0

JavaRmiServer
type: Class
subclass of: JavaRmiServer
comment: Java API part implementing the java.rmi.server package for J2SE 5.0

JavaRmiDgc
type: Class
equivalent class: JavaRmiDgc
subclass of: JavaAPIPart
comment: Java API part implementing the java.rmi.dgc package for J2SE 5.0

JavaRmiRegistry
type: Class
equivalent class: JavaRmiRegistry
subclass of: JavaAPIPart
comment: Java API part implementing the java.rmi.registry package for J2SE 5.0

JavaSql
type: Class
equivalent class: JavaSql
subclass of: JavaAPIPart
comment: Java API part implementing the java.sql package for J2SE 5.0

OrgW3cDom
type: Class
subclass of: OrgW3cDom
comment: Java API part implementing the org.w3c.dom package for J2SE 5.0

OrgW3cDomLs
type: Class
subclass of: JavaAPIPart
comment: Java API part implementing the org.w3c.dom.ls package for J2SE 5.0

OrgW3cDomBootstrap
type: Class
subclass of: JavaAPIPart
comment: Java API part implementing the org.w3c.dom.bootstrap package for J2SE 5.0

OrgW3cDomCss
type: Class
subclass of: OrgW3cDomCss
comment: Java API part implementing the org.w3c.dom.css package for J2SE 5.0

OrgW3cDomStylesheets
type: Class
equivalent class: OrgW3cDomStylesheets
subclass of: JavaAPIPart
comment: Java API part implementing the org.w3c.dom.stylesheets package for J2SE 5.0

OrgW3cDomViews
type: Class
equivalent class: OrgW3cDomViews
subclass of: JavaAPIPart
comment: Java API part implementing the org.w3c.dom.views package for J2SE 5.0

OrgW3cDomEvents
type: Class
equivalent class: OrgW3cDomEvents
subclass of: JavaAPIPart
comment: Java API part implementing the org.w3c.dom.events package for J2SE 5.0

OrgW3cDomHtml
type: Class
subclass of: OrgW3cDomHtml
comment: Java API part implementing the org.w3c.dom.html package for J2SE 5.0

OrgW3cDomTraversal
type: Class
equivalent class: OrgW3cDomTraversal
subclass of: JavaAPIPart
comment: Java API part implementing the org.w3c.dom.traversal package for J2SE 5.0

OrgW3cDomRanges
type: Class
subclass of: JavaAPIPart
comment: Java API part implementing the org.w3c.dom.ranges package for J2SE 5.0

OrgOmgCORBA 2 3
type: Class
equivalent class: OrgOmgCORBA 2 3
subclass of: JavaAPIPart
comment: Java API part implementing the org.omg.CORBA_2_3 package for J2SE 5.0

OrgOmgCORBA 2 3Portable
type: Class
equivalent class: OrgOmgCORBA 2 3Portable
subclass of: JavaAPIPart
comment: Java API part implementing the org.omg.CORBA_2_3.portable package for J2SE 5.0

OrgOmgCORBA
type: Class
subclass of: OrgOmgCORBA
comment: Java API part implementing the org.omg.CORBA package for J2SE 5.0

OrgOmgCORBAPortable
type: Class
subclass of: OrgOmgCORBAPortable
comment: Java API part implementing the org.omg.CORBA.portable package for J2SE 5.0

OrgOmgCORBADynAnyPackage
type: Class
equivalent class: OrgOmgCORBADynAnyPackage
subclass of: JavaAPIPart
comment: Java API part implementing the org.omg.CORBA.DynAnyPackage package for J2SE 5.0

OrgOmgCORBAORBPackage
type: Class
equivalent class: OrgOmgCORBAORBPackage
subclass of: JavaAPIPart
comment: Java API part implementing the org.omg.CORBA.ORBPackage package for J2SE 5.0

OrgOmgCORBATypeCodePackage
type: Class
equivalent class: OrgOmgCORBATypeCodePackage
subclass of: JavaAPIPart
comment: Java API part implementing the org.omg.CORBA.TypeCodePackage package for J2SE 5.0

OrgOmgSendingContext
type: Class
equivalent class: OrgOmgSendingContext
subclass of: JavaAPIPart
comment: Java API part implementing the org.omg.SendingContext package for J2SE 5.0

OrgOmgCosNaming
type: Class
subclass of: OrgOmgCosNaming
comment: Java API part implementing the org.omg.CosNaming package for J2SE 5.0

OrgOmgCosNamingNamingContextExtPackage
type: Class
equivalent class: OrgOmgCosNamingNamingContextExtPackage
subclass of: JavaAPIPart
comment: Java API part implementing the org.omg.CosNaming.NamingContextExtPackage package for J2SE 5.0

OrgOmgCosNamingNamingContextPackage
type: Class
equivalent class: OrgOmgCosNamingNamingContextPackage
subclass of: JavaAPIPart
comment: Java API part implementing the org.omg.CosNaming.NamingContextPackage package for J2SE 5.0

OrgOmgPortableServer
type: Class
subclass of: OrgOmgPortableServer
comment: Java API part implementing the org.omg.PortableServer package for J2SE 5.0

OrgOmgPortableServerCurrentPackage
type: Class
equivalent class: OrgOmgPortableServerCurrentPackage
subclass of: JavaAPIPart
comment: Java API part implementing the org.omg.PortableServer.CurrentPackage package for J2SE 5.0

OrgOmgPortableServerPOAManagerPackage
type: Class
equivalent class: OrgOmgPortableServerPOAManagerPackage
subclass of: JavaAPIPart
comment: Java API part implementing the org.omg.PortableServer.POAManagerPackage package for J2SE 5.0

OrgOmgPortableServerPOAPackage
type: Class
equivalent class: OrgOmgPortableServerPOAPackage
subclass of: JavaAPIPart
comment: Java API part implementing the org.omg.PortableServer.POAPackage package for J2SE 5.0

OrgOmgPortableServerPortable
type: Class
equivalent class: OrgOmgPortableServerPortable
subclass of: JavaAPIPart
comment: Java API part implementing the org.omg.PortableServer.portable package for J2SE 5.0

OrgOmgPortableServerServantLocatorPackage
type: Class
equivalent class: OrgOmgPortableServerServantLocatorPackage
subclass of: JavaAPIPart
comment: Java API part implementing the org.omg.PortableServer.ServantLocatorPackage package for J2SE 5.0

OrgOmgDynamic
type: Class
equivalent class: OrgOmgDynamic
subclass of: JavaAPIPart
comment: Java API part implementing the org.omg.Dynamic package for J2SE 5.0

OrgOmgDynamicAny
type: Class
subclass of: OrgOmgDynamicAny
comment: Java API part implementing the org.omg.DynamicAny package for J2SE 5.0

OrgOmgDynamicAnyDynAnyFactoryPackage
type: Class
equivalent class: OrgOmgDynamicAnyDynAnyFactoryPackage
subclass of: JavaAPIPart
comment: Java API part implementing the org.omg.DynamicAny.DynAnyFactoryPackage package for J2SE 5.0

OrgOmgDynamicAnyDynAnyPackage
type: Class
equivalent class: OrgOmgDynamicAnyDynAnyPackage
subclass of: JavaAPIPart
comment: Java API part implementing the org.omg.DynamicAny.DynAnyPackage package for J2SE 5.0

OrgOmgIOP
type: Class
subclass of: OrgOmgIOP
comment: Java API part implementing the org.omg.IOP package for J2SE 5.0

OrgOmgIOPCodecFactoryPackage
type: Class
equivalent class: OrgOmgIOPCodecFactoryPackage
subclass of: JavaAPIPart
comment: Java API part implementing the org.omg.IOP.CodecFactoryPackage package for J2SE 5.0

OrgOmgIOPCodecPackage
type: Class
equivalent class: OrgOmgIOPCodecPackage
subclass of: JavaAPIPart
comment: Java API part implementing the org.omg.IOP.CodecPackage package for J2SE 5.0

OrgOmgMessaging
type: Class
equivalent class: OrgOmgMessaging
subclass of: JavaAPIPart
comment: Java API part implementing the org.omg.Messaging package for J2SE 5.0

OrgOmgPortableInterceptor
type: Class
subclass of: OrgOmgPortableInterceptor
comment: Java API part implementing the org.omg.PortableInterceptor package for J2SE 5.0

OrgOmgPortableInterceptorORBInitInfoPackage
type: Class
equivalent class: OrgOmgPortableInterceptorORBInitInfoPackage
subclass of: JavaAPIPart
comment: Java API part implementing the org.omg.PortableInterceptor.ORBInitInfoPackage package for J2SE 5.0

OrgOmgStubJavaRmi
type: Class
equivalent class: OrgOmgStubJavaRmi
subclass of: JavaAPIPart
comment: Java API part implementing the org.omg.stub.java.rmi package for J2SE 5.0

OrgOmgStubJavaxManagementRemoteRmi
type: Class
subclass of: JavaAPIPart
comment: Java API part implementing the org.omg.stub.javax.management.remote.rmi package for J2SE 5.0

OrgXmlSax
type: Class
equivalent class: OrgXmlSax
subclass of: JavaAPIPart
comment: Java API part implementing the org.xml.sax package for J2SE 5.0

OrgXmlSaxExt
type: Class
subclass of: OrgXmlSaxExt
comment: Java API part implementing the org.xml.sax.ext package for J2SE 5.0

OrgXmlSaxHelpers
type: Class
subclass of: OrgXmlSaxHelpers
comment: Java API part implementing the org.xml.sax.helpers package for J2SE 5.0

OrgIetfJgss
type: Class
equivalent class: OrgIetfJgss
subclass of: JavaAPIPart
comment: Java API part implementing the org.ietf.jgss package for J2SE 5.0

JavaxCryptoAPI
type: Class
subclass of: JavaxCryptoAPI
comment: JavaLibrary implementing the javax.crypto package for J2SE 5.0
comment: platform:comprisesInterfacePart some JavaxCrypto

JavaxCryptoInterfacesAPI
type: Class
equivalent class: JavaxCryptoInterfacesAPI
subclass of: JavaAPI
comment: JavaLibrary implementing the javax.crypto.interfaces package for J2SE 5.0
comment: platform:comprisesInterfacePart some JavaxCryptoInterfaces

JavaxCryptoSpecAPI
type: Class
subclass of: JavaxCryptoSpecAPI
comment: JavaLibrary implementing the javax.crypto.spec package for J2SE 5.0
comment: platform:comprisesInterfacePart some JavaxCryptoSpec

JavaxNetAPI
type: Class
equivalent class: JavaxNetAPI
subclass of: JavaAPI
comment: JavaLibrary implementing the javax.net package for J2SE 5.0
comment: platform:comprisesInterfacePart some JavaxNet

JavaxNetSslAPI
type: Class
subclass of: JavaxNetSslAPI
comment: JavaLibrary implementing the javax.net.ssl package for J2SE 5.0
comment: platform:comprisesInterfacePart some JavaxNetSsl

JavaxSecurityCertAPI
type: Class
equivalent class: JavaxSecurityCertAPI
subclass of: JavaAPI
comment: JavaLibrary implementing the javax.security.cert package for J2SE 5.0
comment: platform:comprisesInterfacePart some JavaxSecurityCert

JavaxSecurityAuthAPI
type: Class
equivalent class: JavaxSecurityAuthAPI
subclass of: JavaAPI
comment: JavaLibrary implementing the javax.security.auth package for J2SE 5.0
comment: platform:comprisesInterfacePart some JavaxSecurityAuth

JavaxSecurityAuthCallbackAPI
type: Class
equivalent class: JavaxSecurityAuthCallbackAPI
subclass of: JavaAPI
comment: JavaLibrary implementing the javax.security.auth.callback package for J2SE 5.0
comment: platform:comprisesInterfacePart some JavaxSecurityAuthCallback

JavaxSecurityAuthX500API
type: Class
equivalent class: JavaxSecurityAuthX500API
subclass of: JavaAPI
comment: JavaLibrary implementing the javax.security.auth.x500 package for J2SE 5.0
comment: platform:comprisesInterfacePart some JavaxSecurityAuthX500

JavaxSecurityAuthKerberosAPI
type: Class
equivalent class: JavaxSecurityAuthKerberosAPI
subclass of: JavaAPI
comment: JavaLibrary implementing the javax.security.auth.kerberos package for J2SE 5.0
comment: platform:comprisesInterfacePart some JavaxSecurityAuthKerberos

JavaxSecurityAuthLoginAPI
type: Class
subclass of: JavaxSecurityAuthLoginAPI
comment: JavaLibrary implementing the javax.security.auth.login package for J2SE 5.0
comment: platform:comprisesInterfacePart some JavaxSecurityAuthLogin

JavaxSecurityAuthSpiAPI
type: Class
equivalent class: JavaxSecurityAuthSpiAPI
subclass of: JavaAPI
comment: JavaLibrary implementing the javax.security.auth.spi package for J2SE 5.0
comment: platform:comprisesInterfacePart some JavaxSecurityAuthSpi

JavaxSecuritySaslAPI
type: Class
subclass of: JavaAPI
comment: JavaLibrary implementing the javax.security.sasl package for J2SE 5.0
comment: platform:comprisesInterfacePart some JavaxSecuritySasl

JavaxAccessibilityAPI
type: Class
subclass of: JavaxAccessibilityAPI
comment: JavaLibrary implementing the javax.accessibility package for J2SE 5.0
comment: platform:comprisesInterfacePart some JavaxAccessibility

JavaxSwingAPI
type: Class
subclass of: JavaxSwingAPI
comment: JavaLibrary implementing the javax.swing package for J2SE 5.0
comment: platform:comprisesInterfacePart some JavaxSwing

JavaxSwingTextAPI
type: Class
subclass of: JavaxSwingTextAPI
comment: JavaLibrary implementing the javax.swing.text package for J2SE 5.0
comment: platform:comprisesInterfacePart some JavaxSwingText

JavaxSwingTextHtmlAPI
type: Class
subclass of: JavaxSwingTextHtmlAPI
comment: JavaLibrary implementing the javax.swing.text.html package for J2SE 5.0
comment: platform:comprisesInterfacePart some JavaxSwingTextHtml

JavaxSwingTextHtmlParserAPI
type: Class
equivalent class: JavaxSwingTextHtmlParserAPI
subclass of: JavaAPI
comment: JavaLibrary implementing the javax.swing.text.html.parser package for J2SE 5.0
comment: platform:comprisesInterfacePart some JavaxSwingTextHtmlParser

JavaxSwingTextRtfAPI
type: Class
equivalent class: JavaxSwingTextRtfAPI
subclass of: JavaAPI
comment: JavaLibrary implementing the javax.swing.text.rtf package for J2SE 5.0
comment: platform:comprisesInterfacePart some JavaxSwingTextRtf

JavaxSwingEventAPI
type: Class
subclass of: JavaxSwingEventAPI
comment: JavaLibrary implementing the javax.swing.event package for J2SE 5.0
comment: platform:comprisesInterfacePart some JavaxSwingEvent

JavaxSwingColorchooserAPI
type: Class
subclass of: JavaxSwingColorchooserAPI
comment: JavaLibrary implementing the javax.swing.colorchooser package for J2SE 5.0
comment: platform:comprisesInterfacePart some JavaxSwingColorchooser

JavaxSwingPlafAPI
type: Class
subclass of: JavaxSwingPlafAPI
comment: JavaLibrary implementing the javax.swing.plaf package for J2SE 5.0
comment: platform:comprisesInterfacePart some JavaxSwingPlaf

JavaxSwingPlafBasicAPI
type: Class
subclass of: JavaxSwingPlafBasicAPI
comment: JavaLibrary implementing the javax.swing.plaf.basic package for J2SE 5.0
comment: platform:comprisesInterfacePart some JavaxSwingPlafBasic

JavaxSwingPlafMetalAPI
type: Class
subclass of: JavaxSwingPlafMetalAPI
comment: JavaLibrary implementing the javax.swing.plaf.metal package for J2SE 5.0
comment: platform:comprisesInterfacePart some JavaxSwingPlafMetal

JavaxSwingPlafMultiAPI
type: Class
subclass of: JavaxSwingPlafMultiAPI
comment: JavaLibrary implementing the javax.swing.plaf.multi package for J2SE 5.0
comment: platform:comprisesInterfacePart some JavaxSwingPlafMulti

JavaxSwingPlafSynthAPI
type: Class
subclass of: JavaAPI
comment: JavaLibrary implementing the javax.swing.plaf.synth package for J2SE 5.0
comment: platform:comprisesInterfacePart some JavaxSwingPlafSynth

JavaxSwingTreeAPI
type: Class
subclass of: JavaxSwingTreeAPI
comment: JavaLibrary implementing the javax.swing.tree package for J2SE 5.0
comment: platform:comprisesInterfacePart some JavaxSwingTree

JavaxSwingBorderAPI
type: Class
equivalent class: JavaxSwingBorderAPI
subclass of: JavaAPI
comment: JavaLibrary implementing the javax.swing.border package for J2SE 5.0
comment: platform:comprisesInterfacePart some JavaxSwingBorder

JavaxSwingFilechooserAPI
type: Class
equivalent class: JavaxSwingFilechooserAPI
subclass of: JavaAPI
comment: JavaLibrary implementing the javax.swing.filechooser package for J2SE 5.0
comment: platform:comprisesInterfacePart some JavaxSwingFilechooser

JavaxSwingTableAPI
type: Class
subclass of: JavaxSwingTableAPI
comment: JavaLibrary implementing the javax.swing.table package for J2SE 5.0
comment: platform:comprisesInterfacePart some JavaxSwingTable

JavaxSwingUndoAPI
type: Class
equivalent class: JavaxSwingUndoAPI
subclass of: JavaAPI
comment: JavaLibrary implementing the javax.swing.undo package for J2SE 5.0
comment: platform:comprisesInterfacePart some JavaxSwingUndo

JavaxManagementAPI
type: Class
subclass of: JavaAPI
comment: JavaLibrary implementing the javax.management package for J2SE 5.0
comment: platform:comprisesInterfacePart some JavaxManagement

JavaxManagementOpenmbeanAPI
type: Class
subclass of: JavaAPI
comment: JavaLibrary implementing the javax.management.openmbean package for J2SE 5.0
comment: platform:comprisesInterfacePart some JavaxManagementOpenmbean

JavaxManagementLoadingAPI
type: Class
subclass of: JavaAPI
comment: JavaLibrary implementing the javax.management.loading package for J2SE 5.0
comment: platform:comprisesInterfacePart some JavaxManagementLoading

JavaxManagementModelmbeanAPI
type: Class
subclass of: JavaAPI
comment: JavaLibrary implementing the javax.management.modelmbean package for J2SE 5.0
comment: platform:comprisesInterfacePart some JavaxManagementModelmbean

JavaxManagementMonitorAPI
type: Class
subclass of: JavaAPI
comment: JavaLibrary implementing the javax.management.monitor package for J2SE 5.0
comment: platform:comprisesInterfacePart some JavaxManagementMonitor

JavaxManagementRelationAPI
type: Class
subclass of: JavaAPI
comment: JavaLibrary implementing the javax.management.relation package for J2SE 5.0
comment: platform:comprisesInterfacePart some JavaxManagementRelation

JavaxManagementRemoteAPI
type: Class
subclass of: JavaAPI
comment: JavaLibrary implementing the javax.management.remote package for J2SE 5.0
comment: platform:comprisesInterfacePart some JavaxManagementRemote

JavaxManagementRemoteRmiAPI
type: Class
subclass of: JavaAPI
comment: JavaLibrary implementing the javax.management.remote.rmi package for J2SE 5.0
comment: platform:comprisesInterfacePart some JavaxManagementRemoteRmi

JavaxManagementTimerAPI
type: Class
subclass of: JavaAPI
comment: JavaLibrary implementing the javax.management.timer package for J2SE 5.0
comment: platform:comprisesInterfacePart some JavaxManagementTimer

JavaxActivityAPI
type: Class
subclass of: JavaAPI
comment: JavaLibrary implementing the javax.activity package for J2SE 5.0
comment: platform:comprisesInterfacePart some JavaxActivity

JavaxImageioAPI
type: Class
equivalent class: JavaxImageioAPI
subclass of: JavaAPI
comment: JavaLibrary implementing the javax.imageio package for J2SE 5.0
comment: platform:comprisesInterfacePart some JavaxImageio

JavaxImageioMetadataAPI
type: Class
subclass of: JavaxImageioMetadataAPI
comment: JavaLibrary implementing the javax.imageio.metadata package for J2SE 5.0
comment: platform:comprisesInterfacePart some JavaxImageioMetadata

JavaxImageioEventAPI
type: Class
equivalent class: JavaxImageioEventAPI
subclass of: JavaAPI
comment: JavaLibrary implementing the javax.imageio.event package for J2SE 5.0
comment: platform:comprisesInterfacePart some JavaxImageioEvent

JavaxImageioPluginsBmpAPI
type: Class
subclass of: JavaAPI
comment: JavaLibrary implementing the javax.imageio.plugins.bmp package for J2SE 5.0
comment: platform:comprisesInterfacePart some JavaxImageioPluginsBmp

JavaxImageioPluginsJpegAPI
type: Class
equivalent class: JavaxImageioPluginsJpegAPI
subclass of: JavaAPI
comment: JavaLibrary implementing the javax.imageio.plugins.jpeg package for J2SE 5.0
comment: platform:comprisesInterfacePart some JavaxImageioPluginsJpeg

JavaxImageioStreamAPI
type: Class
equivalent class: JavaxImageioStreamAPI
subclass of: JavaAPI
comment: JavaLibrary implementing the javax.imageio.stream package for J2SE 5.0
comment: platform:comprisesInterfacePart some JavaxImageioStream

JavaxImageioSpiAPI
type: Class
equivalent class: JavaxImageioSpiAPI
subclass of: JavaAPI
comment: JavaLibrary implementing the javax.imageio.spi package for J2SE 5.0
comment: platform:comprisesInterfacePart some JavaxImageioSpi

JavaxNamingAPI
type: Class
subclass of: JavaxNamingAPI
comment: JavaLibrary implementing the javax.naming package for J2SE 5.0
comment: platform:comprisesInterfacePart some JavaxNaming

JavaxNamingDirectoryAPI
type: Class
subclass of: JavaxNamingDirectoryAPI
comment: JavaLibrary implementing the javax.naming.directory package for J2SE 5.0
comment: platform:comprisesInterfacePart some JavaxNamingDirectory

JavaxNamingEventAPI
type: Class
equivalent class: JavaxNamingEventAPI
subclass of: JavaAPI
comment: JavaLibrary implementing the javax.naming.event package for J2SE 5.0
comment: platform:comprisesInterfacePart some JavaxNamingEvent

JavaxNamingLdapAPI
type: Class
subclass of: JavaxNamingLdapAPI
comment: JavaLibrary implementing the javax.naming.ldap package for J2SE 5.0
comment: platform:comprisesInterfacePart some JavaxNamingLdap

JavaxNamingSpiAPI
type: Class
equivalent class: JavaxNamingSpiAPI
subclass of: JavaAPI
comment: JavaLibrary implementing the javax.naming.spi package for J2SE 5.0
comment: platform:comprisesInterfacePart some JavaxNamingSpi

JavaxPrintAPI
type: Class
equivalent class: JavaxPrintAPI
subclass of: JavaAPI
comment: JavaLibrary implementing the javax.print package for J2SE 5.0
comment: platform:comprisesInterfacePart some JavaxPrint

JavaxPrintAttributeAPI
type: Class
equivalent class: JavaxPrintAttributeAPI
subclass of: JavaAPI
comment: JavaLibrary implementing the javax.print.attribute package for J2SE 5.0
comment: platform:comprisesInterfacePart some JavaxPrintAttribute

JavaxPrintAttributeStandardAPI
type: Class
subclass of: JavaxPrintAttributeStandardAPI
comment: JavaLibrary implementing the javax.print.attribute.standard package for J2SE 5.0
comment: platform:comprisesInterfacePart some JavaxPrintAttributeStandard

JavaxPrintEventAPI
type: Class
equivalent class: JavaxPrintEventAPI
subclass of: JavaAPI
comment: JavaLibrary implementing the javax.print.event package for J2SE 5.0
comment: platform:comprisesInterfacePart some JavaxPrintEvent

JavaxRmiAPI
type: Class
equivalent class: JavaxRmiAPI
subclass of: JavaAPI
comment: JavaLibrary implementing the javax.rmi package for J2SE 5.0
comment: platform:comprisesInterfacePart some JavaxRmi

JavaxRmiCORBAAPI
type: Class
subclass of: JavaxRmiCORBAAPI
comment: JavaLibrary implementing the javax.rmi.CORBA package for J2SE 5.0
comment: platform:comprisesInterfacePart some JavaxRmiCORBA

JavaxRmiSslAPI
type: Class
subclass of: JavaAPI
comment: JavaLibrary implementing the javax.rmi.ssl package for J2SE 5.0
comment: platform:comprisesInterfacePart some JavaxRmiSsl

JavaxSoundMidiAPI
type: Class
subclass of: JavaAPI
comment: JavaLibrary implementing the javax.sound.midi package for J2SE 5.0
comment: platform:comprisesInterfacePart some JavaxSoundMidi

JavaxSoundMidiSpiAPI
type: Class
equivalent class: JavaxSoundMidiSpiAPI
subclass of: JavaAPI
comment: JavaLibrary implementing the javax.sound.midi.spi package for J2SE 5.0
comment: platform:comprisesInterfacePart some JavaxSoundMidiSpi

JavaxSoundSampledAPI
type: Class
subclass of: JavaxSoundSampledAPI
comment: JavaLibrary implementing the javax.sound.sampled package for J2SE 5.0
comment: platform:comprisesInterfacePart some JavaxSoundSampled

JavaxSoundSampledSpiAPI
type: Class
equivalent class: JavaxSoundSampledSpiAPI
subclass of: JavaAPI
comment: JavaLibrary implementing the javax.sound.sampled.spi package for J2SE 5.0
comment: platform:comprisesInterfacePart some JavaxSoundSampledSpi

JavaxSqlAPI
type: Class
equivalent class: JavaxSqlAPI
subclass of: JavaAPI
comment: JavaLibrary implementing the javax.sql package for J2SE 5.0
comment: platform:comprisesInterfacePart some JavaxSql

JavaxSqlRowsetAPI
type: Class
subclass of: JavaAPI
comment: JavaLibrary implementing the javax.sql.rowset package for J2SE 5.0
comment: platform:comprisesInterfacePart some JavaxSqlRowset

JavaxSqlRowsetSpiAPI
type: Class
subclass of: JavaAPI
comment: JavaLibrary implementing the javax.sql.rowset.spi package for J2SE 5.0
comment: platform:comprisesInterfacePart some JavaxSqlRowsetSpi

JavaxSqlRowsetSerialAPI
type: Class
subclass of: JavaAPI
comment: JavaLibrary implementing the javax.sql.rowset.serial package for J2SE 5.0
comment: platform:comprisesInterfacePart some JavaxSqlRowsetSerial

JavaxTransactionAPI
type: Class
equivalent class: JavaxTransactionAPI
subclass of: JavaAPI
comment: JavaLibrary implementing the javax.transaction package for J2SE 5.0
comment: platform:comprisesInterfacePart some JavaxTransaction

JavaxTransactionXaAPI
type: Class
equivalent class: JavaxTransactionXaAPI
subclass of: JavaAPI
comment: JavaLibrary implementing the javax.transaction.xa package for J2SE 5.0
comment: platform:comprisesInterfacePart some JavaxTransactionXa

JavaxXmlAPI
type: Class
subclass of: JavaAPI
comment: JavaLibrary implementing the javax.xml package for J2SE 5.0
comment: platform:comprisesInterfacePart some JavaxXml

JavaxXmlDatatypeAPI
type: Class
subclass of: JavaAPI
comment: JavaLibrary implementing the javax.xml.datatype package for J2SE 5.0
comment: platform:comprisesInterfacePart some JavaxXmlDatatype

JavaxXmlNamespaceAPI
type: Class
subclass of: JavaAPI
comment: JavaLibrary implementing the javax.xml.namespace package for J2SE 5.0
comment: platform:comprisesInterfacePart some JavaxXmlNamespace

JavaxXmlTransformAPI
type: Class
subclass of: JavaxXmlTransformAPI
comment: JavaLibrary implementing the javax.xml.transform package for J2SE 5.0
comment: platform:comprisesInterfacePart some JavaxXmlTransform

JavaxXmlTransformDomAPI
type: Class
subclass of: JavaxXmlTransformDomAPI
comment: JavaLibrary implementing the javax.xml.transform.dom package for J2SE 5.0
comment: platform:comprisesInterfacePart some JavaxXmlTransformDom

JavaxXmlTransformSaxAPI
type: Class
subclass of: JavaxXmlTransformSaxAPI
comment: JavaLibrary implementing the javax.xml.transform.sax package for J2SE 5.0
comment: platform:comprisesInterfacePart some JavaxXmlTransformSax

JavaxXmlTransformStreamAPI
type: Class
equivalent class: JavaxXmlTransformStreamAPI
subclass of: JavaAPI
comment: JavaLibrary implementing the javax.xml.transform.stream package for J2SE 5.0
comment: platform:comprisesInterfacePart some JavaxXmlTransformStream

JavaxXmlValidationAPI
type: Class
subclass of: JavaAPI
comment: JavaLibrary implementing the javax.xml.validation package for J2SE 5.0
comment: platform:comprisesInterfacePart some JavaxXmlValidation

JavaxXmlXpathAPI
type: Class
subclass of: JavaAPI
comment: JavaLibrary implementing the javax.xml.xpath package for J2SE 5.0
comment: platform:comprisesInterfacePart some JavaxXmlXpath

JavaxXmlParsersAPI
type: Class
subclass of: JavaxXmlParsersAPI
comment: JavaLibrary implementing the javax.xml.parsers package for J2SE 5.0
comment: platform:comprisesInterfacePart some JavaxXmlParsers

JavaLangAPI
type: Class
subclass of: JavaLangAPI
comment: JavaLibrary implementing the java.lang package for J2SE 5.0
comment: platform:comprisesInterfacePart some JavaLang

JavaLangReflectAPI
type: Class
subclass of: JavaLangReflectAPI
comment: JavaLibrary implementing the java.lang.reflect package for J2SE 5.0
comment: platform:comprisesInterfacePart some JavaLangReflect

JavaLangAnnotationAPI
type: Class
subclass of: JavaAPI
comment: JavaLibrary implementing the java.lang.annotation package for J2SE 5.0
comment: platform:comprisesInterfacePart some JavaLangAnnotation

JavaLangInstrumentAPI
type: Class
subclass of: JavaAPI
comment: JavaLibrary implementing the java.lang.instrument package for J2SE 5.0
comment: platform:comprisesInterfacePart some JavaLangInstrument

JavaLangManagementAPI
type: Class
subclass of: JavaAPI
comment: JavaLibrary implementing the java.lang.management package for J2SE 5.0
comment: platform:comprisesInterfacePart some JavaLangManagement

JavaLangRefAPI
type: Class
equivalent class: JavaLangRefAPI
subclass of: JavaAPI
comment: JavaLibrary implementing the java.lang.ref package for J2SE 5.0
comment: platform:comprisesInterfacePart some JavaLangRef

JavaSecurityAPI
type: Class
subclass of: JavaSecurityAPI
comment: JavaLibrary implementing the java.security package for J2SE 5.0
comment: platform:comprisesInterfacePart some JavaSecurity

JavaSecuritySpecAPI
type: Class
subclass of: JavaSecuritySpecAPI
comment: JavaLibrary implementing the java.security.spec package for J2SE 5.0
comment: platform:comprisesInterfacePart some JavaSecuritySpec

JavaSecurityCertAPI
type: Class
subclass of: JavaAPI
comment: JavaLibrary implementing the java.security.cert package for J2SE 5.0
comment: platform:comprisesInterfacePart some JavaSecurityCert

JavaSecurityAclAPI
type: Class
equivalent class: JavaSecurityAclAPI
subclass of: JavaAPI
comment: JavaLibrary implementing the java.security.acl package for J2SE 5.0
comment: platform:comprisesInterfacePart some JavaSecurityAcl

JavaSecurityInterfacesAPI
type: Class
subclass of: JavaSecurityInterfacesAPI
comment: JavaLibrary implementing the java.security.interfaces package for J2SE 5.0
comment: platform:comprisesInterfacePart some JavaSecurityInterfaces

JavaMathAPI
type: Class
subclass of: JavaMathAPI
comment: JavaLibrary implementing the java.math package for J2SE 5.0
comment: platform:comprisesInterfacePart some JavaMath

JavaNioAPI
type: Class
subclass of: JavaNioAPI
comment: JavaLibrary implementing the java.nio package for J2SE 5.0
comment: platform:comprisesInterfacePart some JavaNio

JavaNioChannelsAPI
type: Class
subclass of: JavaNioChannelsAPI
comment: JavaLibrary implementing the java.nio.channels package for J2SE 5.0
comment: platform:comprisesInterfacePart some JavaNioChannels

JavaNioChannelsSpiAPI
type: Class
subclass of: JavaNioChannelsSpiAPI
comment: JavaLibrary implementing the java.nio.channels.spi package for J2SE 5.0
comment: platform:comprisesInterfacePart some JavaNioChannelsSpi

JavaNioCharsetAPI
type: Class
subclass of: JavaNioCharsetAPI
comment: JavaLibrary implementing the java.nio.charset package for J2SE 5.0
comment: platform:comprisesInterfacePart some JavaNioCharset

JavaNioCharsetSpiAPI
type: Class
equivalent class: JavaNioCharsetSpiAPI
subclass of: JavaAPI
comment: JavaLibrary implementing the java.nio.charset.spi package for J2SE 5.0
comment: platform:comprisesInterfacePart some JavaNioCharsetSpi

JavaIoAPI
type: Class
subclass of: JavaIoAPI
comment: JavaLibrary implementing the java.io package for J2SE 5.0
comment: platform:comprisesInterfacePart some JavaIo

JavaNetAPI
type: Class
subclass of: JavaNetAPI
comment: JavaLibrary implementing the java.net package for J2SE 5.0
comment: platform:comprisesInterfacePart some JavaNet

JavaUtilAPI
type: Class
subclass of: JavaUtilAPI
comment: JavaLibrary implementing the java.util package for J2SE 5.0
comment: platform:comprisesInterfacePart some JavaUtil

JavaUtilRegexAPI
type: Class
subclass of: JavaUtilRegexAPI
comment: JavaLibrary implementing the java.util.regex package for J2SE 5.0
comment: platform:comprisesInterfacePart some JavaUtilRegex

JavaUtilConcurrentAPI
type: Class
subclass of: JavaAPI
comment: JavaLibrary implementing the java.util.concurrent package for J2SE 5.0
comment: platform:comprisesInterfacePart some JavaUtilConcurrent

JavaUtilConcurrentAtomicAPI
type: Class
subclass of: JavaAPI
comment: JavaLibrary implementing the java.util.concurrent.atomic package for J2SE 5.0
comment: platform:comprisesInterfacePart some JavaUtilConcurrentAtomic

JavaUtilConcurrentLocksAPI
type: Class
subclass of: JavaAPI
comment: JavaLibrary implementing the java.util.concurrent.locks package for J2SE 5.0
comment: platform:comprisesInterfacePart some JavaUtilConcurrentLocks

JavaUtilJarAPI
type: Class
subclass of: JavaUtilJarAPI
comment: JavaLibrary implementing the java.util.jar package for J2SE 5.0
comment: platform:comprisesInterfacePart some JavaUtilJar

JavaUtilZipAPI
type: Class
subclass of: JavaUtilZipAPI
comment: JavaLibrary implementing the java.util.zip package for J2SE 5.0
comment: platform:comprisesInterfacePart some JavaUtilZip

JavaUtilLoggingAPI
type: Class
subclass of: JavaUtilLoggingAPI
comment: JavaLibrary implementing the java.util.logging package for J2SE 5.0
comment: platform:comprisesInterfacePart some JavaUtilLogging

JavaUtilPrefsAPI
type: Class
equivalent class: JavaUtilPrefsAPI
subclass of: JavaAPI
comment: JavaLibrary implementing the java.util.prefs package for J2SE 5.0
comment: platform:comprisesInterfacePart some JavaUtilPrefs

JavaAppletAPI
type: Class
subclass of: JavaAppletAPI
comment: JavaLibrary implementing the java.applet package for J2SE 5.0
comment: platform:comprisesInterfacePart some JavaApplet

JavaAwtAPI
type: Class
subclass of: JavaAwtAPI
comment: JavaLibrary implementing the java.awt package for J2SE 5.0
comment: platform:comprisesInterfacePart some JavaAwt

JavaAwtEventAPI
type: Class
subclass of: JavaAwtEventAPI
comment: JavaLibrary implementing the java.awt.event package for J2SE 5.0
comment: platform:comprisesInterfacePart some JavaAwtEvent

JavaAwtImageAPI
type: Class
subclass of: JavaAwtImageAPI
comment: JavaLibrary implementing the java.awt.image package for J2SE 5.0
comment: platform:comprisesInterfacePart some JavaAwtImage

JavaAwtImageRenderableAPI
type: Class
equivalent class: JavaAwtImageRenderableAPI
subclass of: JavaAPI
comment: JavaLibrary implementing the java.awt.image.renderable package for J2SE 5.0
comment: platform:comprisesInterfacePart some JavaAwtImageRenderable

JavaAwtGeomAPI
type: Class
equivalent class: JavaAwtGeomAPI
subclass of: JavaAPI
comment: JavaLibrary implementing the java.awt.geom package for J2SE 5.0
comment: platform:comprisesInterfacePart some JavaAwtGeom

JavaAwtImAPI
type: Class
equivalent class: JavaAwtImAPI
subclass of: JavaAPI
comment: JavaLibrary implementing the java.awt.im package for J2SE 5.0
comment: platform:comprisesInterfacePart some JavaAwtIm

JavaAwtImSpiAPI
type: Class
equivalent class: JavaAwtImSpiAPI
subclass of: JavaAPI
comment: JavaLibrary implementing the java.awt.im.spi package for J2SE 5.0
comment: platform:comprisesInterfacePart some JavaAwtImSpi

JavaAwtColorAPI
type: Class
subclass of: JavaAwtColorAPI
comment: JavaLibrary implementing the java.awt.color package for J2SE 5.0
comment: platform:comprisesInterfacePart some JavaAwtColor

JavaAwtDatatransferAPI
type: Class
subclass of: JavaAwtDatatransferAPI
comment: JavaLibrary implementing the java.awt.datatransfer package for J2SE 5.0
comment: platform:comprisesInterfacePart some JavaAwtDatatransfer

JavaAwtDndAPI
type: Class
subclass of: JavaAwtDndAPI
comment: JavaLibrary implementing the java.awt.dnd package for J2SE 5.0
comment: platform:comprisesInterfacePart some JavaAwtDnd

JavaAwtFontAPI
type: Class
equivalent class: JavaAwtFontAPI
subclass of: JavaAPI
comment: JavaLibrary implementing the java.awt.font package for J2SE 5.0
comment: platform:comprisesInterfacePart some JavaAwtFont

JavaAwtPrintAPI
type: Class
equivalent class: JavaAwtPrintAPI
subclass of: JavaAPI
comment: JavaLibrary implementing the java.awt.print package for J2SE 5.0
comment: platform:comprisesInterfacePart some JavaAwtPrint

JavaTextAPI
type: Class
subclass of: JavaTextAPI
comment: JavaLibrary implementing the java.text package for J2SE 5.0
comment: platform:comprisesInterfacePart some JavaText

JavaBeansAPI
type: Class
subclass of: JavaBeansAPI
comment: JavaLibrary implementing the java.beans package for J2SE 5.0
comment: platform:comprisesInterfacePart some JavaBeans

JavaBeansBeancontextAPI
type: Class
equivalent class: JavaBeansBeancontextAPI
subclass of: JavaAPI
comment: JavaLibrary implementing the java.beans.beancontext package for J2SE 5.0
comment: platform:comprisesInterfacePart some JavaBeansBeancontext

JavaRmiAPI
type: Class
equivalent class: JavaRmiAPI
subclass of: JavaAPI
comment: JavaLibrary implementing the java.rmi package for J2SE 5.0
comment: platform:comprisesInterfacePart some JavaRmi

JavaRmiActivationAPI
type: Class
equivalent class: JavaRmiActivationAPI
subclass of: JavaAPI
comment: JavaLibrary implementing the java.rmi.activation package for J2SE 5.0
comment: platform:comprisesInterfacePart some JavaRmiActivation

JavaRmiServerAPI
type: Class
subclass of: JavaRmiServerAPI
comment: JavaLibrary implementing the java.rmi.server package for J2SE 5.0
comment: platform:comprisesInterfacePart some JavaRmiServer

JavaRmiDgcAPI
type: Class
equivalent class: JavaRmiDgcAPI
subclass of: JavaAPI
comment: JavaLibrary implementing the java.rmi.dgc package for J2SE 5.0
comment: platform:comprisesInterfacePart some JavaRmiDgc

JavaRmiRegistryAPI
type: Class
equivalent class: JavaRmiRegistryAPI
subclass of: JavaAPI
comment: JavaLibrary implementing the java.rmi.registry package for J2SE 5.0
comment: platform:comprisesInterfacePart some JavaRmiRegistry

JavaSqlAPI
type: Class
equivalent class: JavaSqlAPI
subclass of: JavaAPI
comment: JavaLibrary implementing the java.sql package for J2SE 5.0
comment: platform:comprisesInterfacePart some JavaSql

OrgW3cDomAPI
type: Class
subclass of: OrgW3cDomAPI
comment: JavaLibrary implementing the org.w3c.dom package for J2SE 5.0
comment: platform:comprisesInterfacePart some OrgW3cDom

OrgW3cDomLsAPI
type: Class
subclass of: JavaAPI
comment: JavaLibrary implementing the org.w3c.dom.ls package for J2SE 5.0
comment: platform:comprisesInterfacePart some OrgW3cDomLs

OrgW3cDomBootstrapAPI
type: Class
subclass of: JavaAPI
comment: JavaLibrary implementing the org.w3c.dom.bootstrap package for J2SE 5.0
comment: platform:comprisesInterfacePart some OrgW3cDomBootstrap

OrgW3cDomCssAPI
type: Class
subclass of: OrgW3cDomCssAPI
comment: JavaLibrary implementing the org.w3c.dom.css package for J2SE 5.0
comment: platform:comprisesInterfacePart some OrgW3cDomCss

OrgW3cDomStylesheetsAPI
type: Class
equivalent class: OrgW3cDomStylesheetsAPI
subclass of: JavaAPI
comment: JavaLibrary implementing the org.w3c.dom.stylesheets package for J2SE 5.0
comment: platform:comprisesInterfacePart some OrgW3cDomStylesheets

OrgW3cDomViewsAPI
type: Class
equivalent class: OrgW3cDomViewsAPI
subclass of: JavaAPI
comment: JavaLibrary implementing the org.w3c.dom.views package for J2SE 5.0
comment: platform:comprisesInterfacePart some OrgW3cDomViews

OrgW3cDomEventsAPI
type: Class
equivalent class: OrgW3cDomEventsAPI
subclass of: JavaAPI
comment: JavaLibrary implementing the org.w3c.dom.events package for J2SE 5.0
comment: platform:comprisesInterfacePart some OrgW3cDomEvents

OrgW3cDomHtmlAPI
type: Class
subclass of: OrgW3cDomHtmlAPI
comment: JavaLibrary implementing the org.w3c.dom.html package for J2SE 5.0
comment: platform:comprisesInterfacePart some OrgW3cDomHtml

OrgW3cDomTraversalAPI
type: Class
equivalent class: OrgW3cDomTraversalAPI
subclass of: JavaAPI
comment: JavaLibrary implementing the org.w3c.dom.traversal package for J2SE 5.0
comment: platform:comprisesInterfacePart some OrgW3cDomTraversal

OrgW3cDomRangesAPI
type: Class
subclass of: JavaAPI
comment: JavaLibrary implementing the org.w3c.dom.ranges package for J2SE 5.0
comment: platform:comprisesInterfacePart some OrgW3cDomRanges

OrgOmgCORBA 2 3API
type: Class
equivalent class: OrgOmgCORBA 2 3API
subclass of: JavaAPI
comment: JavaLibrary implementing the org.omg.CORBA_2_3 package for J2SE 5.0
comment: platform:comprisesInterfacePart some OrgOmgCORBA_2_3

OrgOmgCORBA 2 3PortableAPI
type: Class
equivalent class: OrgOmgCORBA 2 3PortableAPI
subclass of: JavaAPI
comment: JavaLibrary implementing the org.omg.CORBA_2_3.portable package for J2SE 5.0
comment: platform:comprisesInterfacePart some OrgOmgCORBA_2_3Portable

OrgOmgCORBAAPI
type: Class
subclass of: OrgOmgCORBAAPI
comment: JavaLibrary implementing the org.omg.CORBA package for J2SE 5.0
comment: platform:comprisesInterfacePart some OrgOmgCORBA

OrgOmgCORBAPortableAPI
type: Class
subclass of: OrgOmgCORBAPortableAPI
comment: JavaLibrary implementing the org.omg.CORBA.portable package for J2SE 5.0
comment: platform:comprisesInterfacePart some OrgOmgCORBAPortable

OrgOmgCORBADynAnyPackageAPI
type: Class
equivalent class: OrgOmgCORBADynAnyPackageAPI
subclass of: JavaAPI
comment: JavaLibrary implementing the org.omg.CORBA.DynAnyPackage package for J2SE 5.0
comment: platform:comprisesInterfacePart some OrgOmgCORBADynAnyPackage

OrgOmgCORBAORBPackageAPI
type: Class
equivalent class: OrgOmgCORBAORBPackageAPI
subclass of: JavaAPI
comment: JavaLibrary implementing the org.omg.CORBA.ORBPackage package for J2SE 5.0
comment: platform:comprisesInterfacePart some OrgOmgCORBAORBPackage

OrgOmgCORBATypeCodePackageAPI
type: Class
equivalent class: OrgOmgCORBATypeCodePackageAPI
subclass of: JavaAPI
comment: JavaLibrary implementing the org.omg.CORBA.TypeCodePackage package for J2SE 5.0
comment: platform:comprisesInterfacePart some OrgOmgCORBATypeCodePackage

OrgOmgSendingContextAPI
type: Class
equivalent class: OrgOmgSendingContextAPI
subclass of: JavaAPI
comment: JavaLibrary implementing the org.omg.SendingContext package for J2SE 5.0
comment: platform:comprisesInterfacePart some OrgOmgSendingContext

OrgOmgCosNamingAPI
type: Class
subclass of: OrgOmgCosNamingAPI
comment: JavaLibrary implementing the org.omg.CosNaming package for J2SE 5.0
comment: platform:comprisesInterfacePart some OrgOmgCosNaming

OrgOmgCosNamingNamingContextExtPackageAPI
type: Class
equivalent class: OrgOmgCosNamingNamingContextExtPackageAPI
subclass of: JavaAPI
comment: JavaLibrary implementing the org.omg.CosNaming.NamingContextExtPackage package for J2SE 5.0
comment: platform:comprisesInterfacePart some OrgOmgCosNamingNamingContextExtPackage

OrgOmgCosNamingNamingContextPackageAPI
type: Class
equivalent class: OrgOmgCosNamingNamingContextPackageAPI
subclass of: JavaAPI
comment: JavaLibrary implementing the org.omg.CosNaming.NamingContextPackage package for J2SE 5.0
comment: platform:comprisesInterfacePart some OrgOmgCosNamingNamingContextPackage

OrgOmgPortableServerAPI
type: Class
subclass of: OrgOmgPortableServerAPI
comment: JavaLibrary implementing the org.omg.PortableServer package for J2SE 5.0
comment: platform:comprisesInterfacePart some OrgOmgPortableServer

OrgOmgPortableServerCurrentPackageAPI
type: Class
equivalent class: OrgOmgPortableServerCurrentPackageAPI
subclass of: JavaAPI
comment: JavaLibrary implementing the org.omg.PortableServer.CurrentPackage package for J2SE 5.0
comment: platform:comprisesInterfacePart some OrgOmgPortableServerCurrentPackage

OrgOmgPortableServerPOAManagerPackageAPI
type: Class
equivalent class: OrgOmgPortableServerPOAManagerPackageAPI
subclass of: JavaAPI
comment: JavaLibrary implementing the org.omg.PortableServer.POAManagerPackage package for J2SE 5.0
comment: platform:comprisesInterfacePart some OrgOmgPortableServerPOAManagerPackage

OrgOmgPortableServerPOAPackageAPI
type: Class
equivalent class: OrgOmgPortableServerPOAPackageAPI
subclass of: JavaAPI
comment: JavaLibrary implementing the org.omg.PortableServer.POAPackage package for J2SE 5.0
comment: platform:comprisesInterfacePart some OrgOmgPortableServerPOAPackage

OrgOmgPortableServerPortableAPI
type: Class
equivalent class: OrgOmgPortableServerPortableAPI
subclass of: JavaAPI
comment: JavaLibrary implementing the org.omg.PortableServer.portable package for J2SE 5.0
comment: platform:comprisesInterfacePart some OrgOmgPortableServerPortable

OrgOmgPortableServerServantLocatorPackageAPI
type: Class
equivalent class: OrgOmgPortableServerServantLocatorPackageAPI
subclass of: JavaAPI
comment: JavaLibrary implementing the org.omg.PortableServer.ServantLocatorPackage package for J2SE 5.0
comment: platform:comprisesInterfacePart some OrgOmgPortableServerServantLocatorPackage

OrgOmgDynamicAPI
type: Class
equivalent class: OrgOmgDynamicAPI
subclass of: JavaAPI
comment: JavaLibrary implementing the org.omg.Dynamic package for J2SE 5.0
comment: platform:comprisesInterfacePart some OrgOmgDynamic

OrgOmgDynamicAnyAPI
type: Class
subclass of: OrgOmgDynamicAnyAPI
comment: JavaLibrary implementing the org.omg.DynamicAny package for J2SE 5.0
comment: platform:comprisesInterfacePart some OrgOmgDynamicAny

OrgOmgDynamicAnyDynAnyFactoryPackageAPI
type: Class
equivalent class: OrgOmgDynamicAnyDynAnyFactoryPackageAPI
subclass of: JavaAPI
comment: JavaLibrary implementing the org.omg.DynamicAny.DynAnyFactoryPackage package for J2SE 5.0
comment: platform:comprisesInterfacePart some OrgOmgDynamicAnyDynAnyFactoryPackage

OrgOmgDynamicAnyDynAnyPackageAPI
type: Class
equivalent class: OrgOmgDynamicAnyDynAnyPackageAPI
subclass of: JavaAPI
comment: JavaLibrary implementing the org.omg.DynamicAny.DynAnyPackage package for J2SE 5.0
comment: platform:comprisesInterfacePart some OrgOmgDynamicAnyDynAnyPackage

OrgOmgIOPAPI
type: Class
subclass of: OrgOmgIOPAPI
comment: JavaLibrary implementing the org.omg.IOP package for J2SE 5.0
comment: platform:comprisesInterfacePart some OrgOmgIOP

OrgOmgIOPCodecFactoryPackageAPI
type: Class
equivalent class: OrgOmgIOPCodecFactoryPackageAPI
subclass of: JavaAPI
comment: JavaLibrary implementing the org.omg.IOP.CodecFactoryPackage package for J2SE 5.0
comment: platform:comprisesInterfacePart some OrgOmgIOPCodecFactoryPackage

OrgOmgIOPCodecPackageAPI
type: Class
equivalent class: OrgOmgIOPCodecPackageAPI
subclass of: JavaAPI
comment: JavaLibrary implementing the org.omg.IOP.CodecPackage package for J2SE 5.0
comment: platform:comprisesInterfacePart some OrgOmgIOPCodecPackage

OrgOmgMessagingAPI
type: Class
equivalent class: OrgOmgMessagingAPI
subclass of: JavaAPI
comment: JavaLibrary implementing the org.omg.Messaging package for J2SE 5.0
comment: platform:comprisesInterfacePart some OrgOmgMessaging

OrgOmgPortableInterceptorAPI
type: Class
subclass of: OrgOmgPortableInterceptorAPI
comment: JavaLibrary implementing the org.omg.PortableInterceptor package for J2SE 5.0
comment: platform:comprisesInterfacePart some OrgOmgPortableInterceptor

OrgOmgPortableInterceptorORBInitInfoPackageAPI
type: Class
equivalent class: OrgOmgPortableInterceptorORBInitInfoPackageAPI
subclass of: JavaAPI
comment: JavaLibrary implementing the org.omg.PortableInterceptor.ORBInitInfoPackage package for J2SE 5.0
comment: platform:comprisesInterfacePart some OrgOmgPortableInterceptorORBInitInfoPackage

OrgOmgStubJavaRmiAPI
type: Class
equivalent class: OrgOmgStubJavaRmiAPI
subclass of: JavaAPI
comment: JavaLibrary implementing the org.omg.stub.java.rmi package for J2SE 5.0
comment: platform:comprisesInterfacePart some OrgOmgStubJavaRmi

OrgOmgStubJavaxManagementRemoteRmiAPI
type: Class
subclass of: JavaAPI
comment: JavaLibrary implementing the org.omg.stub.javax.management.remote.rmi package for J2SE 5.0
comment: platform:comprisesInterfacePart some OrgOmgStubJavaxManagementRemoteRmi

OrgXmlSaxAPI
type: Class
equivalent class: OrgXmlSaxAPI
subclass of: JavaAPI
comment: JavaLibrary implementing the org.xml.sax package for J2SE 5.0
comment: platform:comprisesInterfacePart some OrgXmlSax

OrgXmlSaxExtAPI
type: Class
subclass of: OrgXmlSaxExtAPI
comment: JavaLibrary implementing the org.xml.sax.ext package for J2SE 5.0
comment: platform:comprisesInterfacePart some OrgXmlSaxExt

OrgXmlSaxHelpersAPI
type: Class
subclass of: OrgXmlSaxHelpersAPI
comment: JavaLibrary implementing the org.xml.sax.helpers package for J2SE 5.0
comment: platform:comprisesInterfacePart some OrgXmlSaxHelpers

OrgIetfJgssAPI
type: Class
equivalent class: OrgIetfJgssAPI
subclass of: JavaAPI
comment: JavaLibrary implementing the org.ietf.jgss package for J2SE 5.0
comment: platform:comprisesInterfacePart some OrgIetfJgss

JavaxCryptoClassLibrary
type: Class
subclass of: JavaxCryptoClassLibrary
comment: JavaLibrary implementing the javax.crypto package for J2SE 5.0
comment: platform:implementsInterface some JavaxCryptoAPI

JavaxCryptoInterfacesClassLibrary
type: Class
equivalent class: JavaxCryptoInterfacesClassLibrary
subclass of: JavaClassLibrary
comment: JavaLibrary implementing the javax.crypto.interfaces package for J2SE 5.0
comment: platform:implementsInterface some JavaxCryptoInterfacesAPI

JavaxCryptoSpecClassLibrary
type: Class
subclass of: JavaxCryptoSpecClassLibrary
comment: JavaLibrary implementing the javax.crypto.spec package for J2SE 5.0
comment: platform:implementsInterface some JavaxCryptoSpecAPI

JavaxNetClassLibrary
type: Class
equivalent class: JavaxNetClassLibrary
subclass of: JavaClassLibrary
comment: JavaLibrary implementing the javax.net package for J2SE 5.0
comment: platform:implementsInterface some JavaxNetAPI

JavaxNetSslClassLibrary
type: Class
subclass of: JavaxNetSslClassLibrary
comment: JavaLibrary implementing the javax.net.ssl package for J2SE 5.0
comment: platform:implementsInterface some JavaxNetSslAPI

JavaxSecurityCertClassLibrary
type: Class
equivalent class: JavaxSecurityCertClassLibrary
subclass of: JavaClassLibrary
comment: JavaLibrary implementing the javax.security.cert package for J2SE 5.0
comment: platform:implementsInterface some JavaxSecurityCertAPI

JavaxSecurityAuthClassLibrary
type: Class
equivalent class: JavaxSecurityAuthClassLibrary
subclass of: JavaClassLibrary
comment: JavaLibrary implementing the javax.security.auth package for J2SE 5.0
comment: platform:implementsInterface some JavaxSecurityAuthAPI

JavaxSecurityAuthCallbackClassLibrary
type: Class
equivalent class: JavaxSecurityAuthCallbackClassLibrary
subclass of: JavaClassLibrary
comment: JavaLibrary implementing the javax.security.auth.callback package for J2SE 5.0
comment: platform:implementsInterface some JavaxSecurityAuthCallbackAPI

JavaxSecurityAuthX500ClassLibrary
type: Class
equivalent class: JavaxSecurityAuthX500ClassLibrary
subclass of: JavaClassLibrary
comment: JavaLibrary implementing the javax.security.auth.x500 package for J2SE 5.0
comment: platform:implementsInterface some JavaxSecurityAuthX500API

JavaxSecurityAuthKerberosClassLibrary
type: Class
equivalent class: JavaxSecurityAuthKerberosClassLibrary
subclass of: JavaClassLibrary
comment: JavaLibrary implementing the javax.security.auth.kerberos package for J2SE 5.0
comment: platform:implementsInterface some JavaxSecurityAuthKerberosAPI

JavaxSecurityAuthLoginClassLibrary
type: Class
subclass of: JavaxSecurityAuthLoginClassLibrary
comment: JavaLibrary implementing the javax.security.auth.login package for J2SE 5.0
comment: platform:implementsInterface some JavaxSecurityAuthLoginAPI

JavaxSecurityAuthSpiClassLibrary
type: Class
equivalent class: JavaxSecurityAuthSpiClassLibrary
subclass of: JavaClassLibrary
comment: JavaLibrary implementing the javax.security.auth.spi package for J2SE 5.0
comment: platform:implementsInterface some JavaxSecurityAuthSpiAPI

JavaxSecuritySaslClassLibrary
type: Class
subclass of: JavaClassLibrary
comment: JavaLibrary implementing the javax.security.sasl package for J2SE 5.0
comment: platform:implementsInterface some JavaxSecuritySaslAPI

JavaxAccessibilityClassLibrary
type: Class
subclass of: JavaxAccessibilityClassLibrary
comment: JavaLibrary implementing the javax.accessibility package for J2SE 5.0
comment: platform:implementsInterface some JavaxAccessibilityAPI

JavaxSwingClassLibrary
type: Class
subclass of: JavaxSwingClassLibrary
comment: JavaLibrary implementing the javax.swing package for J2SE 5.0
comment: platform:implementsInterface some JavaxSwingAPI

JavaxSwingTextClassLibrary
type: Class
subclass of: JavaxSwingTextClassLibrary
comment: JavaLibrary implementing the javax.swing.text package for J2SE 5.0
comment: platform:implementsInterface some JavaxSwingTextAPI

JavaxSwingTextHtmlClassLibrary
type: Class
subclass of: JavaxSwingTextHtmlClassLibrary
comment: JavaLibrary implementing the javax.swing.text.html package for J2SE 5.0
comment: platform:implementsInterface some JavaxSwingTextHtmlAPI

JavaxSwingTextHtmlParserClassLibrary
type: Class
equivalent class: JavaxSwingTextHtmlParserClassLibrary
subclass of: JavaClassLibrary
comment: JavaLibrary implementing the javax.swing.text.html.parser package for J2SE 5.0
comment: platform:implementsInterface some JavaxSwingTextHtmlParserAPI

JavaxSwingTextRtfClassLibrary
type: Class
equivalent class: JavaxSwingTextRtfClassLibrary
subclass of: JavaClassLibrary
comment: JavaLibrary implementing the javax.swing.text.rtf package for J2SE 5.0
comment: platform:implementsInterface some JavaxSwingTextRtfAPI

JavaxSwingEventClassLibrary
type: Class
subclass of: JavaxSwingEventClassLibrary
comment: JavaLibrary implementing the javax.swing.event package for J2SE 5.0
comment: platform:implementsInterface some JavaxSwingEventAPI

JavaxSwingColorchooserClassLibrary
type: Class
subclass of: JavaxSwingColorchooserClassLibrary
comment: JavaLibrary implementing the javax.swing.colorchooser package for J2SE 5.0
comment: platform:implementsInterface some JavaxSwingColorchooserAPI

JavaxSwingPlafClassLibrary
type: Class
subclass of: JavaxSwingPlafClassLibrary
comment: JavaLibrary implementing the javax.swing.plaf package for J2SE 5.0
comment: platform:implementsInterface some JavaxSwingPlafAPI

JavaxSwingPlafBasicClassLibrary
type: Class
subclass of: JavaxSwingPlafBasicClassLibrary
comment: JavaLibrary implementing the javax.swing.plaf.basic package for J2SE 5.0
comment: platform:implementsInterface some JavaxSwingPlafBasicAPI

JavaxSwingPlafMetalClassLibrary
type: Class
subclass of: JavaxSwingPlafMetalClassLibrary
comment: JavaLibrary implementing the javax.swing.plaf.metal package for J2SE 5.0
comment: platform:implementsInterface some JavaxSwingPlafMetalAPI

JavaxSwingPlafMultiClassLibrary
type: Class
subclass of: JavaxSwingPlafMultiClassLibrary
comment: JavaLibrary implementing the javax.swing.plaf.multi package for J2SE 5.0
comment: platform:implementsInterface some JavaxSwingPlafMultiAPI

JavaxSwingPlafSynthClassLibrary
type: Class
subclass of: JavaClassLibrary
comment: JavaLibrary implementing the javax.swing.plaf.synth package for J2SE 5.0
comment: platform:implementsInterface some JavaxSwingPlafSynthAPI

JavaxSwingTreeClassLibrary
type: Class
subclass of: JavaxSwingTreeClassLibrary
comment: JavaLibrary implementing the javax.swing.tree package for J2SE 5.0
comment: platform:implementsInterface some JavaxSwingTreeAPI

JavaxSwingBorderClassLibrary
type: Class
equivalent class: JavaxSwingBorderClassLibrary
subclass of: JavaClassLibrary
comment: JavaLibrary implementing the javax.swing.border package for J2SE 5.0
comment: platform:implementsInterface some JavaxSwingBorderAPI

JavaxSwingFilechooserClassLibrary
type: Class
equivalent class: JavaxSwingFilechooserClassLibrary
subclass of: JavaClassLibrary
comment: JavaLibrary implementing the javax.swing.filechooser package for J2SE 5.0
comment: platform:implementsInterface some JavaxSwingFilechooserAPI

JavaxSwingTableClassLibrary
type: Class
subclass of: JavaxSwingTableClassLibrary
comment: JavaLibrary implementing the javax.swing.table package for J2SE 5.0
comment: platform:implementsInterface some JavaxSwingTableAPI

JavaxSwingUndoClassLibrary
type: Class
equivalent class: JavaxSwingUndoClassLibrary
subclass of: JavaClassLibrary
comment: JavaLibrary implementing the javax.swing.undo package for J2SE 5.0
comment: platform:implementsInterface some JavaxSwingUndoAPI

JavaxManagementClassLibrary
type: Class
subclass of: JavaClassLibrary
comment: JavaLibrary implementing the javax.management package for J2SE 5.0
comment: platform:implementsInterface some JavaxManagementAPI

JavaxManagementOpenmbeanClassLibrary
type: Class
subclass of: JavaClassLibrary
comment: JavaLibrary implementing the javax.management.openmbean package for J2SE 5.0
comment: platform:implementsInterface some JavaxManagementOpenmbeanAPI

JavaxManagementLoadingClassLibrary
type: Class
subclass of: JavaClassLibrary
comment: JavaLibrary implementing the javax.management.loading package for J2SE 5.0
comment: platform:implementsInterface some JavaxManagementLoadingAPI

JavaxManagementModelmbeanClassLibrary
type: Class
subclass of: JavaClassLibrary
comment: JavaLibrary implementing the javax.management.modelmbean package for J2SE 5.0
comment: platform:implementsInterface some JavaxManagementModelmbeanAPI

JavaxManagementMonitorClassLibrary
type: Class
subclass of: JavaClassLibrary
comment: JavaLibrary implementing the javax.management.monitor package for J2SE 5.0
comment: platform:implementsInterface some JavaxManagementMonitorAPI

JavaxManagementRelationClassLibrary
type: Class
subclass of: JavaClassLibrary
comment: JavaLibrary implementing the javax.management.relation package for J2SE 5.0
comment: platform:implementsInterface some JavaxManagementRelationAPI

JavaxManagementRemoteClassLibrary
type: Class
subclass of: JavaClassLibrary
comment: JavaLibrary implementing the javax.management.remote package for J2SE 5.0
comment: platform:implementsInterface some JavaxManagementRemoteAPI

JavaxManagementRemoteRmiClassLibrary
type: Class
subclass of: JavaClassLibrary
comment: JavaLibrary implementing the javax.management.remote.rmi package for J2SE 5.0
comment: platform:implementsInterface some JavaxManagementRemoteRmiAPI

JavaxManagementTimerClassLibrary
type: Class
subclass of: JavaClassLibrary
comment: JavaLibrary implementing the javax.management.timer package for J2SE 5.0
comment: platform:implementsInterface some JavaxManagementTimerAPI

JavaxActivityClassLibrary
type: Class
subclass of: JavaClassLibrary
comment: JavaLibrary implementing the javax.activity package for J2SE 5.0
comment: platform:implementsInterface some JavaxActivityAPI

JavaxImageioClassLibrary
type: Class
equivalent class: JavaxImageioClassLibrary
subclass of: JavaClassLibrary
comment: JavaLibrary implementing the javax.imageio package for J2SE 5.0
comment: platform:implementsInterface some JavaxImageioAPI

JavaxImageioMetadataClassLibrary
type: Class
subclass of: JavaxImageioMetadataClassLibrary
comment: JavaLibrary implementing the javax.imageio.metadata package for J2SE 5.0
comment: platform:implementsInterface some JavaxImageioMetadataAPI

JavaxImageioEventClassLibrary
type: Class
equivalent class: JavaxImageioEventClassLibrary
subclass of: JavaClassLibrary
comment: JavaLibrary implementing the javax.imageio.event package for J2SE 5.0
comment: platform:implementsInterface some JavaxImageioEventAPI

JavaxImageioPluginsBmpClassLibrary
type: Class
subclass of: JavaClassLibrary
comment: JavaLibrary implementing the javax.imageio.plugins.bmp package for J2SE 5.0
comment: platform:implementsInterface some JavaxImageioPluginsBmpAPI

JavaxImageioPluginsJpegClassLibrary
type: Class
equivalent class: JavaxImageioPluginsJpegClassLibrary
subclass of: JavaClassLibrary
comment: JavaLibrary implementing the javax.imageio.plugins.jpeg package for J2SE 5.0
comment: platform:implementsInterface some JavaxImageioPluginsJpegAPI

JavaxImageioStreamClassLibrary
type: Class
equivalent class: JavaxImageioStreamClassLibrary
subclass of: JavaClassLibrary
comment: JavaLibrary implementing the javax.imageio.stream package for J2SE 5.0
comment: platform:implementsInterface some JavaxImageioStreamAPI

JavaxImageioSpiClassLibrary
type: Class
equivalent class: JavaxImageioSpiClassLibrary
subclass of: JavaClassLibrary
comment: JavaLibrary implementing the javax.imageio.spi package for J2SE 5.0
comment: platform:implementsInterface some JavaxImageioSpiAPI

JavaxNamingClassLibrary
type: Class
subclass of: JavaxNamingClassLibrary
comment: JavaLibrary implementing the javax.naming package for J2SE 5.0
comment: platform:implementsInterface some JavaxNamingAPI

JavaxNamingDirectoryClassLibrary
type: Class
subclass of: JavaxNamingDirectoryClassLibrary
comment: JavaLibrary implementing the javax.naming.directory package for J2SE 5.0
comment: platform:implementsInterface some JavaxNamingDirectoryAPI

JavaxNamingEventClassLibrary
type: Class
equivalent class: JavaxNamingEventClassLibrary
subclass of: JavaClassLibrary
comment: JavaLibrary implementing the javax.naming.event package for J2SE 5.0
comment: platform:implementsInterface some JavaxNamingEventAPI

JavaxNamingLdapClassLibrary
type: Class
subclass of: JavaxNamingLdapClassLibrary
comment: JavaLibrary implementing the javax.naming.ldap package for J2SE 5.0
comment: platform:implementsInterface some JavaxNamingLdapAPI

JavaxNamingSpiClassLibrary
type: Class
equivalent class: JavaxNamingSpiClassLibrary
subclass of: JavaClassLibrary
comment: JavaLibrary implementing the javax.naming.spi package for J2SE 5.0
comment: platform:implementsInterface some JavaxNamingSpiAPI

JavaxPrintClassLibrary
type: Class
equivalent class: JavaxPrintClassLibrary
subclass of: JavaClassLibrary
comment: JavaLibrary implementing the javax.print package for J2SE 5.0
comment: platform:implementsInterface some JavaxPrintAPI

JavaxPrintAttributeClassLibrary
type: Class
equivalent class: JavaxPrintAttributeClassLibrary
subclass of: JavaClassLibrary
comment: JavaLibrary implementing the javax.print.attribute package for J2SE 5.0
comment: platform:implementsInterface some JavaxPrintAttributeAPI

JavaxPrintAttributeStandardClassLibrary
type: Class
subclass of: JavaxPrintAttributeStandardClassLibrary
comment: JavaLibrary implementing the javax.print.attribute.standard package for J2SE 5.0
comment: platform:implementsInterface some JavaxPrintAttributeStandardAPI

JavaxPrintEventClassLibrary
type: Class
equivalent class: JavaxPrintEventClassLibrary
subclass of: JavaClassLibrary
comment: JavaLibrary implementing the javax.print.event package for J2SE 5.0
comment: platform:implementsInterface some JavaxPrintEventAPI

JavaxRmiClassLibrary
type: Class
equivalent class: JavaxRmiClassLibrary
subclass of: JavaClassLibrary
comment: JavaLibrary implementing the javax.rmi package for J2SE 5.0
comment: platform:implementsInterface some JavaxRmiAPI

JavaxRmiCORBAClassLibrary
type: Class
subclass of: JavaxRmiCORBAClassLibrary
comment: JavaLibrary implementing the javax.rmi.CORBA package for J2SE 5.0
comment: platform:implementsInterface some JavaxRmiCORBAAPI

JavaxRmiSslClassLibrary
type: Class
subclass of: JavaClassLibrary
comment: JavaLibrary implementing the javax.rmi.ssl package for J2SE 5.0
comment: platform:implementsInterface some JavaxRmiSslAPI

JavaxSoundMidiClassLibrary
type: Class
subclass of: JavaClassLibrary
comment: JavaLibrary implementing the javax.sound.midi package for J2SE 5.0
comment: platform:implementsInterface some JavaxSoundMidiAPI

JavaxSoundMidiSpiClassLibrary
type: Class
equivalent class: JavaxSoundMidiSpiClassLibrary
subclass of: JavaClassLibrary
comment: JavaLibrary implementing the javax.sound.midi.spi package for J2SE 5.0
comment: platform:implementsInterface some JavaxSoundMidiSpiAPI

JavaxSoundSampledClassLibrary
type: Class
subclass of: JavaxSoundSampledClassLibrary
comment: JavaLibrary implementing the javax.sound.sampled package for J2SE 5.0
comment: platform:implementsInterface some JavaxSoundSampledAPI

JavaxSoundSampledSpiClassLibrary
type: Class
equivalent class: JavaxSoundSampledSpiClassLibrary
subclass of: JavaClassLibrary
comment: JavaLibrary implementing the javax.sound.sampled.spi package for J2SE 5.0
comment: platform:implementsInterface some JavaxSoundSampledSpiAPI

JavaxSqlClassLibrary
type: Class
equivalent class: JavaxSqlClassLibrary
subclass of: JavaClassLibrary
comment: JavaLibrary implementing the javax.sql package for J2SE 5.0
comment: platform:implementsInterface some JavaxSqlAPI

JavaxSqlRowsetClassLibrary
type: Class
subclass of: JavaClassLibrary
comment: JavaLibrary implementing the javax.sql.rowset package for J2SE 5.0
comment: platform:implementsInterface some JavaxSqlRowsetAPI

JavaxSqlRowsetSpiClassLibrary
type: Class
subclass of: JavaClassLibrary
comment: JavaLibrary implementing the javax.sql.rowset.spi package for J2SE 5.0
comment: platform:implementsInterface some JavaxSqlRowsetSpiAPI

JavaxSqlRowsetSerialClassLibrary
type: Class
subclass of: JavaClassLibrary
comment: JavaLibrary implementing the javax.sql.rowset.serial package for J2SE 5.0
comment: platform:implementsInterface some JavaxSqlRowsetSerialAPI

JavaxTransactionClassLibrary
type: Class
equivalent class: JavaxTransactionClassLibrary
subclass of: JavaClassLibrary
comment: JavaLibrary implementing the javax.transaction package for J2SE 5.0
comment: platform:implementsInterface some JavaxTransactionAPI

JavaxTransactionXaClassLibrary
type: Class
equivalent class: JavaxTransactionXaClassLibrary
subclass of: JavaClassLibrary
comment: JavaLibrary implementing the javax.transaction.xa package for J2SE 5.0
comment: platform:implementsInterface some JavaxTransactionXaAPI

JavaxXmlClassLibrary
type: Class
subclass of: JavaClassLibrary
comment: JavaLibrary implementing the javax.xml package for J2SE 5.0
comment: platform:implementsInterface some JavaxXmlAPI

JavaxXmlDatatypeClassLibrary
type: Class
subclass of: JavaClassLibrary
comment: JavaLibrary implementing the javax.xml.datatype package for J2SE 5.0
comment: platform:implementsInterface some JavaxXmlDatatypeAPI

JavaxXmlNamespaceClassLibrary
type: Class
subclass of: JavaClassLibrary
comment: JavaLibrary implementing the javax.xml.namespace package for J2SE 5.0
comment: platform:implementsInterface some JavaxXmlNamespaceAPI

JavaxXmlTransformClassLibrary
type: Class
subclass of: JavaxXmlTransformClassLibrary
comment: JavaLibrary implementing the javax.xml.transform package for J2SE 5.0
comment: platform:implementsInterface some JavaxXmlTransformAPI

JavaxXmlTransformDomClassLibrary
type: Class
subclass of: JavaxXmlTransformDomClassLibrary
comment: JavaLibrary implementing the javax.xml.transform.dom package for J2SE 5.0
comment: platform:implementsInterface some JavaxXmlTransformDomAPI

JavaxXmlTransformSaxClassLibrary
type: Class
subclass of: JavaxXmlTransformSaxClassLibrary
comment: JavaLibrary implementing the javax.xml.transform.sax package for J2SE 5.0
comment: platform:implementsInterface some JavaxXmlTransformSaxAPI

JavaxXmlTransformStreamClassLibrary
type: Class
equivalent class: JavaxXmlTransformStreamClassLibrary
subclass of: JavaClassLibrary
comment: JavaLibrary implementing the javax.xml.transform.stream package for J2SE 5.0
comment: platform:implementsInterface some JavaxXmlTransformStreamAPI

JavaxXmlValidationClassLibrary
type: Class
subclass of: JavaClassLibrary
comment: JavaLibrary implementing the javax.xml.validation package for J2SE 5.0
comment: platform:implementsInterface some JavaxXmlValidationAPI

JavaxXmlXpathClassLibrary
type: Class
subclass of: JavaClassLibrary
comment: JavaLibrary implementing the javax.xml.xpath package for J2SE 5.0
comment: platform:implementsInterface some JavaxXmlXpathAPI

JavaxXmlParsersClassLibrary
type: Class
subclass of: JavaxXmlParsersClassLibrary
comment: JavaLibrary implementing the javax.xml.parsers package for J2SE 5.0
comment: platform:implementsInterface some JavaxXmlParsersAPI

JavaLangClassLibrary
type: Class
subclass of: JavaLangClassLibrary
comment: JavaLibrary implementing the java.lang package for J2SE 5.0
comment: platform:implementsInterface some JavaLangAPI

JavaLangReflectClassLibrary
type: Class
subclass of: JavaLangReflectClassLibrary
comment: JavaLibrary implementing the java.lang.reflect package for J2SE 5.0
comment: platform:implementsInterface some JavaLangReflectAPI

JavaLangAnnotationClassLibrary
type: Class
subclass of: JavaClassLibrary
comment: JavaLibrary implementing the java.lang.annotation package for J2SE 5.0
comment: platform:implementsInterface some JavaLangAnnotationAPI

JavaLangInstrumentClassLibrary
type: Class
subclass of: JavaClassLibrary
comment: JavaLibrary implementing the java.lang.instrument package for J2SE 5.0
comment: platform:implementsInterface some JavaLangInstrumentAPI

JavaLangManagementClassLibrary
type: Class
subclass of: JavaClassLibrary
comment: JavaLibrary implementing the java.lang.management package for J2SE 5.0
comment: platform:implementsInterface some JavaLangManagementAPI

JavaLangRefClassLibrary
type: Class
equivalent class: JavaLangRefClassLibrary
subclass of: JavaClassLibrary
comment: JavaLibrary implementing the java.lang.ref package for J2SE 5.0
comment: platform:implementsInterface some JavaLangRefAPI

JavaSecurityClassLibrary
type: Class
subclass of: JavaSecurityClassLibrary
comment: JavaLibrary implementing the java.security package for J2SE 5.0
comment: platform:implementsInterface some JavaSecurityAPI

JavaSecuritySpecClassLibrary
type: Class
subclass of: JavaSecuritySpecClassLibrary
comment: JavaLibrary implementing the java.security.spec package for J2SE 5.0
comment: platform:implementsInterface some JavaSecuritySpecAPI

JavaSecurityCertClassLibrary
type: Class
subclass of: JavaClassLibrary
comment: JavaLibrary implementing the java.security.cert package for J2SE 5.0
comment: platform:implementsInterface some JavaSecurityCertAPI

JavaSecurityAclClassLibrary
type: Class
equivalent class: JavaSecurityAclClassLibrary
subclass of: JavaClassLibrary
comment: JavaLibrary implementing the java.security.acl package for J2SE 5.0
comment: platform:implementsInterface some JavaSecurityAclAPI

JavaSecurityInterfacesClassLibrary
type: Class
subclass of: JavaSecurityInterfacesClassLibrary
comment: JavaLibrary implementing the java.security.interfaces package for J2SE 5.0
comment: platform:implementsInterface some JavaSecurityInterfacesAPI

JavaMathClassLibrary
type: Class
subclass of: JavaMathClassLibrary
comment: JavaLibrary implementing the java.math package for J2SE 5.0
comment: platform:implementsInterface some JavaMathAPI

JavaNioClassLibrary
type: Class
subclass of: JavaNioClassLibrary
comment: JavaLibrary implementing the java.nio package for J2SE 5.0
comment: platform:implementsInterface some JavaNioAPI

JavaNioChannelsClassLibrary
type: Class
subclass of: JavaNioChannelsClassLibrary
comment: JavaLibrary implementing the java.nio.channels package for J2SE 5.0
comment: platform:implementsInterface some JavaNioChannelsAPI

JavaNioChannelsSpiClassLibrary
type: Class
subclass of: JavaNioChannelsSpiClassLibrary
comment: JavaLibrary implementing the java.nio.channels.spi package for J2SE 5.0
comment: platform:implementsInterface some JavaNioChannelsSpiAPI

JavaNioCharsetClassLibrary
type: Class
subclass of: JavaNioCharsetClassLibrary
comment: JavaLibrary implementing the java.nio.charset package for J2SE 5.0
comment: platform:implementsInterface some JavaNioCharsetAPI

JavaNioCharsetSpiClassLibrary
type: Class
equivalent class: JavaNioCharsetSpiClassLibrary
subclass of: JavaClassLibrary
comment: JavaLibrary implementing the java.nio.charset.spi package for J2SE 5.0
comment: platform:implementsInterface some JavaNioCharsetSpiAPI

JavaIoClassLibrary
type: Class
subclass of: JavaIoClassLibrary
comment: JavaLibrary implementing the java.io package for J2SE 5.0
comment: platform:implementsInterface some JavaIoAPI

JavaNetClassLibrary
type: Class
subclass of: JavaNetClassLibrary
comment: JavaLibrary implementing the java.net package for J2SE 5.0
comment: platform:implementsInterface some JavaNetAPI

JavaUtilClassLibrary
type: Class
subclass of: JavaUtilClassLibrary
comment: JavaLibrary implementing the java.util package for J2SE 5.0
comment: platform:implementsInterface some JavaUtilAPI

JavaUtilRegexClassLibrary
type: Class
subclass of: JavaUtilRegexClassLibrary
comment: JavaLibrary implementing the java.util.regex package for J2SE 5.0
comment: platform:implementsInterface some JavaUtilRegexAPI

JavaUtilConcurrentClassLibrary
type: Class
subclass of: JavaClassLibrary
comment: JavaLibrary implementing the java.util.concurrent package for J2SE 5.0
comment: platform:implementsInterface some JavaUtilConcurrentAPI

JavaUtilConcurrentAtomicClassLibrary
type: Class
subclass of: JavaClassLibrary
comment: JavaLibrary implementing the java.util.concurrent.atomic package for J2SE 5.0
comment: platform:implementsInterface some JavaUtilConcurrentAtomicAPI

JavaUtilConcurrentLocksClassLibrary
type: Class
subclass of: JavaClassLibrary
comment: JavaLibrary implementing the java.util.concurrent.locks package for J2SE 5.0
comment: platform:implementsInterface some JavaUtilConcurrentLocksAPI

JavaUtilJarClassLibrary
type: Class
subclass of: JavaUtilJarClassLibrary
comment: JavaLibrary implementing the java.util.jar package for J2SE 5.0
comment: platform:implementsInterface some JavaUtilJarAPI

JavaUtilZipClassLibrary
type: Class
subclass of: JavaUtilZipClassLibrary
comment: JavaLibrary implementing the java.util.zip package for J2SE 5.0
comment: platform:implementsInterface some JavaUtilZipAPI

JavaUtilLoggingClassLibrary
type: Class
subclass of: JavaUtilLoggingClassLibrary
comment: JavaLibrary implementing the java.util.logging package for J2SE 5.0
comment: platform:implementsInterface some JavaUtilLoggingAPI

JavaUtilPrefsClassLibrary
type: Class
equivalent class: JavaUtilPrefsClassLibrary
subclass of: JavaClassLibrary
comment: JavaLibrary implementing the java.util.prefs package for J2SE 5.0
comment: platform:implementsInterface some JavaUtilPrefsAPI

JavaAppletClassLibrary
type: Class
subclass of: JavaAppletClassLibrary
comment: JavaLibrary implementing the java.applet package for J2SE 5.0
comment: platform:implementsInterface some JavaAppletAPI

JavaAwtClassLibrary
type: Class
subclass of: JavaAwtClassLibrary
comment: JavaLibrary implementing the java.awt package for J2SE 5.0
comment: platform:implementsInterface some JavaAwtAPI

JavaAwtEventClassLibrary
type: Class
subclass of: JavaAwtEventClassLibrary
comment: JavaLibrary implementing the java.awt.event package for J2SE 5.0
comment: platform:implementsInterface some JavaAwtEventAPI

JavaAwtImageClassLibrary
type: Class
subclass of: JavaAwtImageClassLibrary
comment: JavaLibrary implementing the java.awt.image package for J2SE 5.0
comment: platform:implementsInterface some JavaAwtImageAPI

JavaAwtImageRenderableClassLibrary
type: Class
equivalent class: JavaAwtImageRenderableClassLibrary
subclass of: JavaClassLibrary
comment: JavaLibrary implementing the java.awt.image.renderable package for J2SE 5.0
comment: platform:implementsInterface some JavaAwtImageRenderableAPI

JavaAwtGeomClassLibrary
type: Class
equivalent class: JavaAwtGeomClassLibrary
subclass of: JavaClassLibrary
comment: JavaLibrary implementing the java.awt.geom package for J2SE 5.0
comment: platform:implementsInterface some JavaAwtGeomAPI

JavaAwtImClassLibrary
type: Class
equivalent class: JavaAwtImClassLibrary
subclass of: JavaClassLibrary
comment: JavaLibrary implementing the java.awt.im package for J2SE 5.0
comment: platform:implementsInterface some JavaAwtImAPI

JavaAwtImSpiClassLibrary
type: Class
equivalent class: JavaAwtImSpiClassLibrary
subclass of: JavaClassLibrary
comment: JavaLibrary implementing the java.awt.im.spi package for J2SE 5.0
comment: platform:implementsInterface some JavaAwtImSpiAPI

JavaAwtColorClassLibrary
type: Class
subclass of: JavaAwtColorClassLibrary
comment: JavaLibrary implementing the java.awt.color package for J2SE 5.0
comment: platform:implementsInterface some JavaAwtColorAPI

JavaAwtDatatransferClassLibrary
type: Class
subclass of: JavaAwtDatatransferClassLibrary
comment: JavaLibrary implementing the java.awt.datatransfer package for J2SE 5.0
comment: platform:implementsInterface some JavaAwtDatatransferAPI

JavaAwtDndClassLibrary
type: Class
subclass of: JavaAwtDndClassLibrary
comment: JavaLibrary implementing the java.awt.dnd package for J2SE 5.0
comment: platform:implementsInterface some JavaAwtDndAPI

JavaAwtFontClassLibrary
type: Class
equivalent class: JavaAwtFontClassLibrary
subclass of: JavaClassLibrary
comment: JavaLibrary implementing the java.awt.font package for J2SE 5.0
comment: platform:implementsInterface some JavaAwtFontAPI

JavaAwtPrintClassLibrary
type: Class
equivalent class: JavaAwtPrintClassLibrary
subclass of: JavaClassLibrary
comment: JavaLibrary implementing the java.awt.print package for J2SE 5.0
comment: platform:implementsInterface some JavaAwtPrintAPI

JavaTextClassLibrary
type: Class
subclass of: JavaTextClassLibrary
comment: JavaLibrary implementing the java.text package for J2SE 5.0
comment: platform:implementsInterface some JavaTextAPI

JavaBeansClassLibrary
type: Class
subclass of: JavaBeansClassLibrary
comment: JavaLibrary implementing the java.beans package for J2SE 5.0
comment: platform:implementsInterface some JavaBeansAPI

JavaBeansBeancontextClassLibrary
type: Class
equivalent class: JavaBeansBeancontextClassLibrary
subclass of: JavaClassLibrary
comment: JavaLibrary implementing the java.beans.beancontext package for J2SE 5.0
comment: platform:implementsInterface some JavaBeansBeancontextAPI

JavaRmiClassLibrary
type: Class
equivalent class: JavaRmiClassLibrary
subclass of: JavaClassLibrary
comment: JavaLibrary implementing the java.rmi package for J2SE 5.0
comment: platform:implementsInterface some JavaRmiAPI

JavaRmiActivationClassLibrary
type: Class
equivalent class: JavaRmiActivationClassLibrary
subclass of: JavaClassLibrary
comment: JavaLibrary implementing the java.rmi.activation package for J2SE 5.0
comment: platform:implementsInterface some JavaRmiActivationAPI

JavaRmiServerClassLibrary
type: Class
subclass of: JavaRmiServerClassLibrary
comment: JavaLibrary implementing the java.rmi.server package for J2SE 5.0
comment: platform:implementsInterface some JavaRmiServerAPI

JavaRmiDgcClassLibrary
type: Class
equivalent class: JavaRmiDgcClassLibrary
subclass of: JavaClassLibrary
comment: JavaLibrary implementing the java.rmi.dgc package for J2SE 5.0
comment: platform:implementsInterface some JavaRmiDgcAPI

JavaRmiRegistryClassLibrary
type: Class
equivalent class: JavaRmiRegistryClassLibrary
subclass of: JavaClassLibrary
comment: JavaLibrary implementing the java.rmi.registry package for J2SE 5.0
comment: platform:implementsInterface some JavaRmiRegistryAPI

JavaSqlClassLibrary
type: Class
equivalent class: JavaSqlClassLibrary
subclass of: JavaClassLibrary
comment: JavaLibrary implementing the java.sql package for J2SE 5.0
comment: platform:implementsInterface some JavaSqlAPI

OrgW3cDomClassLibrary
type: Class
subclass of: OrgW3cDomClassLibrary
comment: JavaLibrary implementing the org.w3c.dom package for J2SE 5.0
comment: platform:implementsInterface some OrgW3cDomAPI

OrgW3cDomLsClassLibrary
type: Class
subclass of: JavaClassLibrary
comment: JavaLibrary implementing the org.w3c.dom.ls package for J2SE 5.0
comment: platform:implementsInterface some OrgW3cDomLsAPI

OrgW3cDomBootstrapClassLibrary
type: Class
subclass of: JavaClassLibrary
comment: JavaLibrary implementing the org.w3c.dom.bootstrap package for J2SE 5.0
comment: platform:implementsInterface some OrgW3cDomBootstrapAPI

OrgW3cDomCssClassLibrary
type: Class
subclass of: OrgW3cDomCssClassLibrary
comment: JavaLibrary implementing the org.w3c.dom.css package for J2SE 5.0
comment: platform:implementsInterface some OrgW3cDomCssAPI

OrgW3cDomStylesheetsClassLibrary
type: Class
equivalent class: OrgW3cDomStylesheetsClassLibrary
subclass of: JavaClassLibrary
comment: JavaLibrary implementing the org.w3c.dom.stylesheets package for J2SE 5.0
comment: platform:implementsInterface some OrgW3cDomStylesheetsAPI

OrgW3cDomViewsClassLibrary
type: Class
equivalent class: OrgW3cDomViewsClassLibrary
subclass of: JavaClassLibrary
comment: JavaLibrary implementing the org.w3c.dom.views package for J2SE 5.0
comment: platform:implementsInterface some OrgW3cDomViewsAPI

OrgW3cDomEventsClassLibrary
type: Class
equivalent class: OrgW3cDomEventsClassLibrary
subclass of: JavaClassLibrary
comment: JavaLibrary implementing the org.w3c.dom.events package for J2SE 5.0
comment: platform:implementsInterface some OrgW3cDomEventsAPI

OrgW3cDomHtmlClassLibrary
type: Class
subclass of: OrgW3cDomHtmlClassLibrary
comment: JavaLibrary implementing the org.w3c.dom.html package for J2SE 5.0
comment: platform:implementsInterface some OrgW3cDomHtmlAPI

OrgW3cDomTraversalClassLibrary
type: Class
equivalent class: OrgW3cDomTraversalClassLibrary
subclass of: JavaClassLibrary
comment: JavaLibrary implementing the org.w3c.dom.traversal package for J2SE 5.0
comment: platform:implementsInterface some OrgW3cDomTraversalAPI

OrgW3cDomRangesClassLibrary
type: Class
subclass of: JavaClassLibrary
comment: JavaLibrary implementing the org.w3c.dom.ranges package for J2SE 5.0
comment: platform:implementsInterface some OrgW3cDomRangesAPI

OrgOmgCORBA 2 3ClassLibrary
type: Class
equivalent class: OrgOmgCORBA 2 3ClassLibrary
subclass of: JavaClassLibrary
comment: JavaLibrary implementing the org.omg.CORBA_2_3 package for J2SE 5.0
comment: platform:implementsInterface some OrgOmgCORBA_2_3API

OrgOmgCORBA 2 3PortableClassLibrary
type: Class
equivalent class: OrgOmgCORBA 2 3PortableClassLibrary
subclass of: JavaClassLibrary
comment: JavaLibrary implementing the org.omg.CORBA_2_3.portable package for J2SE 5.0
comment: platform:implementsInterface some OrgOmgCORBA_2_3PortableAPI

OrgOmgCORBAClassLibrary
type: Class
subclass of: OrgOmgCORBAClassLibrary
comment: JavaLibrary implementing the org.omg.CORBA package for J2SE 5.0
comment: platform:implementsInterface some OrgOmgCORBAAPI

OrgOmgCORBAPortableClassLibrary
type: Class
subclass of: OrgOmgCORBAPortableClassLibrary
comment: JavaLibrary implementing the org.omg.CORBA.portable package for J2SE 5.0
comment: platform:implementsInterface some OrgOmgCORBAPortableAPI

OrgOmgCORBADynAnyPackageClassLibrary
type: Class
equivalent class: OrgOmgCORBADynAnyPackageClassLibrary
subclass of: JavaClassLibrary
comment: JavaLibrary implementing the org.omg.CORBA.DynAnyPackage package for J2SE 5.0
comment: platform:implementsInterface some OrgOmgCORBADynAnyPackageAPI

OrgOmgCORBAORBPackageClassLibrary
type: Class
equivalent class: OrgOmgCORBAORBPackageClassLibrary
subclass of: JavaClassLibrary
comment: JavaLibrary implementing the org.omg.CORBA.ORBPackage package for J2SE 5.0
comment: platform:implementsInterface some OrgOmgCORBAORBPackageAPI

OrgOmgCORBATypeCodePackageClassLibrary
type: Class
equivalent class: OrgOmgCORBATypeCodePackageClassLibrary
subclass of: JavaClassLibrary
comment: JavaLibrary implementing the org.omg.CORBA.TypeCodePackage package for J2SE 5.0
comment: platform:implementsInterface some OrgOmgCORBATypeCodePackageAPI

OrgOmgSendingContextClassLibrary
type: Class
equivalent class: OrgOmgSendingContextClassLibrary
subclass of: JavaClassLibrary
comment: JavaLibrary implementing the org.omg.SendingContext package for J2SE 5.0
comment: platform:implementsInterface some OrgOmgSendingContextAPI

OrgOmgCosNamingClassLibrary
type: Class
subclass of: OrgOmgCosNamingClassLibrary
comment: JavaLibrary implementing the org.omg.CosNaming package for J2SE 5.0
comment: platform:implementsInterface some OrgOmgCosNamingAPI

OrgOmgCosNamingNamingContextExtPackageClassLibrary
type: Class
equivalent class: OrgOmgCosNamingNamingContextExtPackageClassLibrary
subclass of: JavaClassLibrary
comment: JavaLibrary implementing the org.omg.CosNaming.NamingContextExtPackage package for J2SE 5.0
comment: platform:implementsInterface some OrgOmgCosNamingNamingContextExtPackageAPI

OrgOmgCosNamingNamingContextPackageClassLibrary
type: Class
equivalent class: OrgOmgCosNamingNamingContextPackageClassLibrary
subclass of: JavaClassLibrary
comment: JavaLibrary implementing the org.omg.CosNaming.NamingContextPackage package for J2SE 5.0
comment: platform:implementsInterface some OrgOmgCosNamingNamingContextPackageAPI

OrgOmgPortableServerClassLibrary
type: Class
subclass of: OrgOmgPortableServerClassLibrary
comment: JavaLibrary implementing the org.omg.PortableServer package for J2SE 5.0
comment: platform:implementsInterface some OrgOmgPortableServerAPI

OrgOmgPortableServerCurrentPackageClassLibrary
type: Class
equivalent class: OrgOmgPortableServerCurrentPackageClassLibrary
subclass of: JavaClassLibrary
comment: JavaLibrary implementing the org.omg.PortableServer.CurrentPackage package for J2SE 5.0
comment: platform:implementsInterface some OrgOmgPortableServerCurrentPackageAPI

OrgOmgPortableServerPOAManagerPackageClassLibrary
type: Class
equivalent class: OrgOmgPortableServerPOAManagerPackageClassLibrary
subclass of: JavaClassLibrary
comment: JavaLibrary implementing the org.omg.PortableServer.POAManagerPackage package for J2SE 5.0
comment: platform:implementsInterface some OrgOmgPortableServerPOAManagerPackageAPI

OrgOmgPortableServerPOAPackageClassLibrary
type: Class
equivalent class: OrgOmgPortableServerPOAPackageClassLibrary
subclass of: JavaClassLibrary
comment: JavaLibrary implementing the org.omg.PortableServer.POAPackage package for J2SE 5.0
comment: platform:implementsInterface some OrgOmgPortableServerPOAPackageAPI

OrgOmgPortableServerPortableClassLibrary
type: Class
equivalent class: OrgOmgPortableServerPortableClassLibrary
subclass of: JavaClassLibrary
comment: JavaLibrary implementing the org.omg.PortableServer.portable package for J2SE 5.0
comment: platform:implementsInterface some OrgOmgPortableServerPortableAPI

OrgOmgPortableServerServantLocatorPackageClassLibrary
type: Class
equivalent class: OrgOmgPortableServerServantLocatorPackageClassLibrary
subclass of: JavaClassLibrary
comment: JavaLibrary implementing the org.omg.PortableServer.ServantLocatorPackage package for J2SE 5.0
comment: platform:implementsInterface some OrgOmgPortableServerServantLocatorPackageAPI

OrgOmgDynamicClassLibrary
type: Class
equivalent class: OrgOmgDynamicClassLibrary
subclass of: JavaClassLibrary
comment: JavaLibrary implementing the org.omg.Dynamic package for J2SE 5.0
comment: platform:implementsInterface some OrgOmgDynamicAPI

OrgOmgDynamicAnyClassLibrary
type: Class
subclass of: OrgOmgDynamicAnyClassLibrary
comment: JavaLibrary implementing the org.omg.DynamicAny package for J2SE 5.0
comment: platform:implementsInterface some OrgOmgDynamicAnyAPI

OrgOmgDynamicAnyDynAnyFactoryPackageClassLibrary
type: Class
equivalent class: OrgOmgDynamicAnyDynAnyFactoryPackageClassLibrary
subclass of: JavaClassLibrary
comment: JavaLibrary implementing the org.omg.DynamicAny.DynAnyFactoryPackage package for J2SE 5.0
comment: platform:implementsInterface some OrgOmgDynamicAnyDynAnyFactoryPackageAPI

OrgOmgDynamicAnyDynAnyPackageClassLibrary
type: Class
equivalent class: OrgOmgDynamicAnyDynAnyPackageClassLibrary
subclass of: JavaClassLibrary
comment: JavaLibrary implementing the org.omg.DynamicAny.DynAnyPackage package for J2SE 5.0
comment: platform:implementsInterface some OrgOmgDynamicAnyDynAnyPackageAPI

OrgOmgIOPClassLibrary
type: Class
subclass of: OrgOmgIOPClassLibrary
comment: JavaLibrary implementing the org.omg.IOP package for J2SE 5.0
comment: platform:implementsInterface some OrgOmgIOPAPI

OrgOmgIOPCodecFactoryPackageClassLibrary
type: Class
equivalent class: OrgOmgIOPCodecFactoryPackageClassLibrary
subclass of: JavaClassLibrary
comment: JavaLibrary implementing the org.omg.IOP.CodecFactoryPackage package for J2SE 5.0
comment: platform:implementsInterface some OrgOmgIOPCodecFactoryPackageAPI

OrgOmgIOPCodecPackageClassLibrary
type: Class
equivalent class: OrgOmgIOPCodecPackageClassLibrary
subclass of: JavaClassLibrary
comment: JavaLibrary implementing the org.omg.IOP.CodecPackage package for J2SE 5.0
comment: platform:implementsInterface some OrgOmgIOPCodecPackageAPI

OrgOmgMessagingClassLibrary
type: Class
equivalent class: OrgOmgMessagingClassLibrary
subclass of: JavaClassLibrary
comment: JavaLibrary implementing the org.omg.Messaging package for J2SE 5.0
comment: platform:implementsInterface some OrgOmgMessagingAPI

OrgOmgPortableInterceptorClassLibrary
type: Class
subclass of: OrgOmgPortableInterceptorClassLibrary
comment: JavaLibrary implementing the org.omg.PortableInterceptor package for J2SE 5.0
comment: platform:implementsInterface some OrgOmgPortableInterceptorAPI

OrgOmgPortableInterceptorORBInitInfoPackageClassLibrary
type: Class
equivalent class: OrgOmgPortableInterceptorORBInitInfoPackageClassLibrary
subclass of: JavaClassLibrary
comment: JavaLibrary implementing the org.omg.PortableInterceptor.ORBInitInfoPackage package for J2SE 5.0
comment: platform:implementsInterface some OrgOmgPortableInterceptorORBInitInfoPackageAPI

OrgOmgStubJavaRmiClassLibrary
type: Class
equivalent class: OrgOmgStubJavaRmiClassLibrary
subclass of: JavaClassLibrary
comment: JavaLibrary implementing the org.omg.stub.java.rmi package for J2SE 5.0
comment: platform:implementsInterface some OrgOmgStubJavaRmiAPI

OrgOmgStubJavaxManagementRemoteRmiClassLibrary
type: Class
subclass of: JavaClassLibrary
comment: JavaLibrary implementing the org.omg.stub.javax.management.remote.rmi package for J2SE 5.0
comment: platform:implementsInterface some OrgOmgStubJavaxManagementRemoteRmiAPI

OrgXmlSaxClassLibrary
type: Class
equivalent class: OrgXmlSaxClassLibrary
subclass of: JavaClassLibrary
comment: JavaLibrary implementing the org.xml.sax package for J2SE 5.0
comment: platform:implementsInterface some OrgXmlSaxAPI

OrgXmlSaxExtClassLibrary
type: Class
subclass of: OrgXmlSaxExtClassLibrary
comment: JavaLibrary implementing the org.xml.sax.ext package for J2SE 5.0
comment: platform:implementsInterface some OrgXmlSaxExtAPI

OrgXmlSaxHelpersClassLibrary
type: Class
subclass of: OrgXmlSaxHelpersClassLibrary
comment: JavaLibrary implementing the org.xml.sax.helpers package for J2SE 5.0
comment: platform:implementsInterface some OrgXmlSaxHelpersAPI

OrgIetfJgssClassLibrary
type: Class
equivalent class: OrgIetfJgssClassLibrary
subclass of: JavaClassLibrary
comment: JavaLibrary implementing the org.ietf.jgss package for J2SE 5.0
comment: platform:implementsInterface some OrgIetfJgssAPI