Java SE 6
type: Ontology
version info: $Id: UML2ToPackageAPIOntology.atl 8082 2010-03-18 21:11:00Z dwagelaa $
imports: platform.owl
imports: java.owl
imports: j2se-5 0.owl#
imports: isa.owl
comment: Generated by [UML2ToSimplifiedPackageAPIOntology.atl 8080 2010-03-18 10:46:40Z dwagelaa], [UML2ToPackageAPIOntology.atl 8082 2010-03-18 21:11:00Z dwagelaa], [UML2ToAPIOntology.atl 8082 2010-03-18 21:11:00Z dwagelaa], and [UML2Comparison.atl 8082 2010-03-18 21:11:00Z dwagelaa]
comment: Dennis Wagelaar <dennis.wagelaar@vub.ac.be>
comment: © 2010, Vrije Universiteit Brussel. All rights reserved.

JavaSE6API
type: Class
subclass of: JavaxJnlpAPI
subclass of: JavaxCryptoAPI
subclass of: JavaxCryptoInterfacesAPI
subclass of: JavaxCryptoSpecAPI
subclass of: JavaxNetAPI
subclass of: JavaxNetSslAPI
subclass of: JavaxSecurityCertAPI
subclass of: JavaxSecurityAuthAPI
subclass of: JavaxSecurityAuthCallbackAPI
subclass of: JavaxSecurityAuthLoginAPI
subclass of: JavaxSecurityAuthX500API
subclass of: JavaxSecurityAuthKerberosAPI
subclass of: JavaxSecurityAuthSpiAPI
subclass of: JavaxSecuritySaslAPI
subclass of: JavaxAccessibilityAPI
subclass of: JavaxSwingAPI
subclass of: JavaxSwingTextAPI
subclass of: JavaxSwingTextHtmlAPI
subclass of: JavaxSwingTextHtmlParserAPI
subclass of: JavaxSwingTextRtfAPI
subclass of: JavaxSwingEventAPI
subclass of: JavaxSwingColorchooserAPI
subclass of: JavaxSwingPlafAPI
subclass of: JavaxSwingPlafBasicAPI
subclass of: JavaxSwingPlafMetalAPI
subclass of: JavaxSwingPlafMultiAPI
subclass of: JavaxSwingPlafSynthAPI
subclass of: JavaxSwingFilechooserAPI
subclass of: JavaxSwingTreeAPI
subclass of: JavaxSwingBorderAPI
subclass of: JavaxSwingTableAPI
subclass of: JavaxSwingUndoAPI
subclass of: JavaxManagementAPI
subclass of: JavaxManagementOpenmbeanAPI
subclass of: JavaxManagementLoadingAPI
subclass of: JavaxManagementModelmbeanAPI
subclass of: JavaxManagementMonitorAPI
subclass of: JavaxManagementRelationAPI
subclass of: JavaxManagementRemoteAPI
subclass of: JavaxManagementRemoteRmiAPI
subclass of: JavaxManagementTimerAPI
subclass of: JavaxXmlAPI
subclass of: JavaxXmlTransformAPI
subclass of: JavaxXmlTransformDomAPI
subclass of: JavaxXmlTransformSaxAPI
subclass of: JavaxXmlTransformStaxAPI
subclass of: JavaxXmlTransformStreamAPI
subclass of: JavaxXmlBindAPI
subclass of: JavaxXmlBindAnnotationAPI
subclass of: JavaxXmlBindAnnotationAdaptersAPI
subclass of: JavaxXmlBindAttachmentAPI
subclass of: JavaxXmlBindHelpersAPI
subclass of: JavaxXmlBindUtilAPI
subclass of: JavaxXmlValidationAPI
subclass of: JavaxXmlNamespaceAPI
subclass of: JavaxXmlStreamAPI
subclass of: JavaxXmlStreamEventsAPI
subclass of: JavaxXmlStreamUtilAPI
subclass of: JavaxXmlParsersAPI
subclass of: JavaxXmlCryptoAPI
subclass of: JavaxXmlCryptoDsigAPI
subclass of: JavaxXmlCryptoDsigKeyinfoAPI
subclass of: JavaxXmlCryptoDsigSpecAPI
subclass of: JavaxXmlCryptoDsigDomAPI
subclass of: JavaxXmlCryptoDomAPI
subclass of: JavaxXmlDatatypeAPI
subclass of: JavaxXmlSoapAPI
subclass of: JavaxXmlWsAPI
subclass of: JavaxXmlWsHandlerAPI
subclass of: JavaxXmlWsHandlerSoapAPI
subclass of: JavaxXmlWsHttpAPI
subclass of: JavaxXmlWsSoapAPI
subclass of: JavaxXmlWsSpiAPI
subclass of: JavaxXmlWsWsaddressingAPI
subclass of: JavaxXmlXpathAPI
subclass of: JavaxActivationAPI
subclass of: JavaxActivityAPI
subclass of: JavaxAnnotationAPI
subclass of: JavaxAnnotationProcessingAPI

JavaSE6ClassLibrary
type: Class
subclass of: JavaxJnlpClassLibrary
subclass of: JavaxCryptoClassLibrary
subclass of: JavaxCryptoInterfacesClassLibrary
subclass of: JavaxCryptoSpecClassLibrary
subclass of: JavaxNetClassLibrary
subclass of: JavaxNetSslClassLibrary
subclass of: JavaxSecurityCertClassLibrary
subclass of: JavaxSecurityAuthClassLibrary
subclass of: JavaxSecurityAuthCallbackClassLibrary
subclass of: JavaxSecurityAuthLoginClassLibrary
subclass of: JavaxSecurityAuthX500ClassLibrary
subclass of: JavaxSecurityAuthKerberosClassLibrary
subclass of: JavaxSecurityAuthSpiClassLibrary
subclass of: JavaxSecuritySaslClassLibrary
subclass of: JavaxAccessibilityClassLibrary
subclass of: JavaxSwingClassLibrary
subclass of: JavaxSwingTextClassLibrary
subclass of: JavaxSwingTextHtmlClassLibrary
subclass of: JavaxSwingTextHtmlParserClassLibrary
subclass of: JavaxSwingTextRtfClassLibrary
subclass of: JavaxSwingEventClassLibrary
subclass of: JavaxSwingColorchooserClassLibrary
subclass of: JavaxSwingPlafClassLibrary
subclass of: JavaxSwingPlafBasicClassLibrary
subclass of: JavaxSwingPlafMetalClassLibrary
subclass of: JavaxSwingPlafMultiClassLibrary
subclass of: JavaxSwingPlafSynthClassLibrary
subclass of: JavaxSwingFilechooserClassLibrary
subclass of: JavaxSwingTreeClassLibrary
subclass of: JavaxSwingBorderClassLibrary
subclass of: JavaxSwingTableClassLibrary
subclass of: JavaxSwingUndoClassLibrary
subclass of: JavaxManagementClassLibrary
subclass of: JavaxManagementOpenmbeanClassLibrary
subclass of: JavaxManagementLoadingClassLibrary
subclass of: JavaxManagementModelmbeanClassLibrary
subclass of: JavaxManagementMonitorClassLibrary
subclass of: JavaxManagementRelationClassLibrary
subclass of: JavaxManagementRemoteClassLibrary
subclass of: JavaxManagementRemoteRmiClassLibrary
subclass of: JavaxManagementTimerClassLibrary
subclass of: JavaxXmlClassLibrary
subclass of: JavaxXmlTransformClassLibrary
subclass of: JavaxXmlTransformDomClassLibrary
subclass of: JavaxXmlTransformSaxClassLibrary
subclass of: JavaxXmlTransformStaxClassLibrary
subclass of: JavaxXmlTransformStreamClassLibrary
subclass of: JavaxXmlBindClassLibrary
subclass of: JavaxXmlBindAnnotationClassLibrary
subclass of: JavaxXmlBindAnnotationAdaptersClassLibrary
subclass of: JavaxXmlBindAttachmentClassLibrary
subclass of: JavaxXmlBindHelpersClassLibrary
subclass of: JavaxXmlBindUtilClassLibrary
subclass of: JavaxXmlValidationClassLibrary
subclass of: JavaxXmlNamespaceClassLibrary
subclass of: JavaxXmlStreamClassLibrary
subclass of: JavaxXmlStreamEventsClassLibrary
subclass of: JavaxXmlStreamUtilClassLibrary
subclass of: JavaxXmlParsersClassLibrary
subclass of: JavaxXmlCryptoClassLibrary
subclass of: JavaxXmlCryptoDsigClassLibrary
subclass of: JavaxXmlCryptoDsigKeyinfoClassLibrary
subclass of: JavaxXmlCryptoDsigSpecClassLibrary
subclass of: JavaxXmlCryptoDsigDomClassLibrary
subclass of: JavaxXmlCryptoDomClassLibrary
subclass of: JavaxXmlDatatypeClassLibrary
subclass of: JavaxXmlSoapClassLibrary
subclass of: JavaxXmlWsClassLibrary
subclass of: JavaxXmlWsHandlerClassLibrary
subclass of: JavaxXmlWsHandlerSoapClassLibrary
subclass of: JavaxXmlWsHttpClassLibrary
subclass of: JavaxXmlWsSoapClassLibrary
subclass of: JavaxXmlWsSpiClassLibrary
subclass of: JavaxXmlWsWsaddressingClassLibrary
subclass of: JavaxXmlXpathClassLibrary
subclass of: JavaxActivationClassLibrary
subclass of: JavaxActivityClassLibrary
subclass of: JavaxAnnotationClassLibrary
subclass of: JavaxAnnotationProcessingClassLibrary

JavaSE6BytecodeFormat
type: Class
subclass of: J2SE5 0BytecodeFormat
comment: Java SE 6 bytecode format
comment: java:majorVersionNumber some xsd:integer[>="50"^^xsd:integer] and java:preverified value false

theJavaSE6BytecodeFormat
type: JavaSE6BytecodeFormat
preverified: false
minor version number: 0
major version number: 50

JavaSE6VM
type: Class
equivalent class: Restriction
  on property: implementsInterface
  some values from: JavaSE6BytecodeFormat
subclass of: JavaVM
comment: Java SE 6 virtual machine

JavaSE6JRE
type: Class
equivalent class: Class
  intersection of: Restriction
    on property: providesFeature
    some values from: JavaSE6ClassLibrary
  intersection of: Restriction
    on property: providesFeature
    some values from: JavaSE6VM
subclass of: JRE
comment: Java SE 6 Java Runtime Environment

JavaxJnlp
type: Class
subclass of: JavaAPIPart
comment: Java API part implementing the javax.jnlp package for Java SE 6

JavaxCrypto
type: Class
equivalent class: JavaxCrypto
subclass of: JavaAPIPart
comment: Java API part implementing the javax.crypto package for Java SE 6

JavaxCryptoInterfaces
type: Class
equivalent class: JavaxCryptoInterfaces
subclass of: JavaAPIPart
comment: Java API part implementing the javax.crypto.interfaces package for Java SE 6

JavaxCryptoSpec
type: Class
equivalent class: JavaxCryptoSpec
subclass of: JavaAPIPart
comment: Java API part implementing the javax.crypto.spec package for Java SE 6

JavaxNet
type: Class
equivalent class: JavaxNet
subclass of: JavaAPIPart
comment: Java API part implementing the javax.net package for Java SE 6

JavaxNetSsl
type: Class
subclass of: JavaxNetSsl
comment: Java API part implementing the javax.net.ssl package for Java SE 6

JavaxSecurityCert
type: Class
equivalent class: JavaxSecurityCert
subclass of: JavaAPIPart
comment: Java API part implementing the javax.security.cert package for Java SE 6

JavaxSecurityAuth
type: Class
equivalent class: JavaxSecurityAuth
subclass of: JavaAPIPart
comment: Java API part implementing the javax.security.auth package for Java SE 6

JavaxSecurityAuthCallback
type: Class
equivalent class: JavaxSecurityAuthCallback
subclass of: JavaAPIPart
comment: Java API part implementing the javax.security.auth.callback package for Java SE 6

JavaxSecurityAuthLogin
type: Class
subclass of: JavaxSecurityAuthLogin
comment: Java API part implementing the javax.security.auth.login package for Java SE 6

JavaxSecurityAuthX500
type: Class
subclass of: JavaxSecurityAuthX500
comment: Java API part implementing the javax.security.auth.x500 package for Java SE 6

JavaxSecurityAuthKerberos
type: Class
equivalent class: JavaxSecurityAuthKerberos
subclass of: JavaAPIPart
comment: Java API part implementing the javax.security.auth.kerberos package for Java SE 6

JavaxSecurityAuthSpi
type: Class
equivalent class: JavaxSecurityAuthSpi
subclass of: JavaAPIPart
comment: Java API part implementing the javax.security.auth.spi package for Java SE 6

JavaxSecuritySasl
type: Class
subclass of: JavaxSecuritySasl
comment: Java API part implementing the javax.security.sasl package for Java SE 6

JavaxAccessibility
type: Class
subclass of: JavaxAccessibility
comment: Java API part implementing the javax.accessibility package for Java SE 6

JavaxSwing
type: Class
subclass of: JavaxSwing
comment: Java API part implementing the javax.swing package for Java SE 6

JavaxSwingText
type: Class
subclass of: JavaxSwingText
comment: Java API part implementing the javax.swing.text package for Java SE 6

JavaxSwingTextHtml
type: Class
subclass of: JavaxSwingTextHtml
comment: Java API part implementing the javax.swing.text.html package for Java SE 6

JavaxSwingTextHtmlParser
type: Class
equivalent class: JavaxSwingTextHtmlParser
subclass of: JavaAPIPart
comment: Java API part implementing the javax.swing.text.html.parser package for Java SE 6

JavaxSwingTextRtf
type: Class
subclass of: JavaxSwingTextRtf
comment: Java API part implementing the javax.swing.text.rtf package for Java SE 6

JavaxSwingEvent
type: Class
subclass of: JavaxSwingEvent
comment: Java API part implementing the javax.swing.event package for Java SE 6

JavaxSwingColorchooser
type: Class
subclass of: JavaxSwingColorchooser
comment: Java API part implementing the javax.swing.colorchooser package for Java SE 6

JavaxSwingPlaf
type: Class
subclass of: JavaxSwingPlaf
comment: Java API part implementing the javax.swing.plaf package for Java SE 6

JavaxSwingPlafBasic
type: Class
subclass of: JavaxSwingPlafBasic
comment: Java API part implementing the javax.swing.plaf.basic package for Java SE 6

JavaxSwingPlafMetal
type: Class
subclass of: JavaxSwingPlafMetal
comment: Java API part implementing the javax.swing.plaf.metal package for Java SE 6

JavaxSwingPlafMulti
type: Class
subclass of: JavaxSwingPlafMulti
comment: Java API part implementing the javax.swing.plaf.multi package for Java SE 6

JavaxSwingPlafSynth
type: Class
subclass of: JavaxSwingPlafSynth
comment: Java API part implementing the javax.swing.plaf.synth package for Java SE 6

JavaxSwingFilechooser
type: Class
subclass of: JavaxSwingFilechooser
comment: Java API part implementing the javax.swing.filechooser package for Java SE 6

JavaxSwingTree
type: Class
subclass of: JavaxSwingTree
comment: Java API part implementing the javax.swing.tree package for Java SE 6

JavaxSwingBorder
type: Class
subclass of: JavaxSwingBorder
comment: Java API part implementing the javax.swing.border package for Java SE 6

JavaxSwingTable
type: Class
subclass of: JavaxSwingTable
comment: Java API part implementing the javax.swing.table package for Java SE 6

JavaxSwingUndo
type: Class
equivalent class: JavaxSwingUndo
subclass of: JavaAPIPart
comment: Java API part implementing the javax.swing.undo package for Java SE 6

JavaxManagement
type: Class
subclass of: JavaxManagement
comment: Java API part implementing the javax.management package for Java SE 6

JavaxManagementOpenmbean
type: Class
subclass of: JavaxManagementOpenmbean
comment: Java API part implementing the javax.management.openmbean package for Java SE 6

JavaxManagementLoading
type: Class
subclass of: JavaxManagementLoading
comment: Java API part implementing the javax.management.loading package for Java SE 6

JavaxManagementModelmbean
type: Class
subclass of: JavaxManagementModelmbean
comment: Java API part implementing the javax.management.modelmbean package for Java SE 6

JavaxManagementMonitor
type: Class
subclass of: JavaxManagementMonitor
comment: Java API part implementing the javax.management.monitor package for Java SE 6

JavaxManagementRelation
type: Class
subclass of: JavaxManagementRelation
comment: Java API part implementing the javax.management.relation package for Java SE 6

JavaxManagementRemote
type: Class
subclass of: JavaxManagementRemote
comment: Java API part implementing the javax.management.remote package for Java SE 6

JavaxManagementRemoteRmi
type: Class
subclass of: JavaxManagementRemoteRmi
comment: Java API part implementing the javax.management.remote.rmi package for Java SE 6

JavaxManagementTimer
type: Class
subclass of: JavaAPIPart
comment: Java API part implementing the javax.management.timer package for Java SE 6

JavaxXml
type: Class
equivalent class: JavaxXml
subclass of: JavaAPIPart
comment: Java API part implementing the javax.xml package for Java SE 6

JavaxXmlTransform
type: Class
subclass of: JavaxXmlTransform
comment: Java API part implementing the javax.xml.transform package for Java SE 6

JavaxXmlTransformDom
type: Class
equivalent class: JavaxXmlTransformDom
subclass of: JavaAPIPart
comment: Java API part implementing the javax.xml.transform.dom package for Java SE 6

JavaxXmlTransformSax
type: Class
subclass of: JavaxXmlTransformSax
comment: Java API part implementing the javax.xml.transform.sax package for Java SE 6

JavaxXmlTransformStax
type: Class
subclass of: JavaAPIPart
comment: Java API part implementing the javax.xml.transform.stax package for Java SE 6

JavaxXmlTransformStream
type: Class
equivalent class: JavaxXmlTransformStream
subclass of: JavaAPIPart
comment: Java API part implementing the javax.xml.transform.stream package for Java SE 6

JavaxXmlBind
type: Class
subclass of: JavaAPIPart
comment: Java API part implementing the javax.xml.bind package for Java SE 6

JavaxXmlBindAnnotation
type: Class
subclass of: JavaAPIPart
comment: Java API part implementing the javax.xml.bind.annotation package for Java SE 6

JavaxXmlBindAnnotationAdapters
type: Class
subclass of: JavaAPIPart
comment: Java API part implementing the javax.xml.bind.annotation.adapters package for Java SE 6

JavaxXmlBindAttachment
type: Class
subclass of: JavaAPIPart
comment: Java API part implementing the javax.xml.bind.attachment package for Java SE 6

JavaxXmlBindHelpers
type: Class
subclass of: JavaAPIPart
comment: Java API part implementing the javax.xml.bind.helpers package for Java SE 6

JavaxXmlBindUtil
type: Class
subclass of: JavaAPIPart
comment: Java API part implementing the javax.xml.bind.util package for Java SE 6

JavaxXmlValidation
type: Class
subclass of: JavaxXmlValidation
comment: Java API part implementing the javax.xml.validation package for Java SE 6

JavaxXmlNamespace
type: Class
equivalent class: JavaxXmlNamespace
subclass of: JavaAPIPart
comment: Java API part implementing the javax.xml.namespace package for Java SE 6

JavaxXmlStream
type: Class
subclass of: JavaAPIPart
comment: Java API part implementing the javax.xml.stream package for Java SE 6

JavaxXmlStreamEvents
type: Class
subclass of: JavaAPIPart
comment: Java API part implementing the javax.xml.stream.events package for Java SE 6

JavaxXmlStreamUtil
type: Class
subclass of: JavaAPIPart
comment: Java API part implementing the javax.xml.stream.util package for Java SE 6

JavaxXmlParsers
type: Class
subclass of: JavaxXmlParsers
comment: Java API part implementing the javax.xml.parsers package for Java SE 6

JavaxXmlCrypto
type: Class
subclass of: JavaAPIPart
comment: Java API part implementing the javax.xml.crypto package for Java SE 6

JavaxXmlCryptoDsig
type: Class
subclass of: JavaAPIPart
comment: Java API part implementing the javax.xml.crypto.dsig package for Java SE 6

JavaxXmlCryptoDsigKeyinfo
type: Class
subclass of: JavaAPIPart
comment: Java API part implementing the javax.xml.crypto.dsig.keyinfo package for Java SE 6

JavaxXmlCryptoDsigSpec
type: Class
subclass of: JavaAPIPart
comment: Java API part implementing the javax.xml.crypto.dsig.spec package for Java SE 6

JavaxXmlCryptoDsigDom
type: Class
subclass of: JavaAPIPart
comment: Java API part implementing the javax.xml.crypto.dsig.dom package for Java SE 6

JavaxXmlCryptoDom
type: Class
subclass of: JavaAPIPart
comment: Java API part implementing the javax.xml.crypto.dom package for Java SE 6

JavaxXmlDatatype
type: Class
subclass of: JavaxXmlDatatype
comment: Java API part implementing the javax.xml.datatype package for Java SE 6

JavaxXmlSoap
type: Class
subclass of: JavaAPIPart
comment: Java API part implementing the javax.xml.soap package for Java SE 6

JavaxXmlWs
type: Class
subclass of: JavaAPIPart
comment: Java API part implementing the javax.xml.ws package for Java SE 6

JavaxXmlWsHandler
type: Class
subclass of: JavaAPIPart
comment: Java API part implementing the javax.xml.ws.handler package for Java SE 6

JavaxXmlWsHandlerSoap
type: Class
subclass of: JavaAPIPart
comment: Java API part implementing the javax.xml.ws.handler.soap package for Java SE 6

JavaxXmlWsHttp
type: Class
subclass of: JavaAPIPart
comment: Java API part implementing the javax.xml.ws.http package for Java SE 6

JavaxXmlWsSoap
type: Class
subclass of: JavaAPIPart
comment: Java API part implementing the javax.xml.ws.soap package for Java SE 6

JavaxXmlWsSpi
type: Class
subclass of: JavaAPIPart
comment: Java API part implementing the javax.xml.ws.spi package for Java SE 6

JavaxXmlWsWsaddressing
type: Class
subclass of: JavaAPIPart
comment: Java API part implementing the javax.xml.ws.wsaddressing package for Java SE 6

JavaxXmlXpath
type: Class
subclass of: JavaxXmlXpath
comment: Java API part implementing the javax.xml.xpath package for Java SE 6

JavaxActivation
type: Class
subclass of: JavaAPIPart
comment: Java API part implementing the javax.activation package for Java SE 6

JavaxActivity
type: Class
equivalent class: JavaxActivity
subclass of: JavaAPIPart
comment: Java API part implementing the javax.activity package for Java SE 6

JavaxAnnotation
type: Class
subclass of: JavaAPIPart
comment: Java API part implementing the javax.annotation package for Java SE 6

JavaxAnnotationProcessing
type: Class
subclass of: JavaAPIPart
comment: Java API part implementing the javax.annotation.processing package for Java SE 6

JavaxLangModel
type: Class
subclass of: JavaAPIPart
comment: Java API part implementing the javax.lang.model package for Java SE 6

JavaxLangModelElement
type: Class
subclass of: JavaAPIPart
comment: Java API part implementing the javax.lang.model.element package for Java SE 6

JavaxLangModelUtil
type: Class
subclass of: JavaAPIPart
comment: Java API part implementing the javax.lang.model.util package for Java SE 6

JavaxLangModelType
type: Class
subclass of: JavaAPIPart
comment: Java API part implementing the javax.lang.model.type package for Java SE 6

JavaxTools
type: Class
subclass of: JavaAPIPart
comment: Java API part implementing the javax.tools package for Java SE 6

JavaxImageio
type: Class
subclass of: JavaxImageio
comment: Java API part implementing the javax.imageio package for Java SE 6

JavaxImageioMetadata
type: Class
equivalent class: JavaxImageioMetadata
subclass of: JavaAPIPart
comment: Java API part implementing the javax.imageio.metadata package for Java SE 6

JavaxImageioStream
type: Class
equivalent class: JavaxImageioStream
subclass of: JavaAPIPart
comment: Java API part implementing the javax.imageio.stream package for Java SE 6

JavaxImageioSpi
type: Class
equivalent class: JavaxImageioSpi
subclass of: JavaAPIPart
comment: Java API part implementing the javax.imageio.spi package for Java SE 6

JavaxImageioEvent
type: Class
equivalent class: JavaxImageioEvent
subclass of: JavaAPIPart
comment: Java API part implementing the javax.imageio.event package for Java SE 6

JavaxImageioPluginsBmp
type: Class
equivalent class: JavaxImageioPluginsBmp
subclass of: JavaAPIPart
comment: Java API part implementing the javax.imageio.plugins.bmp package for Java SE 6

JavaxImageioPluginsJpeg
type: Class
equivalent class: JavaxImageioPluginsJpeg
subclass of: JavaAPIPart
comment: Java API part implementing the javax.imageio.plugins.jpeg package for Java SE 6

JavaxJws
type: Class
subclass of: JavaAPIPart
comment: Java API part implementing the javax.jws package for Java SE 6

JavaxJwsSoap
type: Class
subclass of: JavaAPIPart
comment: Java API part implementing the javax.jws.soap package for Java SE 6

JavaxRmi
type: Class
equivalent class: JavaxRmi
subclass of: JavaAPIPart
comment: Java API part implementing the javax.rmi package for Java SE 6

JavaxRmiCORBA
type: Class
equivalent class: JavaxRmiCORBA
subclass of: JavaAPIPart
comment: Java API part implementing the javax.rmi.CORBA package for Java SE 6

JavaxRmiSsl
type: Class
equivalent class: JavaxRmiSsl
subclass of: JavaAPIPart
comment: Java API part implementing the javax.rmi.ssl package for Java SE 6

JavaxNaming
type: Class
subclass of: JavaxNaming
comment: Java API part implementing the javax.naming package for Java SE 6

JavaxNamingDirectory
type: Class
subclass of: JavaxNamingDirectory
comment: Java API part implementing the javax.naming.directory package for Java SE 6

JavaxNamingEvent
type: Class
equivalent class: JavaxNamingEvent
subclass of: JavaAPIPart
comment: Java API part implementing the javax.naming.event package for Java SE 6

JavaxNamingLdap
type: Class
subclass of: JavaxNamingLdap
comment: Java API part implementing the javax.naming.ldap package for Java SE 6

JavaxNamingSpi
type: Class
equivalent class: JavaxNamingSpi
subclass of: JavaAPIPart
comment: Java API part implementing the javax.naming.spi package for Java SE 6

JavaxPrint
type: Class
equivalent class: JavaxPrint
subclass of: JavaAPIPart
comment: Java API part implementing the javax.print package for Java SE 6

JavaxPrintAttribute
type: Class
equivalent class: JavaxPrintAttribute
subclass of: JavaAPIPart
comment: Java API part implementing the javax.print.attribute package for Java SE 6

JavaxPrintAttributeStandard
type: Class
equivalent class: JavaxPrintAttributeStandard
subclass of: JavaAPIPart
comment: Java API part implementing the javax.print.attribute.standard package for Java SE 6

JavaxPrintEvent
type: Class
equivalent class: JavaxPrintEvent
subclass of: JavaAPIPart
comment: Java API part implementing the javax.print.event package for Java SE 6

JavaxScript
type: Class
subclass of: JavaAPIPart
comment: Java API part implementing the javax.script package for Java SE 6

JavaxSmartcardio
type: Class
subclass of: JavaAPIPart
comment: Java API part implementing the javax.smartcardio package for Java SE 6

JavaxSoundMidi
type: Class
equivalent class: JavaxSoundMidi
subclass of: JavaAPIPart
comment: Java API part implementing the javax.sound.midi package for Java SE 6

JavaxSoundMidiSpi
type: Class
equivalent class: JavaxSoundMidiSpi
subclass of: JavaAPIPart
comment: Java API part implementing the javax.sound.midi.spi package for Java SE 6

JavaxSoundSampled
type: Class
equivalent class: JavaxSoundSampled
subclass of: JavaAPIPart
comment: Java API part implementing the javax.sound.sampled package for Java SE 6

JavaxSoundSampledSpi
type: Class
equivalent class: JavaxSoundSampledSpi
subclass of: JavaAPIPart
comment: Java API part implementing the javax.sound.sampled.spi package for Java SE 6

JavaxSql
type: Class
subclass of: JavaxSql
comment: Java API part implementing the javax.sql package for Java SE 6

JavaxSqlRowset
type: Class
subclass of: JavaxSqlRowset
comment: Java API part implementing the javax.sql.rowset package for Java SE 6

JavaxSqlRowsetSpi
type: Class
subclass of: JavaxSqlRowsetSpi
comment: Java API part implementing the javax.sql.rowset.spi package for Java SE 6

JavaxSqlRowsetSerial
type: Class
subclass of: JavaxSqlRowsetSerial
comment: Java API part implementing the javax.sql.rowset.serial package for Java SE 6

JavaxTransaction
type: Class
equivalent class: JavaxTransaction
subclass of: JavaAPIPart
comment: Java API part implementing the javax.transaction package for Java SE 6

JavaxTransactionXa
type: Class
equivalent class: JavaxTransactionXa
subclass of: JavaAPIPart
comment: Java API part implementing the javax.transaction.xa package for Java SE 6

JavaLang
type: Class
subclass of: JavaLang
comment: Java API part implementing the java.lang package for Java SE 6

JavaLangAnnotation
type: Class
subclass of: JavaLangAnnotation
comment: Java API part implementing the java.lang.annotation package for Java SE 6

JavaLangReflect
type: Class
equivalent class: JavaLangReflect
subclass of: JavaAPIPart
comment: Java API part implementing the java.lang.reflect package for Java SE 6

JavaLangInstrument
type: Class
subclass of: JavaLangInstrument
comment: Java API part implementing the java.lang.instrument package for Java SE 6

JavaLangManagement
type: Class
subclass of: JavaLangManagement
comment: Java API part implementing the java.lang.management package for Java SE 6

JavaLangRef
type: Class
equivalent class: JavaLangRef
subclass of: JavaAPIPart
comment: Java API part implementing the java.lang.ref package for Java SE 6

JavaAwt
type: Class
subclass of: JavaAwt
comment: Java API part implementing the java.awt package for Java SE 6

JavaAwtPrint
type: Class
subclass of: JavaAwtPrint
comment: Java API part implementing the java.awt.print package for Java SE 6

JavaAwtDatatransfer
type: Class
equivalent class: JavaAwtDatatransfer
subclass of: JavaAPIPart
comment: Java API part implementing the java.awt.datatransfer package for Java SE 6

JavaAwtEvent
type: Class
subclass of: JavaAwtEvent
comment: Java API part implementing the java.awt.event package for Java SE 6

JavaAwtImage
type: Class
subclass of: JavaAwtImage
comment: Java API part implementing the java.awt.image package for Java SE 6

JavaAwtImageRenderable
type: Class
equivalent class: JavaAwtImageRenderable
subclass of: JavaAPIPart
comment: Java API part implementing the java.awt.image.renderable package for Java SE 6

JavaAwtGeom
type: Class
subclass of: JavaAPIPart
comment: Java API part implementing the java.awt.geom package for Java SE 6

JavaAwtIm
type: Class
equivalent class: JavaAwtIm
subclass of: JavaAPIPart
comment: Java API part implementing the java.awt.im package for Java SE 6

JavaAwtImSpi
type: Class
equivalent class: JavaAwtImSpi
subclass of: JavaAPIPart
comment: Java API part implementing the java.awt.im.spi package for Java SE 6

JavaAwtColor
type: Class
equivalent class: JavaAwtColor
subclass of: JavaAPIPart
comment: Java API part implementing the java.awt.color package for Java SE 6

JavaAwtDnd
type: Class
equivalent class: JavaAwtDnd
subclass of: JavaAPIPart
comment: Java API part implementing the java.awt.dnd package for Java SE 6

JavaAwtFont
type: Class
subclass of: JavaAwtFont
comment: Java API part implementing the java.awt.font package for Java SE 6

JavaNet
type: Class
subclass of: JavaNet
comment: Java API part implementing the java.net package for Java SE 6

JavaIo
type: Class
subclass of: JavaIo
comment: Java API part implementing the java.io package for Java SE 6

JavaSecurity
type: Class
subclass of: JavaSecurity
comment: Java API part implementing the java.security package for Java SE 6

JavaSecuritySpec
type: Class
equivalent class: JavaSecuritySpec
subclass of: JavaAPIPart
comment: Java API part implementing the java.security.spec package for Java SE 6

JavaSecurityCert
type: Class
equivalent class: JavaSecurityCert
subclass of: JavaAPIPart
comment: Java API part implementing the java.security.cert package for Java SE 6

JavaSecurityAcl
type: Class
equivalent class: JavaSecurityAcl
subclass of: JavaAPIPart
comment: Java API part implementing the java.security.acl package for Java SE 6

JavaSecurityInterfaces
type: Class
equivalent class: JavaSecurityInterfaces
subclass of: JavaAPIPart
comment: Java API part implementing the java.security.interfaces package for Java SE 6

JavaMath
type: Class
subclass of: JavaMath
comment: Java API part implementing the java.math package for Java SE 6

JavaNio
type: Class
subclass of: JavaNio
comment: Java API part implementing the java.nio package for Java SE 6

JavaNioChannels
type: Class
equivalent class: JavaNioChannels
subclass of: JavaAPIPart
comment: Java API part implementing the java.nio.channels package for Java SE 6

JavaNioChannelsSpi
type: Class
equivalent class: JavaNioChannelsSpi
subclass of: JavaAPIPart
comment: Java API part implementing the java.nio.channels.spi package for Java SE 6

JavaNioCharset
type: Class
equivalent class: JavaNioCharset
subclass of: JavaAPIPart
comment: Java API part implementing the java.nio.charset package for Java SE 6

JavaNioCharsetSpi
type: Class
equivalent class: JavaNioCharsetSpi
subclass of: JavaAPIPart
comment: Java API part implementing the java.nio.charset.spi package for Java SE 6

JavaUtil
type: Class
subclass of: JavaUtil
comment: Java API part implementing the java.util package for Java SE 6

JavaUtilJar
type: Class
equivalent class: JavaUtilJar
subclass of: JavaAPIPart
comment: Java API part implementing the java.util.jar package for Java SE 6

JavaUtilSpi
type: Class
subclass of: JavaAPIPart
comment: Java API part implementing the java.util.spi package for Java SE 6

JavaUtilConcurrent
type: Class
subclass of: JavaAPIPart
comment: Java API part implementing the java.util.concurrent package for Java SE 6

JavaUtilConcurrentAtomic
type: Class
subclass of: JavaUtilConcurrentAtomic
comment: Java API part implementing the java.util.concurrent.atomic package for Java SE 6

JavaUtilConcurrentLocks
type: Class
subclass of: JavaUtilConcurrentLocks
comment: Java API part implementing the java.util.concurrent.locks package for Java SE 6

JavaUtilZip
type: Class
subclass of: JavaUtilZip
comment: Java API part implementing the java.util.zip package for Java SE 6

JavaUtilLogging
type: Class
subclass of: JavaUtilLogging
comment: Java API part implementing the java.util.logging package for Java SE 6

JavaUtilPrefs
type: Class
equivalent class: JavaUtilPrefs
subclass of: JavaAPIPart
comment: Java API part implementing the java.util.prefs package for Java SE 6

JavaUtilRegex
type: Class
equivalent class: JavaUtilRegex
subclass of: JavaAPIPart
comment: Java API part implementing the java.util.regex package for Java SE 6

JavaApplet
type: Class
subclass of: JavaApplet
comment: Java API part implementing the java.applet package for Java SE 6

JavaBeans
type: Class
subclass of: JavaBeans
comment: Java API part implementing the java.beans package for Java SE 6

JavaBeansBeancontext
type: Class
equivalent class: JavaBeansBeancontext
subclass of: JavaAPIPart
comment: Java API part implementing the java.beans.beancontext package for Java SE 6

JavaText
type: Class
subclass of: JavaAPIPart
comment: Java API part implementing the java.text package for Java SE 6

JavaTextSpi
type: Class
subclass of: JavaAPIPart
comment: Java API part implementing the java.text.spi package for Java SE 6

JavaRmi
type: Class
equivalent class: JavaRmi
subclass of: JavaAPIPart
comment: Java API part implementing the java.rmi package for Java SE 6

JavaRmiActivation
type: Class
equivalent class: JavaRmiActivation
subclass of: JavaAPIPart
comment: Java API part implementing the java.rmi.activation package for Java SE 6

JavaRmiServer
type: Class
subclass of: JavaRmiServer
comment: Java API part implementing the java.rmi.server package for Java SE 6

JavaRmiDgc
type: Class
equivalent class: JavaRmiDgc
subclass of: JavaAPIPart
comment: Java API part implementing the java.rmi.dgc package for Java SE 6

JavaRmiRegistry
type: Class
equivalent class: JavaRmiRegistry
subclass of: JavaAPIPart
comment: Java API part implementing the java.rmi.registry package for Java SE 6

JavaSql
type: Class
subclass of: JavaSql
comment: Java API part implementing the java.sql package for Java SE 6

OrgW3cDom
type: Class
equivalent class: OrgW3cDom
subclass of: JavaAPIPart
comment: Java API part implementing the org.w3c.dom package for Java SE 6

OrgW3cDomLs
type: Class
equivalent class: OrgW3cDomLs
subclass of: JavaAPIPart
comment: Java API part implementing the org.w3c.dom.ls package for Java SE 6

OrgW3cDomBootstrap
type: Class
equivalent class: OrgW3cDomBootstrap
subclass of: JavaAPIPart
comment: Java API part implementing the org.w3c.dom.bootstrap package for Java SE 6

OrgW3cDomCss
type: Class
equivalent class: OrgW3cDomCss
subclass of: JavaAPIPart
comment: Java API part implementing the org.w3c.dom.css package for Java SE 6

OrgW3cDomStylesheets
type: Class
equivalent class: OrgW3cDomStylesheets
subclass of: JavaAPIPart
comment: Java API part implementing the org.w3c.dom.stylesheets package for Java SE 6

OrgW3cDomViews
type: Class
equivalent class: OrgW3cDomViews
subclass of: JavaAPIPart
comment: Java API part implementing the org.w3c.dom.views package for Java SE 6

OrgW3cDomEvents
type: Class
equivalent class: OrgW3cDomEvents
subclass of: JavaAPIPart
comment: Java API part implementing the org.w3c.dom.events package for Java SE 6

OrgW3cDomHtml
type: Class
equivalent class: OrgW3cDomHtml
subclass of: JavaAPIPart
comment: Java API part implementing the org.w3c.dom.html package for Java SE 6

OrgW3cDomTraversal
type: Class
equivalent class: OrgW3cDomTraversal
subclass of: JavaAPIPart
comment: Java API part implementing the org.w3c.dom.traversal package for Java SE 6

OrgW3cDomRanges
type: Class
equivalent class: OrgW3cDomRanges
subclass of: JavaAPIPart
comment: Java API part implementing the org.w3c.dom.ranges package for Java SE 6

OrgW3cDomXpath
type: Class
subclass of: JavaAPIPart
comment: Java API part implementing the org.w3c.dom.xpath package for Java SE 6

OrgOmgCORBA 2 3
type: Class
equivalent class: OrgOmgCORBA 2 3
subclass of: JavaAPIPart
comment: Java API part implementing the org.omg.CORBA_2_3 package for Java SE 6

OrgOmgCORBA 2 3Portable
type: Class
equivalent class: OrgOmgCORBA 2 3Portable
subclass of: JavaAPIPart
comment: Java API part implementing the org.omg.CORBA_2_3.portable package for Java SE 6

OrgOmgCORBA
type: Class
equivalent class: OrgOmgCORBA
subclass of: JavaAPIPart
comment: Java API part implementing the org.omg.CORBA package for Java SE 6

OrgOmgCORBAPortable
type: Class
equivalent class: OrgOmgCORBAPortable
subclass of: JavaAPIPart
comment: Java API part implementing the org.omg.CORBA.portable package for Java SE 6

OrgOmgCORBADynAnyPackage
type: Class
equivalent class: OrgOmgCORBADynAnyPackage
subclass of: JavaAPIPart
comment: Java API part implementing the org.omg.CORBA.DynAnyPackage package for Java SE 6

OrgOmgCORBAORBPackage
type: Class
equivalent class: OrgOmgCORBAORBPackage
subclass of: JavaAPIPart
comment: Java API part implementing the org.omg.CORBA.ORBPackage package for Java SE 6

OrgOmgCORBATypeCodePackage
type: Class
equivalent class: OrgOmgCORBATypeCodePackage
subclass of: JavaAPIPart
comment: Java API part implementing the org.omg.CORBA.TypeCodePackage package for Java SE 6

OrgOmgSendingContext
type: Class
equivalent class: OrgOmgSendingContext
subclass of: JavaAPIPart
comment: Java API part implementing the org.omg.SendingContext package for Java SE 6

OrgOmgCosNaming
type: Class
equivalent class: OrgOmgCosNaming
subclass of: JavaAPIPart
comment: Java API part implementing the org.omg.CosNaming package for Java SE 6

OrgOmgCosNamingNamingContextExtPackage
type: Class
equivalent class: OrgOmgCosNamingNamingContextExtPackage
subclass of: JavaAPIPart
comment: Java API part implementing the org.omg.CosNaming.NamingContextExtPackage package for Java SE 6

OrgOmgCosNamingNamingContextPackage
type: Class
equivalent class: OrgOmgCosNamingNamingContextPackage
subclass of: JavaAPIPart
comment: Java API part implementing the org.omg.CosNaming.NamingContextPackage package for Java SE 6

OrgOmgPortableServer
type: Class
equivalent class: OrgOmgPortableServer
subclass of: JavaAPIPart
comment: Java API part implementing the org.omg.PortableServer package for Java SE 6

OrgOmgPortableServerCurrentPackage
type: Class
equivalent class: OrgOmgPortableServerCurrentPackage
subclass of: JavaAPIPart
comment: Java API part implementing the org.omg.PortableServer.CurrentPackage package for Java SE 6

OrgOmgPortableServerPOAManagerPackage
type: Class
equivalent class: OrgOmgPortableServerPOAManagerPackage
subclass of: JavaAPIPart
comment: Java API part implementing the org.omg.PortableServer.POAManagerPackage package for Java SE 6

OrgOmgPortableServerPOAPackage
type: Class
equivalent class: OrgOmgPortableServerPOAPackage
subclass of: JavaAPIPart
comment: Java API part implementing the org.omg.PortableServer.POAPackage package for Java SE 6

OrgOmgPortableServerPortable
type: Class
equivalent class: OrgOmgPortableServerPortable
subclass of: JavaAPIPart
comment: Java API part implementing the org.omg.PortableServer.portable package for Java SE 6

OrgOmgPortableServerServantLocatorPackage
type: Class
equivalent class: OrgOmgPortableServerServantLocatorPackage
subclass of: JavaAPIPart
comment: Java API part implementing the org.omg.PortableServer.ServantLocatorPackage package for Java SE 6

OrgOmgDynamic
type: Class
equivalent class: OrgOmgDynamic
subclass of: JavaAPIPart
comment: Java API part implementing the org.omg.Dynamic package for Java SE 6

OrgOmgDynamicAny
type: Class
equivalent class: OrgOmgDynamicAny
subclass of: JavaAPIPart
comment: Java API part implementing the org.omg.DynamicAny package for Java SE 6

OrgOmgDynamicAnyDynAnyFactoryPackage
type: Class
equivalent class: OrgOmgDynamicAnyDynAnyFactoryPackage
subclass of: JavaAPIPart
comment: Java API part implementing the org.omg.DynamicAny.DynAnyFactoryPackage package for Java SE 6

OrgOmgDynamicAnyDynAnyPackage
type: Class
equivalent class: OrgOmgDynamicAnyDynAnyPackage
subclass of: JavaAPIPart
comment: Java API part implementing the org.omg.DynamicAny.DynAnyPackage package for Java SE 6

OrgOmgIOP
type: Class
equivalent class: OrgOmgIOP
subclass of: JavaAPIPart
comment: Java API part implementing the org.omg.IOP package for Java SE 6

OrgOmgIOPCodecFactoryPackage
type: Class
equivalent class: OrgOmgIOPCodecFactoryPackage
subclass of: JavaAPIPart
comment: Java API part implementing the org.omg.IOP.CodecFactoryPackage package for Java SE 6

OrgOmgIOPCodecPackage
type: Class
equivalent class: OrgOmgIOPCodecPackage
subclass of: JavaAPIPart
comment: Java API part implementing the org.omg.IOP.CodecPackage package for Java SE 6

OrgOmgMessaging
type: Class
equivalent class: OrgOmgMessaging
subclass of: JavaAPIPart
comment: Java API part implementing the org.omg.Messaging package for Java SE 6

OrgOmgPortableInterceptor
type: Class
equivalent class: OrgOmgPortableInterceptor
subclass of: JavaAPIPart
comment: Java API part implementing the org.omg.PortableInterceptor package for Java SE 6

OrgOmgPortableInterceptorORBInitInfoPackage
type: Class
equivalent class: OrgOmgPortableInterceptorORBInitInfoPackage
subclass of: JavaAPIPart
comment: Java API part implementing the org.omg.PortableInterceptor.ORBInitInfoPackage package for Java SE 6

OrgOmgStubJavaRmi
type: Class
equivalent class: OrgOmgStubJavaRmi
subclass of: JavaAPIPart
comment: Java API part implementing the org.omg.stub.java.rmi package for Java SE 6

OrgOmgStubJavaxManagementRemoteRmi
type: Class
equivalent class: OrgOmgStubJavaxManagementRemoteRmi
subclass of: JavaAPIPart
comment: Java API part implementing the org.omg.stub.javax.management.remote.rmi package for Java SE 6

OrgXmlSax
type: Class
equivalent class: OrgXmlSax
subclass of: JavaAPIPart
comment: Java API part implementing the org.xml.sax package for Java SE 6

OrgXmlSaxHelpers
type: Class
equivalent class: OrgXmlSaxHelpers
subclass of: JavaAPIPart
comment: Java API part implementing the org.xml.sax.helpers package for Java SE 6

OrgXmlSaxExt
type: Class
equivalent class: OrgXmlSaxExt
subclass of: JavaAPIPart
comment: Java API part implementing the org.xml.sax.ext package for Java SE 6

OrgIetfJgss
type: Class
equivalent class: OrgIetfJgss
subclass of: JavaAPIPart
comment: Java API part implementing the org.ietf.jgss package for Java SE 6

JavaxJnlpAPI
type: Class
subclass of: JavaAPI
comment: JavaLibrary implementing the javax.jnlp package for Java SE 6
comment: platform:comprisesInterfacePart some JavaxJnlp

JavaxCryptoAPI
type: Class
equivalent class: JavaxCryptoAPI
subclass of: JavaAPI
comment: JavaLibrary implementing the javax.crypto package for Java SE 6
comment: platform:comprisesInterfacePart some JavaxCrypto

JavaxCryptoInterfacesAPI
type: Class
equivalent class: JavaxCryptoInterfacesAPI
subclass of: JavaAPI
comment: JavaLibrary implementing the javax.crypto.interfaces package for Java SE 6
comment: platform:comprisesInterfacePart some JavaxCryptoInterfaces

JavaxCryptoSpecAPI
type: Class
equivalent class: JavaxCryptoSpecAPI
subclass of: JavaAPI
comment: JavaLibrary implementing the javax.crypto.spec package for Java SE 6
comment: platform:comprisesInterfacePart some JavaxCryptoSpec

JavaxNetAPI
type: Class
equivalent class: JavaxNetAPI
subclass of: JavaAPI
comment: JavaLibrary implementing the javax.net package for Java SE 6
comment: platform:comprisesInterfacePart some JavaxNet

JavaxNetSslAPI
type: Class
subclass of: JavaxNetSslAPI
comment: JavaLibrary implementing the javax.net.ssl package for Java SE 6
comment: platform:comprisesInterfacePart some JavaxNetSsl

JavaxSecurityCertAPI
type: Class
equivalent class: JavaxSecurityCertAPI
subclass of: JavaAPI
comment: JavaLibrary implementing the javax.security.cert package for Java SE 6
comment: platform:comprisesInterfacePart some JavaxSecurityCert

JavaxSecurityAuthAPI
type: Class
equivalent class: JavaxSecurityAuthAPI
subclass of: JavaAPI
comment: JavaLibrary implementing the javax.security.auth package for Java SE 6
comment: platform:comprisesInterfacePart some JavaxSecurityAuth

JavaxSecurityAuthCallbackAPI
type: Class
equivalent class: JavaxSecurityAuthCallbackAPI
subclass of: JavaAPI
comment: JavaLibrary implementing the javax.security.auth.callback package for Java SE 6
comment: platform:comprisesInterfacePart some JavaxSecurityAuthCallback

JavaxSecurityAuthLoginAPI
type: Class
subclass of: JavaxSecurityAuthLoginAPI
comment: JavaLibrary implementing the javax.security.auth.login package for Java SE 6
comment: platform:comprisesInterfacePart some JavaxSecurityAuthLogin

JavaxSecurityAuthX500API
type: Class
subclass of: JavaxSecurityAuthX500API
comment: JavaLibrary implementing the javax.security.auth.x500 package for Java SE 6
comment: platform:comprisesInterfacePart some JavaxSecurityAuthX500

JavaxSecurityAuthKerberosAPI
type: Class
equivalent class: JavaxSecurityAuthKerberosAPI
subclass of: JavaAPI
comment: JavaLibrary implementing the javax.security.auth.kerberos package for Java SE 6
comment: platform:comprisesInterfacePart some JavaxSecurityAuthKerberos

JavaxSecurityAuthSpiAPI
type: Class
equivalent class: JavaxSecurityAuthSpiAPI
subclass of: JavaAPI
comment: JavaLibrary implementing the javax.security.auth.spi package for Java SE 6
comment: platform:comprisesInterfacePart some JavaxSecurityAuthSpi

JavaxSecuritySaslAPI
type: Class
subclass of: JavaxSecuritySaslAPI
comment: JavaLibrary implementing the javax.security.sasl package for Java SE 6
comment: platform:comprisesInterfacePart some JavaxSecuritySasl

JavaxAccessibilityAPI
type: Class
subclass of: JavaxAccessibilityAPI
comment: JavaLibrary implementing the javax.accessibility package for Java SE 6
comment: platform:comprisesInterfacePart some JavaxAccessibility

JavaxSwingAPI
type: Class
subclass of: JavaxSwingAPI
comment: JavaLibrary implementing the javax.swing package for Java SE 6
comment: platform:comprisesInterfacePart some JavaxSwing

JavaxSwingTextAPI
type: Class
subclass of: JavaxSwingTextAPI
comment: JavaLibrary implementing the javax.swing.text package for Java SE 6
comment: platform:comprisesInterfacePart some JavaxSwingText

JavaxSwingTextHtmlAPI
type: Class
subclass of: JavaxSwingTextHtmlAPI
comment: JavaLibrary implementing the javax.swing.text.html package for Java SE 6
comment: platform:comprisesInterfacePart some JavaxSwingTextHtml

JavaxSwingTextHtmlParserAPI
type: Class
equivalent class: JavaxSwingTextHtmlParserAPI
subclass of: JavaAPI
comment: JavaLibrary implementing the javax.swing.text.html.parser package for Java SE 6
comment: platform:comprisesInterfacePart some JavaxSwingTextHtmlParser

JavaxSwingTextRtfAPI
type: Class
subclass of: JavaxSwingTextRtfAPI
comment: JavaLibrary implementing the javax.swing.text.rtf package for Java SE 6
comment: platform:comprisesInterfacePart some JavaxSwingTextRtf

JavaxSwingEventAPI
type: Class
subclass of: JavaxSwingEventAPI
comment: JavaLibrary implementing the javax.swing.event package for Java SE 6
comment: platform:comprisesInterfacePart some JavaxSwingEvent

JavaxSwingColorchooserAPI
type: Class
subclass of: JavaxSwingColorchooserAPI
comment: JavaLibrary implementing the javax.swing.colorchooser package for Java SE 6
comment: platform:comprisesInterfacePart some JavaxSwingColorchooser

JavaxSwingPlafAPI
type: Class
subclass of: JavaxSwingPlafAPI
comment: JavaLibrary implementing the javax.swing.plaf package for Java SE 6
comment: platform:comprisesInterfacePart some JavaxSwingPlaf

JavaxSwingPlafBasicAPI
type: Class
subclass of: JavaxSwingPlafBasicAPI
comment: JavaLibrary implementing the javax.swing.plaf.basic package for Java SE 6
comment: platform:comprisesInterfacePart some JavaxSwingPlafBasic

JavaxSwingPlafMetalAPI
type: Class
subclass of: JavaxSwingPlafMetalAPI
comment: JavaLibrary implementing the javax.swing.plaf.metal package for Java SE 6
comment: platform:comprisesInterfacePart some JavaxSwingPlafMetal

JavaxSwingPlafMultiAPI
type: Class
subclass of: JavaxSwingPlafMultiAPI
comment: JavaLibrary implementing the javax.swing.plaf.multi package for Java SE 6
comment: platform:comprisesInterfacePart some JavaxSwingPlafMulti

JavaxSwingPlafSynthAPI
type: Class
subclass of: JavaxSwingPlafSynthAPI
comment: JavaLibrary implementing the javax.swing.plaf.synth package for Java SE 6
comment: platform:comprisesInterfacePart some JavaxSwingPlafSynth

JavaxSwingFilechooserAPI
type: Class
subclass of: JavaxSwingFilechooserAPI
comment: JavaLibrary implementing the javax.swing.filechooser package for Java SE 6
comment: platform:comprisesInterfacePart some JavaxSwingFilechooser

JavaxSwingTreeAPI
type: Class
subclass of: JavaxSwingTreeAPI
comment: JavaLibrary implementing the javax.swing.tree package for Java SE 6
comment: platform:comprisesInterfacePart some JavaxSwingTree

JavaxSwingBorderAPI
type: Class
subclass of: JavaxSwingBorderAPI
comment: JavaLibrary implementing the javax.swing.border package for Java SE 6
comment: platform:comprisesInterfacePart some JavaxSwingBorder

JavaxSwingTableAPI
type: Class
subclass of: JavaxSwingTableAPI
comment: JavaLibrary implementing the javax.swing.table package for Java SE 6
comment: platform:comprisesInterfacePart some JavaxSwingTable

JavaxSwingUndoAPI
type: Class
equivalent class: JavaxSwingUndoAPI
subclass of: JavaAPI
comment: JavaLibrary implementing the javax.swing.undo package for Java SE 6
comment: platform:comprisesInterfacePart some JavaxSwingUndo

JavaxManagementAPI
type: Class
subclass of: JavaxManagementAPI
comment: JavaLibrary implementing the javax.management package for Java SE 6
comment: platform:comprisesInterfacePart some JavaxManagement

JavaxManagementOpenmbeanAPI
type: Class
subclass of: JavaxManagementOpenmbeanAPI
comment: JavaLibrary implementing the javax.management.openmbean package for Java SE 6
comment: platform:comprisesInterfacePart some JavaxManagementOpenmbean

JavaxManagementLoadingAPI
type: Class
subclass of: JavaxManagementLoadingAPI
comment: JavaLibrary implementing the javax.management.loading package for Java SE 6
comment: platform:comprisesInterfacePart some JavaxManagementLoading

JavaxManagementModelmbeanAPI
type: Class
subclass of: JavaxManagementModelmbeanAPI
comment: JavaLibrary implementing the javax.management.modelmbean package for Java SE 6
comment: platform:comprisesInterfacePart some JavaxManagementModelmbean

JavaxManagementMonitorAPI
type: Class
subclass of: JavaxManagementMonitorAPI
comment: JavaLibrary implementing the javax.management.monitor package for Java SE 6
comment: platform:comprisesInterfacePart some JavaxManagementMonitor

JavaxManagementRelationAPI
type: Class
subclass of: JavaxManagementRelationAPI
comment: JavaLibrary implementing the javax.management.relation package for Java SE 6
comment: platform:comprisesInterfacePart some JavaxManagementRelation

JavaxManagementRemoteAPI
type: Class
subclass of: JavaxManagementRemoteAPI
comment: JavaLibrary implementing the javax.management.remote package for Java SE 6
comment: platform:comprisesInterfacePart some JavaxManagementRemote

JavaxManagementRemoteRmiAPI
type: Class
subclass of: JavaxManagementRemoteRmiAPI
comment: JavaLibrary implementing the javax.management.remote.rmi package for Java SE 6
comment: platform:comprisesInterfacePart some JavaxManagementRemoteRmi

JavaxManagementTimerAPI
type: Class
subclass of: JavaAPI
comment: JavaLibrary implementing the javax.management.timer package for Java SE 6
comment: platform:comprisesInterfacePart some JavaxManagementTimer

JavaxXmlAPI
type: Class
equivalent class: JavaxXmlAPI
subclass of: JavaAPI
comment: JavaLibrary implementing the javax.xml package for Java SE 6
comment: platform:comprisesInterfacePart some JavaxXml

JavaxXmlTransformAPI
type: Class
subclass of: JavaxXmlTransformAPI
comment: JavaLibrary implementing the javax.xml.transform package for Java SE 6
comment: platform:comprisesInterfacePart some JavaxXmlTransform

JavaxXmlTransformDomAPI
type: Class
equivalent class: JavaxXmlTransformDomAPI
subclass of: JavaAPI
comment: JavaLibrary implementing the javax.xml.transform.dom package for Java SE 6
comment: platform:comprisesInterfacePart some JavaxXmlTransformDom

JavaxXmlTransformSaxAPI
type: Class
subclass of: JavaxXmlTransformSaxAPI
comment: JavaLibrary implementing the javax.xml.transform.sax package for Java SE 6
comment: platform:comprisesInterfacePart some JavaxXmlTransformSax

JavaxXmlTransformStaxAPI
type: Class
subclass of: JavaAPI
comment: JavaLibrary implementing the javax.xml.transform.stax package for Java SE 6
comment: platform:comprisesInterfacePart some JavaxXmlTransformStax

JavaxXmlTransformStreamAPI
type: Class
equivalent class: JavaxXmlTransformStreamAPI
subclass of: JavaAPI
comment: JavaLibrary implementing the javax.xml.transform.stream package for Java SE 6
comment: platform:comprisesInterfacePart some JavaxXmlTransformStream

JavaxXmlBindAPI
type: Class
subclass of: JavaAPI
comment: JavaLibrary implementing the javax.xml.bind package for Java SE 6
comment: platform:comprisesInterfacePart some JavaxXmlBind

JavaxXmlBindAnnotationAPI
type: Class
subclass of: JavaAPI
comment: JavaLibrary implementing the javax.xml.bind.annotation package for Java SE 6
comment: platform:comprisesInterfacePart some JavaxXmlBindAnnotation

JavaxXmlBindAnnotationAdaptersAPI
type: Class
subclass of: JavaAPI
comment: JavaLibrary implementing the javax.xml.bind.annotation.adapters package for Java SE 6
comment: platform:comprisesInterfacePart some JavaxXmlBindAnnotationAdapters

JavaxXmlBindAttachmentAPI
type: Class
subclass of: JavaAPI
comment: JavaLibrary implementing the javax.xml.bind.attachment package for Java SE 6
comment: platform:comprisesInterfacePart some JavaxXmlBindAttachment

JavaxXmlBindHelpersAPI
type: Class
subclass of: JavaAPI
comment: JavaLibrary implementing the javax.xml.bind.helpers package for Java SE 6
comment: platform:comprisesInterfacePart some JavaxXmlBindHelpers

JavaxXmlBindUtilAPI
type: Class
subclass of: JavaAPI
comment: JavaLibrary implementing the javax.xml.bind.util package for Java SE 6
comment: platform:comprisesInterfacePart some JavaxXmlBindUtil

JavaxXmlValidationAPI
type: Class
subclass of: JavaxXmlValidationAPI
comment: JavaLibrary implementing the javax.xml.validation package for Java SE 6
comment: platform:comprisesInterfacePart some JavaxXmlValidation

JavaxXmlNamespaceAPI
type: Class
equivalent class: JavaxXmlNamespaceAPI
subclass of: JavaAPI
comment: JavaLibrary implementing the javax.xml.namespace package for Java SE 6
comment: platform:comprisesInterfacePart some JavaxXmlNamespace

JavaxXmlStreamAPI
type: Class
subclass of: JavaAPI
comment: JavaLibrary implementing the javax.xml.stream package for Java SE 6
comment: platform:comprisesInterfacePart some JavaxXmlStream

JavaxXmlStreamEventsAPI
type: Class
subclass of: JavaAPI
comment: JavaLibrary implementing the javax.xml.stream.events package for Java SE 6
comment: platform:comprisesInterfacePart some JavaxXmlStreamEvents

JavaxXmlStreamUtilAPI
type: Class
subclass of: JavaAPI
comment: JavaLibrary implementing the javax.xml.stream.util package for Java SE 6
comment: platform:comprisesInterfacePart some JavaxXmlStreamUtil

JavaxXmlParsersAPI
type: Class
subclass of: JavaxXmlParsersAPI
comment: JavaLibrary implementing the javax.xml.parsers package for Java SE 6
comment: platform:comprisesInterfacePart some JavaxXmlParsers

JavaxXmlCryptoAPI
type: Class
subclass of: JavaAPI
comment: JavaLibrary implementing the javax.xml.crypto package for Java SE 6
comment: platform:comprisesInterfacePart some JavaxXmlCrypto

JavaxXmlCryptoDsigAPI
type: Class
subclass of: JavaAPI
comment: JavaLibrary implementing the javax.xml.crypto.dsig package for Java SE 6
comment: platform:comprisesInterfacePart some JavaxXmlCryptoDsig

JavaxXmlCryptoDsigKeyinfoAPI
type: Class
subclass of: JavaAPI
comment: JavaLibrary implementing the javax.xml.crypto.dsig.keyinfo package for Java SE 6
comment: platform:comprisesInterfacePart some JavaxXmlCryptoDsigKeyinfo

JavaxXmlCryptoDsigSpecAPI
type: Class
subclass of: JavaAPI
comment: JavaLibrary implementing the javax.xml.crypto.dsig.spec package for Java SE 6
comment: platform:comprisesInterfacePart some JavaxXmlCryptoDsigSpec

JavaxXmlCryptoDsigDomAPI
type: Class
subclass of: JavaAPI
comment: JavaLibrary implementing the javax.xml.crypto.dsig.dom package for Java SE 6
comment: platform:comprisesInterfacePart some JavaxXmlCryptoDsigDom

JavaxXmlCryptoDomAPI
type: Class
subclass of: JavaAPI
comment: JavaLibrary implementing the javax.xml.crypto.dom package for Java SE 6
comment: platform:comprisesInterfacePart some JavaxXmlCryptoDom

JavaxXmlDatatypeAPI
type: Class
subclass of: JavaxXmlDatatypeAPI
comment: JavaLibrary implementing the javax.xml.datatype package for Java SE 6
comment: platform:comprisesInterfacePart some JavaxXmlDatatype

JavaxXmlSoapAPI
type: Class
subclass of: JavaAPI
comment: JavaLibrary implementing the javax.xml.soap package for Java SE 6
comment: platform:comprisesInterfacePart some JavaxXmlSoap

JavaxXmlWsAPI
type: Class
subclass of: JavaAPI
comment: JavaLibrary implementing the javax.xml.ws package for Java SE 6
comment: platform:comprisesInterfacePart some JavaxXmlWs

JavaxXmlWsHandlerAPI
type: Class
subclass of: JavaAPI
comment: JavaLibrary implementing the javax.xml.ws.handler package for Java SE 6
comment: platform:comprisesInterfacePart some JavaxXmlWsHandler

JavaxXmlWsHandlerSoapAPI
type: Class
subclass of: JavaAPI
comment: JavaLibrary implementing the javax.xml.ws.handler.soap package for Java SE 6
comment: platform:comprisesInterfacePart some JavaxXmlWsHandlerSoap

JavaxXmlWsHttpAPI
type: Class
subclass of: JavaAPI
comment: JavaLibrary implementing the javax.xml.ws.http package for Java SE 6
comment: platform:comprisesInterfacePart some JavaxXmlWsHttp

JavaxXmlWsSoapAPI
type: Class
subclass of: JavaAPI
comment: JavaLibrary implementing the javax.xml.ws.soap package for Java SE 6
comment: platform:comprisesInterfacePart some JavaxXmlWsSoap

JavaxXmlWsSpiAPI
type: Class
subclass of: JavaAPI
comment: JavaLibrary implementing the javax.xml.ws.spi package for Java SE 6
comment: platform:comprisesInterfacePart some JavaxXmlWsSpi

JavaxXmlWsWsaddressingAPI
type: Class
subclass of: JavaAPI
comment: JavaLibrary implementing the javax.xml.ws.wsaddressing package for Java SE 6
comment: platform:comprisesInterfacePart some JavaxXmlWsWsaddressing

JavaxXmlXpathAPI
type: Class
subclass of: JavaxXmlXpathAPI
comment: JavaLibrary implementing the javax.xml.xpath package for Java SE 6
comment: platform:comprisesInterfacePart some JavaxXmlXpath

JavaxActivationAPI
type: Class
subclass of: JavaAPI
comment: JavaLibrary implementing the javax.activation package for Java SE 6
comment: platform:comprisesInterfacePart some JavaxActivation

JavaxActivityAPI
type: Class
equivalent class: JavaxActivityAPI
subclass of: JavaAPI
comment: JavaLibrary implementing the javax.activity package for Java SE 6
comment: platform:comprisesInterfacePart some JavaxActivity

JavaxAnnotationAPI
type: Class
subclass of: JavaAPI
comment: JavaLibrary implementing the javax.annotation package for Java SE 6
comment: platform:comprisesInterfacePart some JavaxAnnotation

JavaxAnnotationProcessingAPI
type: Class
subclass of: JavaAPI
comment: JavaLibrary implementing the javax.annotation.processing package for Java SE 6
comment: platform:comprisesInterfacePart some JavaxAnnotationProcessing

JavaxLangModelAPI
type: Class
subclass of: JavaAPI
comment: JavaLibrary implementing the javax.lang.model package for Java SE 6
comment: platform:comprisesInterfacePart some JavaxLangModel

JavaxLangModelElementAPI
type: Class
subclass of: JavaAPI
comment: JavaLibrary implementing the javax.lang.model.element package for Java SE 6
comment: platform:comprisesInterfacePart some JavaxLangModelElement

JavaxLangModelUtilAPI
type: Class
subclass of: JavaAPI
comment: JavaLibrary implementing the javax.lang.model.util package for Java SE 6
comment: platform:comprisesInterfacePart some JavaxLangModelUtil

JavaxLangModelTypeAPI
type: Class
subclass of: JavaAPI
comment: JavaLibrary implementing the javax.lang.model.type package for Java SE 6
comment: platform:comprisesInterfacePart some JavaxLangModelType

JavaxToolsAPI
type: Class
subclass of: JavaAPI
comment: JavaLibrary implementing the javax.tools package for Java SE 6
comment: platform:comprisesInterfacePart some JavaxTools

JavaxImageioAPI
type: Class
subclass of: JavaxImageioAPI
comment: JavaLibrary implementing the javax.imageio package for Java SE 6
comment: platform:comprisesInterfacePart some JavaxImageio

JavaxImageioMetadataAPI
type: Class
equivalent class: JavaxImageioMetadataAPI
subclass of: JavaAPI
comment: JavaLibrary implementing the javax.imageio.metadata package for Java SE 6
comment: platform:comprisesInterfacePart some JavaxImageioMetadata

JavaxImageioStreamAPI
type: Class
equivalent class: JavaxImageioStreamAPI
subclass of: JavaAPI
comment: JavaLibrary implementing the javax.imageio.stream package for Java SE 6
comment: platform:comprisesInterfacePart some JavaxImageioStream

JavaxImageioSpiAPI
type: Class
equivalent class: JavaxImageioSpiAPI
subclass of: JavaAPI
comment: JavaLibrary implementing the javax.imageio.spi package for Java SE 6
comment: platform:comprisesInterfacePart some JavaxImageioSpi

JavaxImageioEventAPI
type: Class
equivalent class: JavaxImageioEventAPI
subclass of: JavaAPI
comment: JavaLibrary implementing the javax.imageio.event package for Java SE 6
comment: platform:comprisesInterfacePart some JavaxImageioEvent

JavaxImageioPluginsBmpAPI
type: Class
equivalent class: JavaxImageioPluginsBmpAPI
subclass of: JavaAPI
comment: JavaLibrary implementing the javax.imageio.plugins.bmp package for Java SE 6
comment: platform:comprisesInterfacePart some JavaxImageioPluginsBmp

JavaxImageioPluginsJpegAPI
type: Class
equivalent class: JavaxImageioPluginsJpegAPI
subclass of: JavaAPI
comment: JavaLibrary implementing the javax.imageio.plugins.jpeg package for Java SE 6
comment: platform:comprisesInterfacePart some JavaxImageioPluginsJpeg

JavaxJwsAPI
type: Class
subclass of: JavaAPI
comment: JavaLibrary implementing the javax.jws package for Java SE 6
comment: platform:comprisesInterfacePart some JavaxJws

JavaxJwsSoapAPI
type: Class
subclass of: JavaAPI
comment: JavaLibrary implementing the javax.jws.soap package for Java SE 6
comment: platform:comprisesInterfacePart some JavaxJwsSoap

JavaxRmiAPI
type: Class
equivalent class: JavaxRmiAPI
subclass of: JavaAPI
comment: JavaLibrary implementing the javax.rmi package for Java SE 6
comment: platform:comprisesInterfacePart some JavaxRmi

JavaxRmiCORBAAPI
type: Class
equivalent class: JavaxRmiCORBAAPI
subclass of: JavaAPI
comment: JavaLibrary implementing the javax.rmi.CORBA package for Java SE 6
comment: platform:comprisesInterfacePart some JavaxRmiCORBA

JavaxRmiSslAPI
type: Class
equivalent class: JavaxRmiSslAPI
subclass of: JavaAPI
comment: JavaLibrary implementing the javax.rmi.ssl package for Java SE 6
comment: platform:comprisesInterfacePart some JavaxRmiSsl

JavaxNamingAPI
type: Class
subclass of: JavaxNamingAPI
comment: JavaLibrary implementing the javax.naming package for Java SE 6
comment: platform:comprisesInterfacePart some JavaxNaming

JavaxNamingDirectoryAPI
type: Class
subclass of: JavaxNamingDirectoryAPI
comment: JavaLibrary implementing the javax.naming.directory package for Java SE 6
comment: platform:comprisesInterfacePart some JavaxNamingDirectory

JavaxNamingEventAPI
type: Class
equivalent class: JavaxNamingEventAPI
subclass of: JavaAPI
comment: JavaLibrary implementing the javax.naming.event package for Java SE 6
comment: platform:comprisesInterfacePart some JavaxNamingEvent

JavaxNamingLdapAPI
type: Class
subclass of: JavaxNamingLdapAPI
comment: JavaLibrary implementing the javax.naming.ldap package for Java SE 6
comment: platform:comprisesInterfacePart some JavaxNamingLdap

JavaxNamingSpiAPI
type: Class
equivalent class: JavaxNamingSpiAPI
subclass of: JavaAPI
comment: JavaLibrary implementing the javax.naming.spi package for Java SE 6
comment: platform:comprisesInterfacePart some JavaxNamingSpi

JavaxPrintAPI
type: Class
equivalent class: JavaxPrintAPI
subclass of: JavaAPI
comment: JavaLibrary implementing the javax.print package for Java SE 6
comment: platform:comprisesInterfacePart some JavaxPrint

JavaxPrintAttributeAPI
type: Class
equivalent class: JavaxPrintAttributeAPI
subclass of: JavaAPI
comment: JavaLibrary implementing the javax.print.attribute package for Java SE 6
comment: platform:comprisesInterfacePart some JavaxPrintAttribute

JavaxPrintAttributeStandardAPI
type: Class
equivalent class: JavaxPrintAttributeStandardAPI
subclass of: JavaAPI
comment: JavaLibrary implementing the javax.print.attribute.standard package for Java SE 6
comment: platform:comprisesInterfacePart some JavaxPrintAttributeStandard

JavaxPrintEventAPI
type: Class
equivalent class: JavaxPrintEventAPI
subclass of: JavaAPI
comment: JavaLibrary implementing the javax.print.event package for Java SE 6
comment: platform:comprisesInterfacePart some JavaxPrintEvent

JavaxScriptAPI
type: Class
subclass of: JavaAPI
comment: JavaLibrary implementing the javax.script package for Java SE 6
comment: platform:comprisesInterfacePart some JavaxScript

JavaxSmartcardioAPI
type: Class
subclass of: JavaAPI
comment: JavaLibrary implementing the javax.smartcardio package for Java SE 6
comment: platform:comprisesInterfacePart some JavaxSmartcardio

JavaxSoundMidiAPI
type: Class
equivalent class: JavaxSoundMidiAPI
subclass of: JavaAPI
comment: JavaLibrary implementing the javax.sound.midi package for Java SE 6
comment: platform:comprisesInterfacePart some JavaxSoundMidi

JavaxSoundMidiSpiAPI
type: Class
equivalent class: JavaxSoundMidiSpiAPI
subclass of: JavaAPI
comment: JavaLibrary implementing the javax.sound.midi.spi package for Java SE 6
comment: platform:comprisesInterfacePart some JavaxSoundMidiSpi

JavaxSoundSampledAPI
type: Class
equivalent class: JavaxSoundSampledAPI
subclass of: JavaAPI
comment: JavaLibrary implementing the javax.sound.sampled package for Java SE 6
comment: platform:comprisesInterfacePart some JavaxSoundSampled

JavaxSoundSampledSpiAPI
type: Class
equivalent class: JavaxSoundSampledSpiAPI
subclass of: JavaAPI
comment: JavaLibrary implementing the javax.sound.sampled.spi package for Java SE 6
comment: platform:comprisesInterfacePart some JavaxSoundSampledSpi

JavaxSqlAPI
type: Class
subclass of: JavaxSqlAPI
comment: JavaLibrary implementing the javax.sql package for Java SE 6
comment: platform:comprisesInterfacePart some JavaxSql

JavaxSqlRowsetAPI
type: Class
subclass of: JavaxSqlRowsetAPI
comment: JavaLibrary implementing the javax.sql.rowset package for Java SE 6
comment: platform:comprisesInterfacePart some JavaxSqlRowset

JavaxSqlRowsetSpiAPI
type: Class
subclass of: JavaxSqlRowsetSpiAPI
comment: JavaLibrary implementing the javax.sql.rowset.spi package for Java SE 6
comment: platform:comprisesInterfacePart some JavaxSqlRowsetSpi

JavaxSqlRowsetSerialAPI
type: Class
subclass of: JavaxSqlRowsetSerialAPI
comment: JavaLibrary implementing the javax.sql.rowset.serial package for Java SE 6
comment: platform:comprisesInterfacePart some JavaxSqlRowsetSerial

JavaxTransactionAPI
type: Class
equivalent class: JavaxTransactionAPI
subclass of: JavaAPI
comment: JavaLibrary implementing the javax.transaction package for Java SE 6
comment: platform:comprisesInterfacePart some JavaxTransaction

JavaxTransactionXaAPI
type: Class
equivalent class: JavaxTransactionXaAPI
subclass of: JavaAPI
comment: JavaLibrary implementing the javax.transaction.xa package for Java SE 6
comment: platform:comprisesInterfacePart some JavaxTransactionXa

JavaLangAPI
type: Class
subclass of: JavaLangAPI
comment: JavaLibrary implementing the java.lang package for Java SE 6
comment: platform:comprisesInterfacePart some JavaLang

JavaLangAnnotationAPI
type: Class
subclass of: JavaLangAnnotationAPI
comment: JavaLibrary implementing the java.lang.annotation package for Java SE 6
comment: platform:comprisesInterfacePart some JavaLangAnnotation

JavaLangReflectAPI
type: Class
equivalent class: JavaLangReflectAPI
subclass of: JavaAPI
comment: JavaLibrary implementing the java.lang.reflect package for Java SE 6
comment: platform:comprisesInterfacePart some JavaLangReflect

JavaLangInstrumentAPI
type: Class
subclass of: JavaLangInstrumentAPI
comment: JavaLibrary implementing the java.lang.instrument package for Java SE 6
comment: platform:comprisesInterfacePart some JavaLangInstrument

JavaLangManagementAPI
type: Class
subclass of: JavaLangManagementAPI
comment: JavaLibrary implementing the java.lang.management package for Java SE 6
comment: platform:comprisesInterfacePart some JavaLangManagement

JavaLangRefAPI
type: Class
equivalent class: JavaLangRefAPI
subclass of: JavaAPI
comment: JavaLibrary implementing the java.lang.ref package for Java SE 6
comment: platform:comprisesInterfacePart some JavaLangRef

JavaAwtAPI
type: Class
subclass of: JavaAwtAPI
comment: JavaLibrary implementing the java.awt package for Java SE 6
comment: platform:comprisesInterfacePart some JavaAwt

JavaAwtPrintAPI
type: Class
subclass of: JavaAwtPrintAPI
comment: JavaLibrary implementing the java.awt.print package for Java SE 6
comment: platform:comprisesInterfacePart some JavaAwtPrint

JavaAwtDatatransferAPI
type: Class
equivalent class: JavaAwtDatatransferAPI
subclass of: JavaAPI
comment: JavaLibrary implementing the java.awt.datatransfer package for Java SE 6
comment: platform:comprisesInterfacePart some JavaAwtDatatransfer

JavaAwtEventAPI
type: Class
subclass of: JavaAwtEventAPI
comment: JavaLibrary implementing the java.awt.event package for Java SE 6
comment: platform:comprisesInterfacePart some JavaAwtEvent

JavaAwtImageAPI
type: Class
subclass of: JavaAwtImageAPI
comment: JavaLibrary implementing the java.awt.image package for Java SE 6
comment: platform:comprisesInterfacePart some JavaAwtImage

JavaAwtImageRenderableAPI
type: Class
equivalent class: JavaAwtImageRenderableAPI
subclass of: JavaAPI
comment: JavaLibrary implementing the java.awt.image.renderable package for Java SE 6
comment: platform:comprisesInterfacePart some JavaAwtImageRenderable

JavaAwtGeomAPI
type: Class
subclass of: JavaAPI
comment: JavaLibrary implementing the java.awt.geom package for Java SE 6
comment: platform:comprisesInterfacePart some JavaAwtGeom

JavaAwtImAPI
type: Class
equivalent class: JavaAwtImAPI
subclass of: JavaAPI
comment: JavaLibrary implementing the java.awt.im package for Java SE 6
comment: platform:comprisesInterfacePart some JavaAwtIm

JavaAwtImSpiAPI
type: Class
equivalent class: JavaAwtImSpiAPI
subclass of: JavaAPI
comment: JavaLibrary implementing the java.awt.im.spi package for Java SE 6
comment: platform:comprisesInterfacePart some JavaAwtImSpi

JavaAwtColorAPI
type: Class
equivalent class: JavaAwtColorAPI
subclass of: JavaAPI
comment: JavaLibrary implementing the java.awt.color package for Java SE 6
comment: platform:comprisesInterfacePart some JavaAwtColor

JavaAwtDndAPI
type: Class
equivalent class: JavaAwtDndAPI
subclass of: JavaAPI
comment: JavaLibrary implementing the java.awt.dnd package for Java SE 6
comment: platform:comprisesInterfacePart some JavaAwtDnd

JavaAwtFontAPI
type: Class
subclass of: JavaAwtFontAPI
comment: JavaLibrary implementing the java.awt.font package for Java SE 6
comment: platform:comprisesInterfacePart some JavaAwtFont

JavaNetAPI
type: Class
subclass of: JavaNetAPI
comment: JavaLibrary implementing the java.net package for Java SE 6
comment: platform:comprisesInterfacePart some JavaNet

JavaIoAPI
type: Class
subclass of: JavaIoAPI
comment: JavaLibrary implementing the java.io package for Java SE 6
comment: platform:comprisesInterfacePart some JavaIo

JavaSecurityAPI
type: Class
subclass of: JavaSecurityAPI
comment: JavaLibrary implementing the java.security package for Java SE 6
comment: platform:comprisesInterfacePart some JavaSecurity

JavaSecuritySpecAPI
type: Class
equivalent class: JavaSecuritySpecAPI
subclass of: JavaAPI
comment: JavaLibrary implementing the java.security.spec package for Java SE 6
comment: platform:comprisesInterfacePart some JavaSecuritySpec

JavaSecurityCertAPI
type: Class
equivalent class: JavaSecurityCertAPI
subclass of: JavaAPI
comment: JavaLibrary implementing the java.security.cert package for Java SE 6
comment: platform:comprisesInterfacePart some JavaSecurityCert

JavaSecurityAclAPI
type: Class
equivalent class: JavaSecurityAclAPI
subclass of: JavaAPI
comment: JavaLibrary implementing the java.security.acl package for Java SE 6
comment: platform:comprisesInterfacePart some JavaSecurityAcl

JavaSecurityInterfacesAPI
type: Class
equivalent class: JavaSecurityInterfacesAPI
subclass of: JavaAPI
comment: JavaLibrary implementing the java.security.interfaces package for Java SE 6
comment: platform:comprisesInterfacePart some JavaSecurityInterfaces

JavaMathAPI
type: Class
subclass of: JavaMathAPI
comment: JavaLibrary implementing the java.math package for Java SE 6
comment: platform:comprisesInterfacePart some JavaMath

JavaNioAPI
type: Class
subclass of: JavaNioAPI
comment: JavaLibrary implementing the java.nio package for Java SE 6
comment: platform:comprisesInterfacePart some JavaNio

JavaNioChannelsAPI
type: Class
equivalent class: JavaNioChannelsAPI
subclass of: JavaAPI
comment: JavaLibrary implementing the java.nio.channels package for Java SE 6
comment: platform:comprisesInterfacePart some JavaNioChannels

JavaNioChannelsSpiAPI
type: Class
equivalent class: JavaNioChannelsSpiAPI
subclass of: JavaAPI
comment: JavaLibrary implementing the java.nio.channels.spi package for Java SE 6
comment: platform:comprisesInterfacePart some JavaNioChannelsSpi

JavaNioCharsetAPI
type: Class
equivalent class: JavaNioCharsetAPI
subclass of: JavaAPI
comment: JavaLibrary implementing the java.nio.charset package for Java SE 6
comment: platform:comprisesInterfacePart some JavaNioCharset

JavaNioCharsetSpiAPI
type: Class
equivalent class: JavaNioCharsetSpiAPI
subclass of: JavaAPI
comment: JavaLibrary implementing the java.nio.charset.spi package for Java SE 6
comment: platform:comprisesInterfacePart some JavaNioCharsetSpi

JavaUtilAPI
type: Class
subclass of: JavaUtilAPI
comment: JavaLibrary implementing the java.util package for Java SE 6
comment: platform:comprisesInterfacePart some JavaUtil

JavaUtilJarAPI
type: Class
equivalent class: JavaUtilJarAPI
subclass of: JavaAPI
comment: JavaLibrary implementing the java.util.jar package for Java SE 6
comment: platform:comprisesInterfacePart some JavaUtilJar

JavaUtilSpiAPI
type: Class
subclass of: JavaAPI
comment: JavaLibrary implementing the java.util.spi package for Java SE 6
comment: platform:comprisesInterfacePart some JavaUtilSpi

JavaUtilConcurrentAPI
type: Class
subclass of: JavaAPI
comment: JavaLibrary implementing the java.util.concurrent package for Java SE 6
comment: platform:comprisesInterfacePart some JavaUtilConcurrent

JavaUtilConcurrentAtomicAPI
type: Class
subclass of: JavaUtilConcurrentAtomicAPI
comment: JavaLibrary implementing the java.util.concurrent.atomic package for Java SE 6
comment: platform:comprisesInterfacePart some JavaUtilConcurrentAtomic

JavaUtilConcurrentLocksAPI
type: Class
subclass of: JavaUtilConcurrentLocksAPI
comment: JavaLibrary implementing the java.util.concurrent.locks package for Java SE 6
comment: platform:comprisesInterfacePart some JavaUtilConcurrentLocks

JavaUtilZipAPI
type: Class
subclass of: JavaUtilZipAPI
comment: JavaLibrary implementing the java.util.zip package for Java SE 6
comment: platform:comprisesInterfacePart some JavaUtilZip

JavaUtilLoggingAPI
type: Class
subclass of: JavaUtilLoggingAPI
comment: JavaLibrary implementing the java.util.logging package for Java SE 6
comment: platform:comprisesInterfacePart some JavaUtilLogging

JavaUtilPrefsAPI
type: Class
equivalent class: JavaUtilPrefsAPI
subclass of: JavaAPI
comment: JavaLibrary implementing the java.util.prefs package for Java SE 6
comment: platform:comprisesInterfacePart some JavaUtilPrefs

JavaUtilRegexAPI
type: Class
equivalent class: JavaUtilRegexAPI
subclass of: JavaAPI
comment: JavaLibrary implementing the java.util.regex package for Java SE 6
comment: platform:comprisesInterfacePart some JavaUtilRegex

JavaAppletAPI
type: Class
subclass of: JavaAppletAPI
comment: JavaLibrary implementing the java.applet package for Java SE 6
comment: platform:comprisesInterfacePart some JavaApplet

JavaBeansAPI
type: Class
subclass of: JavaBeansAPI
comment: JavaLibrary implementing the java.beans package for Java SE 6
comment: platform:comprisesInterfacePart some JavaBeans

JavaBeansBeancontextAPI
type: Class
equivalent class: JavaBeansBeancontextAPI
subclass of: JavaAPI
comment: JavaLibrary implementing the java.beans.beancontext package for Java SE 6
comment: platform:comprisesInterfacePart some JavaBeansBeancontext

JavaTextAPI
type: Class
subclass of: JavaAPI
comment: JavaLibrary implementing the java.text package for Java SE 6
comment: platform:comprisesInterfacePart some JavaText

JavaTextSpiAPI
type: Class
subclass of: JavaAPI
comment: JavaLibrary implementing the java.text.spi package for Java SE 6
comment: platform:comprisesInterfacePart some JavaTextSpi

JavaRmiAPI
type: Class
equivalent class: JavaRmiAPI
subclass of: JavaAPI
comment: JavaLibrary implementing the java.rmi package for Java SE 6
comment: platform:comprisesInterfacePart some JavaRmi

JavaRmiActivationAPI
type: Class
equivalent class: JavaRmiActivationAPI
subclass of: JavaAPI
comment: JavaLibrary implementing the java.rmi.activation package for Java SE 6
comment: platform:comprisesInterfacePart some JavaRmiActivation

JavaRmiServerAPI
type: Class
subclass of: JavaRmiServerAPI
comment: JavaLibrary implementing the java.rmi.server package for Java SE 6
comment: platform:comprisesInterfacePart some JavaRmiServer

JavaRmiDgcAPI
type: Class
equivalent class: JavaRmiDgcAPI
subclass of: JavaAPI
comment: JavaLibrary implementing the java.rmi.dgc package for Java SE 6
comment: platform:comprisesInterfacePart some JavaRmiDgc

JavaRmiRegistryAPI
type: Class
equivalent class: JavaRmiRegistryAPI
subclass of: JavaAPI
comment: JavaLibrary implementing the java.rmi.registry package for Java SE 6
comment: platform:comprisesInterfacePart some JavaRmiRegistry

JavaSqlAPI
type: Class
subclass of: JavaSqlAPI
comment: JavaLibrary implementing the java.sql package for Java SE 6
comment: platform:comprisesInterfacePart some JavaSql

OrgW3cDomAPI
type: Class
equivalent class: OrgW3cDomAPI
subclass of: JavaAPI
comment: JavaLibrary implementing the org.w3c.dom package for Java SE 6
comment: platform:comprisesInterfacePart some OrgW3cDom

OrgW3cDomLsAPI
type: Class
equivalent class: OrgW3cDomLsAPI
subclass of: JavaAPI
comment: JavaLibrary implementing the org.w3c.dom.ls package for Java SE 6
comment: platform:comprisesInterfacePart some OrgW3cDomLs

OrgW3cDomBootstrapAPI
type: Class
equivalent class: OrgW3cDomBootstrapAPI
subclass of: JavaAPI
comment: JavaLibrary implementing the org.w3c.dom.bootstrap package for Java SE 6
comment: platform:comprisesInterfacePart some OrgW3cDomBootstrap

OrgW3cDomCssAPI
type: Class
equivalent class: OrgW3cDomCssAPI
subclass of: JavaAPI
comment: JavaLibrary implementing the org.w3c.dom.css package for Java SE 6
comment: platform:comprisesInterfacePart some OrgW3cDomCss

OrgW3cDomStylesheetsAPI
type: Class
equivalent class: OrgW3cDomStylesheetsAPI
subclass of: JavaAPI
comment: JavaLibrary implementing the org.w3c.dom.stylesheets package for Java SE 6
comment: platform:comprisesInterfacePart some OrgW3cDomStylesheets

OrgW3cDomViewsAPI
type: Class
equivalent class: OrgW3cDomViewsAPI
subclass of: JavaAPI
comment: JavaLibrary implementing the org.w3c.dom.views package for Java SE 6
comment: platform:comprisesInterfacePart some OrgW3cDomViews

OrgW3cDomEventsAPI
type: Class
equivalent class: OrgW3cDomEventsAPI
subclass of: JavaAPI
comment: JavaLibrary implementing the org.w3c.dom.events package for Java SE 6
comment: platform:comprisesInterfacePart some OrgW3cDomEvents

OrgW3cDomHtmlAPI
type: Class
equivalent class: OrgW3cDomHtmlAPI
subclass of: JavaAPI
comment: JavaLibrary implementing the org.w3c.dom.html package for Java SE 6
comment: platform:comprisesInterfacePart some OrgW3cDomHtml

OrgW3cDomTraversalAPI
type: Class
equivalent class: OrgW3cDomTraversalAPI
subclass of: JavaAPI
comment: JavaLibrary implementing the org.w3c.dom.traversal package for Java SE 6
comment: platform:comprisesInterfacePart some OrgW3cDomTraversal

OrgW3cDomRangesAPI
type: Class
equivalent class: OrgW3cDomRangesAPI
subclass of: JavaAPI
comment: JavaLibrary implementing the org.w3c.dom.ranges package for Java SE 6
comment: platform:comprisesInterfacePart some OrgW3cDomRanges

OrgW3cDomXpathAPI
type: Class
subclass of: JavaAPI
comment: JavaLibrary implementing the org.w3c.dom.xpath package for Java SE 6
comment: platform:comprisesInterfacePart some OrgW3cDomXpath

OrgOmgCORBA 2 3API
type: Class
equivalent class: OrgOmgCORBA 2 3API
subclass of: JavaAPI
comment: JavaLibrary implementing the org.omg.CORBA_2_3 package for Java SE 6
comment: platform:comprisesInterfacePart some OrgOmgCORBA_2_3

OrgOmgCORBA 2 3PortableAPI
type: Class
equivalent class: OrgOmgCORBA 2 3PortableAPI
subclass of: JavaAPI
comment: JavaLibrary implementing the org.omg.CORBA_2_3.portable package for Java SE 6
comment: platform:comprisesInterfacePart some OrgOmgCORBA_2_3Portable

OrgOmgCORBAAPI
type: Class
equivalent class: OrgOmgCORBAAPI
subclass of: JavaAPI
comment: JavaLibrary implementing the org.omg.CORBA package for Java SE 6
comment: platform:comprisesInterfacePart some OrgOmgCORBA

OrgOmgCORBAPortableAPI
type: Class
equivalent class: OrgOmgCORBAPortableAPI
subclass of: JavaAPI
comment: JavaLibrary implementing the org.omg.CORBA.portable package for Java SE 6
comment: platform:comprisesInterfacePart some OrgOmgCORBAPortable

OrgOmgCORBADynAnyPackageAPI
type: Class
equivalent class: OrgOmgCORBADynAnyPackageAPI
subclass of: JavaAPI
comment: JavaLibrary implementing the org.omg.CORBA.DynAnyPackage package for Java SE 6
comment: platform:comprisesInterfacePart some OrgOmgCORBADynAnyPackage

OrgOmgCORBAORBPackageAPI
type: Class
equivalent class: OrgOmgCORBAORBPackageAPI
subclass of: JavaAPI
comment: JavaLibrary implementing the org.omg.CORBA.ORBPackage package for Java SE 6
comment: platform:comprisesInterfacePart some OrgOmgCORBAORBPackage

OrgOmgCORBATypeCodePackageAPI
type: Class
equivalent class: OrgOmgCORBATypeCodePackageAPI
subclass of: JavaAPI
comment: JavaLibrary implementing the org.omg.CORBA.TypeCodePackage package for Java SE 6
comment: platform:comprisesInterfacePart some OrgOmgCORBATypeCodePackage

OrgOmgSendingContextAPI
type: Class
equivalent class: OrgOmgSendingContextAPI
subclass of: JavaAPI
comment: JavaLibrary implementing the org.omg.SendingContext package for Java SE 6
comment: platform:comprisesInterfacePart some OrgOmgSendingContext

OrgOmgCosNamingAPI
type: Class
equivalent class: OrgOmgCosNamingAPI
subclass of: JavaAPI
comment: JavaLibrary implementing the org.omg.CosNaming package for Java SE 6
comment: platform:comprisesInterfacePart some OrgOmgCosNaming

OrgOmgCosNamingNamingContextExtPackageAPI
type: Class
equivalent class: OrgOmgCosNamingNamingContextExtPackageAPI
subclass of: JavaAPI
comment: JavaLibrary implementing the org.omg.CosNaming.NamingContextExtPackage package for Java SE 6
comment: platform:comprisesInterfacePart some OrgOmgCosNamingNamingContextExtPackage

OrgOmgCosNamingNamingContextPackageAPI
type: Class
equivalent class: OrgOmgCosNamingNamingContextPackageAPI
subclass of: JavaAPI
comment: JavaLibrary implementing the org.omg.CosNaming.NamingContextPackage package for Java SE 6
comment: platform:comprisesInterfacePart some OrgOmgCosNamingNamingContextPackage

OrgOmgPortableServerAPI
type: Class
equivalent class: OrgOmgPortableServerAPI
subclass of: JavaAPI
comment: JavaLibrary implementing the org.omg.PortableServer package for Java SE 6
comment: platform:comprisesInterfacePart some OrgOmgPortableServer

OrgOmgPortableServerCurrentPackageAPI
type: Class
equivalent class: OrgOmgPortableServerCurrentPackageAPI
subclass of: JavaAPI
comment: JavaLibrary implementing the org.omg.PortableServer.CurrentPackage package for Java SE 6
comment: platform:comprisesInterfacePart some OrgOmgPortableServerCurrentPackage

OrgOmgPortableServerPOAManagerPackageAPI
type: Class
equivalent class: OrgOmgPortableServerPOAManagerPackageAPI
subclass of: JavaAPI
comment: JavaLibrary implementing the org.omg.PortableServer.POAManagerPackage package for Java SE 6
comment: platform:comprisesInterfacePart some OrgOmgPortableServerPOAManagerPackage

OrgOmgPortableServerPOAPackageAPI
type: Class
equivalent class: OrgOmgPortableServerPOAPackageAPI
subclass of: JavaAPI
comment: JavaLibrary implementing the org.omg.PortableServer.POAPackage package for Java SE 6
comment: platform:comprisesInterfacePart some OrgOmgPortableServerPOAPackage

OrgOmgPortableServerPortableAPI
type: Class
equivalent class: OrgOmgPortableServerPortableAPI
subclass of: JavaAPI
comment: JavaLibrary implementing the org.omg.PortableServer.portable package for Java SE 6
comment: platform:comprisesInterfacePart some OrgOmgPortableServerPortable

OrgOmgPortableServerServantLocatorPackageAPI
type: Class
equivalent class: OrgOmgPortableServerServantLocatorPackageAPI
subclass of: JavaAPI
comment: JavaLibrary implementing the org.omg.PortableServer.ServantLocatorPackage package for Java SE 6
comment: platform:comprisesInterfacePart some OrgOmgPortableServerServantLocatorPackage

OrgOmgDynamicAPI
type: Class
equivalent class: OrgOmgDynamicAPI
subclass of: JavaAPI
comment: JavaLibrary implementing the org.omg.Dynamic package for Java SE 6
comment: platform:comprisesInterfacePart some OrgOmgDynamic

OrgOmgDynamicAnyAPI
type: Class
equivalent class: OrgOmgDynamicAnyAPI
subclass of: JavaAPI
comment: JavaLibrary implementing the org.omg.DynamicAny package for Java SE 6
comment: platform:comprisesInterfacePart some OrgOmgDynamicAny

OrgOmgDynamicAnyDynAnyFactoryPackageAPI
type: Class
equivalent class: OrgOmgDynamicAnyDynAnyFactoryPackageAPI
subclass of: JavaAPI
comment: JavaLibrary implementing the org.omg.DynamicAny.DynAnyFactoryPackage package for Java SE 6
comment: platform:comprisesInterfacePart some OrgOmgDynamicAnyDynAnyFactoryPackage

OrgOmgDynamicAnyDynAnyPackageAPI
type: Class
equivalent class: OrgOmgDynamicAnyDynAnyPackageAPI
subclass of: JavaAPI
comment: JavaLibrary implementing the org.omg.DynamicAny.DynAnyPackage package for Java SE 6
comment: platform:comprisesInterfacePart some OrgOmgDynamicAnyDynAnyPackage

OrgOmgIOPAPI
type: Class
equivalent class: OrgOmgIOPAPI
subclass of: JavaAPI
comment: JavaLibrary implementing the org.omg.IOP package for Java SE 6
comment: platform:comprisesInterfacePart some OrgOmgIOP

OrgOmgIOPCodecFactoryPackageAPI
type: Class
equivalent class: OrgOmgIOPCodecFactoryPackageAPI
subclass of: JavaAPI
comment: JavaLibrary implementing the org.omg.IOP.CodecFactoryPackage package for Java SE 6
comment: platform:comprisesInterfacePart some OrgOmgIOPCodecFactoryPackage

OrgOmgIOPCodecPackageAPI
type: Class
equivalent class: OrgOmgIOPCodecPackageAPI
subclass of: JavaAPI
comment: JavaLibrary implementing the org.omg.IOP.CodecPackage package for Java SE 6
comment: platform:comprisesInterfacePart some OrgOmgIOPCodecPackage

OrgOmgMessagingAPI
type: Class
equivalent class: OrgOmgMessagingAPI
subclass of: JavaAPI
comment: JavaLibrary implementing the org.omg.Messaging package for Java SE 6
comment: platform:comprisesInterfacePart some OrgOmgMessaging

OrgOmgPortableInterceptorAPI
type: Class
equivalent class: OrgOmgPortableInterceptorAPI
subclass of: JavaAPI
comment: JavaLibrary implementing the org.omg.PortableInterceptor package for Java SE 6
comment: platform:comprisesInterfacePart some OrgOmgPortableInterceptor

OrgOmgPortableInterceptorORBInitInfoPackageAPI
type: Class
equivalent class: OrgOmgPortableInterceptorORBInitInfoPackageAPI
subclass of: JavaAPI
comment: JavaLibrary implementing the org.omg.PortableInterceptor.ORBInitInfoPackage package for Java SE 6
comment: platform:comprisesInterfacePart some OrgOmgPortableInterceptorORBInitInfoPackage

OrgOmgStubJavaRmiAPI
type: Class
equivalent class: OrgOmgStubJavaRmiAPI
subclass of: JavaAPI
comment: JavaLibrary implementing the org.omg.stub.java.rmi package for Java SE 6
comment: platform:comprisesInterfacePart some OrgOmgStubJavaRmi

OrgOmgStubJavaxManagementRemoteRmiAPI
type: Class
equivalent class: OrgOmgStubJavaxManagementRemoteRmiAPI
subclass of: JavaAPI
comment: JavaLibrary implementing the org.omg.stub.javax.management.remote.rmi package for Java SE 6
comment: platform:comprisesInterfacePart some OrgOmgStubJavaxManagementRemoteRmi

OrgXmlSaxAPI
type: Class
equivalent class: OrgXmlSaxAPI
subclass of: JavaAPI
comment: JavaLibrary implementing the org.xml.sax package for Java SE 6
comment: platform:comprisesInterfacePart some OrgXmlSax

OrgXmlSaxHelpersAPI
type: Class
equivalent class: OrgXmlSaxHelpersAPI
subclass of: JavaAPI
comment: JavaLibrary implementing the org.xml.sax.helpers package for Java SE 6
comment: platform:comprisesInterfacePart some OrgXmlSaxHelpers

OrgXmlSaxExtAPI
type: Class
equivalent class: OrgXmlSaxExtAPI
subclass of: JavaAPI
comment: JavaLibrary implementing the org.xml.sax.ext package for Java SE 6
comment: platform:comprisesInterfacePart some OrgXmlSaxExt

OrgIetfJgssAPI
type: Class
equivalent class: OrgIetfJgssAPI
subclass of: JavaAPI
comment: JavaLibrary implementing the org.ietf.jgss package for Java SE 6
comment: platform:comprisesInterfacePart some OrgIetfJgss

JavaxJnlpClassLibrary
type: Class
subclass of: JavaClassLibrary
comment: JavaLibrary implementing the javax.jnlp package for Java SE 6
comment: platform:implementsInterface some JavaxJnlpAPI

JavaxCryptoClassLibrary
type: Class
equivalent class: JavaxCryptoClassLibrary
subclass of: JavaClassLibrary
comment: JavaLibrary implementing the javax.crypto package for Java SE 6
comment: platform:implementsInterface some JavaxCryptoAPI

JavaxCryptoInterfacesClassLibrary
type: Class
equivalent class: JavaxCryptoInterfacesClassLibrary
subclass of: JavaClassLibrary
comment: JavaLibrary implementing the javax.crypto.interfaces package for Java SE 6
comment: platform:implementsInterface some JavaxCryptoInterfacesAPI

JavaxCryptoSpecClassLibrary
type: Class
equivalent class: JavaxCryptoSpecClassLibrary
subclass of: JavaClassLibrary
comment: JavaLibrary implementing the javax.crypto.spec package for Java SE 6
comment: platform:implementsInterface some JavaxCryptoSpecAPI

JavaxNetClassLibrary
type: Class
equivalent class: JavaxNetClassLibrary
subclass of: JavaClassLibrary
comment: JavaLibrary implementing the javax.net package for Java SE 6
comment: platform:implementsInterface some JavaxNetAPI

JavaxNetSslClassLibrary
type: Class
subclass of: JavaxNetSslClassLibrary
comment: JavaLibrary implementing the javax.net.ssl package for Java SE 6
comment: platform:implementsInterface some JavaxNetSslAPI

JavaxSecurityCertClassLibrary
type: Class
equivalent class: JavaxSecurityCertClassLibrary
subclass of: JavaClassLibrary
comment: JavaLibrary implementing the javax.security.cert package for Java SE 6
comment: platform:implementsInterface some JavaxSecurityCertAPI

JavaxSecurityAuthClassLibrary
type: Class
equivalent class: JavaxSecurityAuthClassLibrary
subclass of: JavaClassLibrary
comment: JavaLibrary implementing the javax.security.auth package for Java SE 6
comment: platform:implementsInterface some JavaxSecurityAuthAPI

JavaxSecurityAuthCallbackClassLibrary
type: Class
equivalent class: JavaxSecurityAuthCallbackClassLibrary
subclass of: JavaClassLibrary
comment: JavaLibrary implementing the javax.security.auth.callback package for Java SE 6
comment: platform:implementsInterface some JavaxSecurityAuthCallbackAPI

JavaxSecurityAuthLoginClassLibrary
type: Class
subclass of: JavaxSecurityAuthLoginClassLibrary
comment: JavaLibrary implementing the javax.security.auth.login package for Java SE 6
comment: platform:implementsInterface some JavaxSecurityAuthLoginAPI

JavaxSecurityAuthX500ClassLibrary
type: Class
subclass of: JavaxSecurityAuthX500ClassLibrary
comment: JavaLibrary implementing the javax.security.auth.x500 package for Java SE 6
comment: platform:implementsInterface some JavaxSecurityAuthX500API

JavaxSecurityAuthKerberosClassLibrary
type: Class
equivalent class: JavaxSecurityAuthKerberosClassLibrary
subclass of: JavaClassLibrary
comment: JavaLibrary implementing the javax.security.auth.kerberos package for Java SE 6
comment: platform:implementsInterface some JavaxSecurityAuthKerberosAPI

JavaxSecurityAuthSpiClassLibrary
type: Class
equivalent class: JavaxSecurityAuthSpiClassLibrary
subclass of: JavaClassLibrary
comment: JavaLibrary implementing the javax.security.auth.spi package for Java SE 6
comment: platform:implementsInterface some JavaxSecurityAuthSpiAPI

JavaxSecuritySaslClassLibrary
type: Class
subclass of: JavaxSecuritySaslClassLibrary
comment: JavaLibrary implementing the javax.security.sasl package for Java SE 6
comment: platform:implementsInterface some JavaxSecuritySaslAPI

JavaxAccessibilityClassLibrary
type: Class
subclass of: JavaxAccessibilityClassLibrary
comment: JavaLibrary implementing the javax.accessibility package for Java SE 6
comment: platform:implementsInterface some JavaxAccessibilityAPI

JavaxSwingClassLibrary
type: Class
subclass of: JavaxSwingClassLibrary
comment: JavaLibrary implementing the javax.swing package for Java SE 6
comment: platform:implementsInterface some JavaxSwingAPI

JavaxSwingTextClassLibrary
type: Class
subclass of: JavaxSwingTextClassLibrary
comment: JavaLibrary implementing the javax.swing.text package for Java SE 6
comment: platform:implementsInterface some JavaxSwingTextAPI

JavaxSwingTextHtmlClassLibrary
type: Class
subclass of: JavaxSwingTextHtmlClassLibrary
comment: JavaLibrary implementing the javax.swing.text.html package for Java SE 6
comment: platform:implementsInterface some JavaxSwingTextHtmlAPI

JavaxSwingTextHtmlParserClassLibrary
type: Class
equivalent class: JavaxSwingTextHtmlParserClassLibrary
subclass of: JavaClassLibrary
comment: JavaLibrary implementing the javax.swing.text.html.parser package for Java SE 6
comment: platform:implementsInterface some JavaxSwingTextHtmlParserAPI

JavaxSwingTextRtfClassLibrary
type: Class
subclass of: JavaxSwingTextRtfClassLibrary
comment: JavaLibrary implementing the javax.swing.text.rtf package for Java SE 6
comment: platform:implementsInterface some JavaxSwingTextRtfAPI

JavaxSwingEventClassLibrary
type: Class
subclass of: JavaxSwingEventClassLibrary
comment: JavaLibrary implementing the javax.swing.event package for Java SE 6
comment: platform:implementsInterface some JavaxSwingEventAPI

JavaxSwingColorchooserClassLibrary
type: Class
subclass of: JavaxSwingColorchooserClassLibrary
comment: JavaLibrary implementing the javax.swing.colorchooser package for Java SE 6
comment: platform:implementsInterface some JavaxSwingColorchooserAPI

JavaxSwingPlafClassLibrary
type: Class
subclass of: JavaxSwingPlafClassLibrary
comment: JavaLibrary implementing the javax.swing.plaf package for Java SE 6
comment: platform:implementsInterface some JavaxSwingPlafAPI

JavaxSwingPlafBasicClassLibrary
type: Class
subclass of: JavaxSwingPlafBasicClassLibrary
comment: JavaLibrary implementing the javax.swing.plaf.basic package for Java SE 6
comment: platform:implementsInterface some JavaxSwingPlafBasicAPI

JavaxSwingPlafMetalClassLibrary
type: Class
subclass of: JavaxSwingPlafMetalClassLibrary
comment: JavaLibrary implementing the javax.swing.plaf.metal package for Java SE 6
comment: platform:implementsInterface some JavaxSwingPlafMetalAPI

JavaxSwingPlafMultiClassLibrary
type: Class
subclass of: JavaxSwingPlafMultiClassLibrary
comment: JavaLibrary implementing the javax.swing.plaf.multi package for Java SE 6
comment: platform:implementsInterface some JavaxSwingPlafMultiAPI

JavaxSwingPlafSynthClassLibrary
type: Class
subclass of: JavaxSwingPlafSynthClassLibrary
comment: JavaLibrary implementing the javax.swing.plaf.synth package for Java SE 6
comment: platform:implementsInterface some JavaxSwingPlafSynthAPI

JavaxSwingFilechooserClassLibrary
type: Class
subclass of: JavaxSwingFilechooserClassLibrary
comment: JavaLibrary implementing the javax.swing.filechooser package for Java SE 6
comment: platform:implementsInterface some JavaxSwingFilechooserAPI

JavaxSwingTreeClassLibrary
type: Class
subclass of: JavaxSwingTreeClassLibrary
comment: JavaLibrary implementing the javax.swing.tree package for Java SE 6
comment: platform:implementsInterface some JavaxSwingTreeAPI

JavaxSwingBorderClassLibrary
type: Class
subclass of: JavaxSwingBorderClassLibrary
comment: JavaLibrary implementing the javax.swing.border package for Java SE 6
comment: platform:implementsInterface some JavaxSwingBorderAPI

JavaxSwingTableClassLibrary
type: Class
subclass of: JavaxSwingTableClassLibrary
comment: JavaLibrary implementing the javax.swing.table package for Java SE 6
comment: platform:implementsInterface some JavaxSwingTableAPI

JavaxSwingUndoClassLibrary
type: Class
equivalent class: JavaxSwingUndoClassLibrary
subclass of: JavaClassLibrary
comment: JavaLibrary implementing the javax.swing.undo package for Java SE 6
comment: platform:implementsInterface some JavaxSwingUndoAPI

JavaxManagementClassLibrary
type: Class
subclass of: JavaxManagementClassLibrary
comment: JavaLibrary implementing the javax.management package for Java SE 6
comment: platform:implementsInterface some JavaxManagementAPI

JavaxManagementOpenmbeanClassLibrary
type: Class
subclass of: JavaxManagementOpenmbeanClassLibrary
comment: JavaLibrary implementing the javax.management.openmbean package for Java SE 6
comment: platform:implementsInterface some JavaxManagementOpenmbeanAPI

JavaxManagementLoadingClassLibrary
type: Class
subclass of: JavaxManagementLoadingClassLibrary
comment: JavaLibrary implementing the javax.management.loading package for Java SE 6
comment: platform:implementsInterface some JavaxManagementLoadingAPI

JavaxManagementModelmbeanClassLibrary
type: Class
subclass of: JavaxManagementModelmbeanClassLibrary
comment: JavaLibrary implementing the javax.management.modelmbean package for Java SE 6
comment: platform:implementsInterface some JavaxManagementModelmbeanAPI

JavaxManagementMonitorClassLibrary
type: Class
subclass of: JavaxManagementMonitorClassLibrary
comment: JavaLibrary implementing the javax.management.monitor package for Java SE 6
comment: platform:implementsInterface some JavaxManagementMonitorAPI

JavaxManagementRelationClassLibrary
type: Class
subclass of: JavaxManagementRelationClassLibrary
comment: JavaLibrary implementing the javax.management.relation package for Java SE 6
comment: platform:implementsInterface some JavaxManagementRelationAPI

JavaxManagementRemoteClassLibrary
type: Class
subclass of: JavaxManagementRemoteClassLibrary
comment: JavaLibrary implementing the javax.management.remote package for Java SE 6
comment: platform:implementsInterface some JavaxManagementRemoteAPI

JavaxManagementRemoteRmiClassLibrary
type: Class
subclass of: JavaxManagementRemoteRmiClassLibrary
comment: JavaLibrary implementing the javax.management.remote.rmi package for Java SE 6
comment: platform:implementsInterface some JavaxManagementRemoteRmiAPI

JavaxManagementTimerClassLibrary
type: Class
subclass of: JavaClassLibrary
comment: JavaLibrary implementing the javax.management.timer package for Java SE 6
comment: platform:implementsInterface some JavaxManagementTimerAPI

JavaxXmlClassLibrary
type: Class
equivalent class: JavaxXmlClassLibrary
subclass of: JavaClassLibrary
comment: JavaLibrary implementing the javax.xml package for Java SE 6
comment: platform:implementsInterface some JavaxXmlAPI

JavaxXmlTransformClassLibrary
type: Class
subclass of: JavaxXmlTransformClassLibrary
comment: JavaLibrary implementing the javax.xml.transform package for Java SE 6
comment: platform:implementsInterface some JavaxXmlTransformAPI

JavaxXmlTransformDomClassLibrary
type: Class
equivalent class: JavaxXmlTransformDomClassLibrary
subclass of: JavaClassLibrary
comment: JavaLibrary implementing the javax.xml.transform.dom package for Java SE 6
comment: platform:implementsInterface some JavaxXmlTransformDomAPI

JavaxXmlTransformSaxClassLibrary
type: Class
subclass of: JavaxXmlTransformSaxClassLibrary
comment: JavaLibrary implementing the javax.xml.transform.sax package for Java SE 6
comment: platform:implementsInterface some JavaxXmlTransformSaxAPI

JavaxXmlTransformStaxClassLibrary
type: Class
subclass of: JavaClassLibrary
comment: JavaLibrary implementing the javax.xml.transform.stax package for Java SE 6
comment: platform:implementsInterface some JavaxXmlTransformStaxAPI

JavaxXmlTransformStreamClassLibrary
type: Class
equivalent class: JavaxXmlTransformStreamClassLibrary
subclass of: JavaClassLibrary
comment: JavaLibrary implementing the javax.xml.transform.stream package for Java SE 6
comment: platform:implementsInterface some JavaxXmlTransformStreamAPI

JavaxXmlBindClassLibrary
type: Class
subclass of: JavaClassLibrary
comment: JavaLibrary implementing the javax.xml.bind package for Java SE 6
comment: platform:implementsInterface some JavaxXmlBindAPI

JavaxXmlBindAnnotationClassLibrary
type: Class
subclass of: JavaClassLibrary
comment: JavaLibrary implementing the javax.xml.bind.annotation package for Java SE 6
comment: platform:implementsInterface some JavaxXmlBindAnnotationAPI

JavaxXmlBindAnnotationAdaptersClassLibrary
type: Class
subclass of: JavaClassLibrary
comment: JavaLibrary implementing the javax.xml.bind.annotation.adapters package for Java SE 6
comment: platform:implementsInterface some JavaxXmlBindAnnotationAdaptersAPI

JavaxXmlBindAttachmentClassLibrary
type: Class
subclass of: JavaClassLibrary
comment: JavaLibrary implementing the javax.xml.bind.attachment package for Java SE 6
comment: platform:implementsInterface some JavaxXmlBindAttachmentAPI

JavaxXmlBindHelpersClassLibrary
type: Class
subclass of: JavaClassLibrary
comment: JavaLibrary implementing the javax.xml.bind.helpers package for Java SE 6
comment: platform:implementsInterface some JavaxXmlBindHelpersAPI

JavaxXmlBindUtilClassLibrary
type: Class
subclass of: JavaClassLibrary
comment: JavaLibrary implementing the javax.xml.bind.util package for Java SE 6
comment: platform:implementsInterface some JavaxXmlBindUtilAPI

JavaxXmlValidationClassLibrary
type: Class
subclass of: JavaxXmlValidationClassLibrary
comment: JavaLibrary implementing the javax.xml.validation package for Java SE 6
comment: platform:implementsInterface some JavaxXmlValidationAPI

JavaxXmlNamespaceClassLibrary
type: Class
equivalent class: JavaxXmlNamespaceClassLibrary
subclass of: JavaClassLibrary
comment: JavaLibrary implementing the javax.xml.namespace package for Java SE 6
comment: platform:implementsInterface some JavaxXmlNamespaceAPI

JavaxXmlStreamClassLibrary
type: Class
subclass of: JavaClassLibrary
comment: JavaLibrary implementing the javax.xml.stream package for Java SE 6
comment: platform:implementsInterface some JavaxXmlStreamAPI

JavaxXmlStreamEventsClassLibrary
type: Class
subclass of: JavaClassLibrary
comment: JavaLibrary implementing the javax.xml.stream.events package for Java SE 6
comment: platform:implementsInterface some JavaxXmlStreamEventsAPI

JavaxXmlStreamUtilClassLibrary
type: Class
subclass of: JavaClassLibrary
comment: JavaLibrary implementing the javax.xml.stream.util package for Java SE 6
comment: platform:implementsInterface some JavaxXmlStreamUtilAPI

JavaxXmlParsersClassLibrary
type: Class
subclass of: JavaxXmlParsersClassLibrary
comment: JavaLibrary implementing the javax.xml.parsers package for Java SE 6
comment: platform:implementsInterface some JavaxXmlParsersAPI

JavaxXmlCryptoClassLibrary
type: Class
subclass of: JavaClassLibrary
comment: JavaLibrary implementing the javax.xml.crypto package for Java SE 6
comment: platform:implementsInterface some JavaxXmlCryptoAPI

JavaxXmlCryptoDsigClassLibrary
type: Class
subclass of: JavaClassLibrary
comment: JavaLibrary implementing the javax.xml.crypto.dsig package for Java SE 6
comment: platform:implementsInterface some JavaxXmlCryptoDsigAPI

JavaxXmlCryptoDsigKeyinfoClassLibrary
type: Class
subclass of: JavaClassLibrary
comment: JavaLibrary implementing the javax.xml.crypto.dsig.keyinfo package for Java SE 6
comment: platform:implementsInterface some JavaxXmlCryptoDsigKeyinfoAPI

JavaxXmlCryptoDsigSpecClassLibrary
type: Class
subclass of: JavaClassLibrary
comment: JavaLibrary implementing the javax.xml.crypto.dsig.spec package for Java SE 6
comment: platform:implementsInterface some JavaxXmlCryptoDsigSpecAPI

JavaxXmlCryptoDsigDomClassLibrary
type: Class
subclass of: JavaClassLibrary
comment: JavaLibrary implementing the javax.xml.crypto.dsig.dom package for Java SE 6
comment: platform:implementsInterface some JavaxXmlCryptoDsigDomAPI

JavaxXmlCryptoDomClassLibrary
type: Class
subclass of: JavaClassLibrary
comment: JavaLibrary implementing the javax.xml.crypto.dom package for Java SE 6
comment: platform:implementsInterface some JavaxXmlCryptoDomAPI

JavaxXmlDatatypeClassLibrary
type: Class
subclass of: JavaxXmlDatatypeClassLibrary
comment: JavaLibrary implementing the javax.xml.datatype package for Java SE 6
comment: platform:implementsInterface some JavaxXmlDatatypeAPI

JavaxXmlSoapClassLibrary
type: Class
subclass of: JavaClassLibrary
comment: JavaLibrary implementing the javax.xml.soap package for Java SE 6
comment: platform:implementsInterface some JavaxXmlSoapAPI

JavaxXmlWsClassLibrary
type: Class
subclass of: JavaClassLibrary
comment: JavaLibrary implementing the javax.xml.ws package for Java SE 6
comment: platform:implementsInterface some JavaxXmlWsAPI

JavaxXmlWsHandlerClassLibrary
type: Class
subclass of: JavaClassLibrary
comment: JavaLibrary implementing the javax.xml.ws.handler package for Java SE 6
comment: platform:implementsInterface some JavaxXmlWsHandlerAPI

JavaxXmlWsHandlerSoapClassLibrary
type: Class
subclass of: JavaClassLibrary
comment: JavaLibrary implementing the javax.xml.ws.handler.soap package for Java SE 6
comment: platform:implementsInterface some JavaxXmlWsHandlerSoapAPI

JavaxXmlWsHttpClassLibrary
type: Class
subclass of: JavaClassLibrary
comment: JavaLibrary implementing the javax.xml.ws.http package for Java SE 6
comment: platform:implementsInterface some JavaxXmlWsHttpAPI

JavaxXmlWsSoapClassLibrary
type: Class
subclass of: JavaClassLibrary
comment: JavaLibrary implementing the javax.xml.ws.soap package for Java SE 6
comment: platform:implementsInterface some JavaxXmlWsSoapAPI

JavaxXmlWsSpiClassLibrary
type: Class
subclass of: JavaClassLibrary
comment: JavaLibrary implementing the javax.xml.ws.spi package for Java SE 6
comment: platform:implementsInterface some JavaxXmlWsSpiAPI

JavaxXmlWsWsaddressingClassLibrary
type: Class
subclass of: JavaClassLibrary
comment: JavaLibrary implementing the javax.xml.ws.wsaddressing package for Java SE 6
comment: platform:implementsInterface some JavaxXmlWsWsaddressingAPI

JavaxXmlXpathClassLibrary
type: Class
subclass of: JavaxXmlXpathClassLibrary
comment: JavaLibrary implementing the javax.xml.xpath package for Java SE 6
comment: platform:implementsInterface some JavaxXmlXpathAPI

JavaxActivationClassLibrary
type: Class
subclass of: JavaClassLibrary
comment: JavaLibrary implementing the javax.activation package for Java SE 6
comment: platform:implementsInterface some JavaxActivationAPI

JavaxActivityClassLibrary
type: Class
equivalent class: JavaxActivityClassLibrary
subclass of: JavaClassLibrary
comment: JavaLibrary implementing the javax.activity package for Java SE 6
comment: platform:implementsInterface some JavaxActivityAPI

JavaxAnnotationClassLibrary
type: Class
subclass of: JavaClassLibrary
comment: JavaLibrary implementing the javax.annotation package for Java SE 6
comment: platform:implementsInterface some JavaxAnnotationAPI

JavaxAnnotationProcessingClassLibrary
type: Class
subclass of: JavaClassLibrary
comment: JavaLibrary implementing the javax.annotation.processing package for Java SE 6
comment: platform:implementsInterface some JavaxAnnotationProcessingAPI

JavaxLangModelClassLibrary
type: Class
subclass of: JavaClassLibrary
comment: JavaLibrary implementing the javax.lang.model package for Java SE 6
comment: platform:implementsInterface some JavaxLangModelAPI

JavaxLangModelElementClassLibrary
type: Class
subclass of: JavaClassLibrary
comment: JavaLibrary implementing the javax.lang.model.element package for Java SE 6
comment: platform:implementsInterface some JavaxLangModelElementAPI

JavaxLangModelUtilClassLibrary
type: Class
subclass of: JavaClassLibrary
comment: JavaLibrary implementing the javax.lang.model.util package for Java SE 6
comment: platform:implementsInterface some JavaxLangModelUtilAPI

JavaxLangModelTypeClassLibrary
type: Class
subclass of: JavaClassLibrary
comment: JavaLibrary implementing the javax.lang.model.type package for Java SE 6
comment: platform:implementsInterface some JavaxLangModelTypeAPI

JavaxToolsClassLibrary
type: Class
subclass of: JavaClassLibrary
comment: JavaLibrary implementing the javax.tools package for Java SE 6
comment: platform:implementsInterface some JavaxToolsAPI

JavaxImageioClassLibrary
type: Class
subclass of: JavaxImageioClassLibrary
comment: JavaLibrary implementing the javax.imageio package for Java SE 6
comment: platform:implementsInterface some JavaxImageioAPI

JavaxImageioMetadataClassLibrary
type: Class
equivalent class: JavaxImageioMetadataClassLibrary
subclass of: JavaClassLibrary
comment: JavaLibrary implementing the javax.imageio.metadata package for Java SE 6
comment: platform:implementsInterface some JavaxImageioMetadataAPI

JavaxImageioStreamClassLibrary
type: Class
equivalent class: JavaxImageioStreamClassLibrary
subclass of: JavaClassLibrary
comment: JavaLibrary implementing the javax.imageio.stream package for Java SE 6
comment: platform:implementsInterface some JavaxImageioStreamAPI

JavaxImageioSpiClassLibrary
type: Class
equivalent class: JavaxImageioSpiClassLibrary
subclass of: JavaClassLibrary
comment: JavaLibrary implementing the javax.imageio.spi package for Java SE 6
comment: platform:implementsInterface some JavaxImageioSpiAPI

JavaxImageioEventClassLibrary
type: Class
equivalent class: JavaxImageioEventClassLibrary
subclass of: JavaClassLibrary
comment: JavaLibrary implementing the javax.imageio.event package for Java SE 6
comment: platform:implementsInterface some JavaxImageioEventAPI

JavaxImageioPluginsBmpClassLibrary
type: Class
equivalent class: JavaxImageioPluginsBmpClassLibrary
subclass of: JavaClassLibrary
comment: JavaLibrary implementing the javax.imageio.plugins.bmp package for Java SE 6
comment: platform:implementsInterface some JavaxImageioPluginsBmpAPI

JavaxImageioPluginsJpegClassLibrary
type: Class
equivalent class: JavaxImageioPluginsJpegClassLibrary
subclass of: JavaClassLibrary
comment: JavaLibrary implementing the javax.imageio.plugins.jpeg package for Java SE 6
comment: platform:implementsInterface some JavaxImageioPluginsJpegAPI

JavaxJwsClassLibrary
type: Class
subclass of: JavaClassLibrary
comment: JavaLibrary implementing the javax.jws package for Java SE 6
comment: platform:implementsInterface some JavaxJwsAPI

JavaxJwsSoapClassLibrary
type: Class
subclass of: JavaClassLibrary
comment: JavaLibrary implementing the javax.jws.soap package for Java SE 6
comment: platform:implementsInterface some JavaxJwsSoapAPI

JavaxRmiClassLibrary
type: Class
equivalent class: JavaxRmiClassLibrary
subclass of: JavaClassLibrary
comment: JavaLibrary implementing the javax.rmi package for Java SE 6
comment: platform:implementsInterface some JavaxRmiAPI

JavaxRmiCORBAClassLibrary
type: Class
equivalent class: JavaxRmiCORBAClassLibrary
subclass of: JavaClassLibrary
comment: JavaLibrary implementing the javax.rmi.CORBA package for Java SE 6
comment: platform:implementsInterface some JavaxRmiCORBAAPI

JavaxRmiSslClassLibrary
type: Class
equivalent class: JavaxRmiSslClassLibrary
subclass of: JavaClassLibrary
comment: JavaLibrary implementing the javax.rmi.ssl package for Java SE 6
comment: platform:implementsInterface some JavaxRmiSslAPI

JavaxNamingClassLibrary
type: Class
subclass of: JavaxNamingClassLibrary
comment: JavaLibrary implementing the javax.naming package for Java SE 6
comment: platform:implementsInterface some JavaxNamingAPI

JavaxNamingDirectoryClassLibrary
type: Class
subclass of: JavaxNamingDirectoryClassLibrary
comment: JavaLibrary implementing the javax.naming.directory package for Java SE 6
comment: platform:implementsInterface some JavaxNamingDirectoryAPI

JavaxNamingEventClassLibrary
type: Class
equivalent class: JavaxNamingEventClassLibrary
subclass of: JavaClassLibrary
comment: JavaLibrary implementing the javax.naming.event package for Java SE 6
comment: platform:implementsInterface some JavaxNamingEventAPI

JavaxNamingLdapClassLibrary
type: Class
subclass of: JavaxNamingLdapClassLibrary
comment: JavaLibrary implementing the javax.naming.ldap package for Java SE 6
comment: platform:implementsInterface some JavaxNamingLdapAPI

JavaxNamingSpiClassLibrary
type: Class
equivalent class: JavaxNamingSpiClassLibrary
subclass of: JavaClassLibrary
comment: JavaLibrary implementing the javax.naming.spi package for Java SE 6
comment: platform:implementsInterface some JavaxNamingSpiAPI

JavaxPrintClassLibrary
type: Class
equivalent class: JavaxPrintClassLibrary
subclass of: JavaClassLibrary
comment: JavaLibrary implementing the javax.print package for Java SE 6
comment: platform:implementsInterface some JavaxPrintAPI

JavaxPrintAttributeClassLibrary
type: Class
equivalent class: JavaxPrintAttributeClassLibrary
subclass of: JavaClassLibrary
comment: JavaLibrary implementing the javax.print.attribute package for Java SE 6
comment: platform:implementsInterface some JavaxPrintAttributeAPI

JavaxPrintAttributeStandardClassLibrary
type: Class
equivalent class: JavaxPrintAttributeStandardClassLibrary
subclass of: JavaClassLibrary
comment: JavaLibrary implementing the javax.print.attribute.standard package for Java SE 6
comment: platform:implementsInterface some JavaxPrintAttributeStandardAPI

JavaxPrintEventClassLibrary
type: Class
equivalent class: JavaxPrintEventClassLibrary
subclass of: JavaClassLibrary
comment: JavaLibrary implementing the javax.print.event package for Java SE 6
comment: platform:implementsInterface some JavaxPrintEventAPI

JavaxScriptClassLibrary
type: Class
subclass of: JavaClassLibrary
comment: JavaLibrary implementing the javax.script package for Java SE 6
comment: platform:implementsInterface some JavaxScriptAPI

JavaxSmartcardioClassLibrary
type: Class
subclass of: JavaClassLibrary
comment: JavaLibrary implementing the javax.smartcardio package for Java SE 6
comment: platform:implementsInterface some JavaxSmartcardioAPI

JavaxSoundMidiClassLibrary
type: Class
equivalent class: JavaxSoundMidiClassLibrary
subclass of: JavaClassLibrary
comment: JavaLibrary implementing the javax.sound.midi package for Java SE 6
comment: platform:implementsInterface some JavaxSoundMidiAPI

JavaxSoundMidiSpiClassLibrary
type: Class
equivalent class: JavaxSoundMidiSpiClassLibrary
subclass of: JavaClassLibrary
comment: JavaLibrary implementing the javax.sound.midi.spi package for Java SE 6
comment: platform:implementsInterface some JavaxSoundMidiSpiAPI

JavaxSoundSampledClassLibrary
type: Class
equivalent class: JavaxSoundSampledClassLibrary
subclass of: JavaClassLibrary
comment: JavaLibrary implementing the javax.sound.sampled package for Java SE 6
comment: platform:implementsInterface some JavaxSoundSampledAPI

JavaxSoundSampledSpiClassLibrary
type: Class
equivalent class: JavaxSoundSampledSpiClassLibrary
subclass of: JavaClassLibrary
comment: JavaLibrary implementing the javax.sound.sampled.spi package for Java SE 6
comment: platform:implementsInterface some JavaxSoundSampledSpiAPI

JavaxSqlClassLibrary
type: Class
subclass of: JavaxSqlClassLibrary
comment: JavaLibrary implementing the javax.sql package for Java SE 6
comment: platform:implementsInterface some JavaxSqlAPI

JavaxSqlRowsetClassLibrary
type: Class
subclass of: JavaxSqlRowsetClassLibrary
comment: JavaLibrary implementing the javax.sql.rowset package for Java SE 6
comment: platform:implementsInterface some JavaxSqlRowsetAPI

JavaxSqlRowsetSpiClassLibrary
type: Class
subclass of: JavaxSqlRowsetSpiClassLibrary
comment: JavaLibrary implementing the javax.sql.rowset.spi package for Java SE 6
comment: platform:implementsInterface some JavaxSqlRowsetSpiAPI

JavaxSqlRowsetSerialClassLibrary
type: Class
subclass of: JavaxSqlRowsetSerialClassLibrary
comment: JavaLibrary implementing the javax.sql.rowset.serial package for Java SE 6
comment: platform:implementsInterface some JavaxSqlRowsetSerialAPI

JavaxTransactionClassLibrary
type: Class
equivalent class: JavaxTransactionClassLibrary
subclass of: JavaClassLibrary
comment: JavaLibrary implementing the javax.transaction package for Java SE 6
comment: platform:implementsInterface some JavaxTransactionAPI

JavaxTransactionXaClassLibrary
type: Class
equivalent class: JavaxTransactionXaClassLibrary
subclass of: JavaClassLibrary
comment: JavaLibrary implementing the javax.transaction.xa package for Java SE 6
comment: platform:implementsInterface some JavaxTransactionXaAPI

JavaLangClassLibrary
type: Class
subclass of: JavaLangClassLibrary
comment: JavaLibrary implementing the java.lang package for Java SE 6
comment: platform:implementsInterface some JavaLangAPI

JavaLangAnnotationClassLibrary
type: Class
subclass of: JavaLangAnnotationClassLibrary
comment: JavaLibrary implementing the java.lang.annotation package for Java SE 6
comment: platform:implementsInterface some JavaLangAnnotationAPI

JavaLangReflectClassLibrary
type: Class
equivalent class: JavaLangReflectClassLibrary
subclass of: JavaClassLibrary
comment: JavaLibrary implementing the java.lang.reflect package for Java SE 6
comment: platform:implementsInterface some JavaLangReflectAPI

JavaLangInstrumentClassLibrary
type: Class
subclass of: JavaLangInstrumentClassLibrary
comment: JavaLibrary implementing the java.lang.instrument package for Java SE 6
comment: platform:implementsInterface some JavaLangInstrumentAPI

JavaLangManagementClassLibrary
type: Class
subclass of: JavaLangManagementClassLibrary
comment: JavaLibrary implementing the java.lang.management package for Java SE 6
comment: platform:implementsInterface some JavaLangManagementAPI

JavaLangRefClassLibrary
type: Class
equivalent class: JavaLangRefClassLibrary
subclass of: JavaClassLibrary
comment: JavaLibrary implementing the java.lang.ref package for Java SE 6
comment: platform:implementsInterface some JavaLangRefAPI

JavaAwtClassLibrary
type: Class
subclass of: JavaAwtClassLibrary
comment: JavaLibrary implementing the java.awt package for Java SE 6
comment: platform:implementsInterface some JavaAwtAPI

JavaAwtPrintClassLibrary
type: Class
subclass of: JavaAwtPrintClassLibrary
comment: JavaLibrary implementing the java.awt.print package for Java SE 6
comment: platform:implementsInterface some JavaAwtPrintAPI

JavaAwtDatatransferClassLibrary
type: Class
equivalent class: JavaAwtDatatransferClassLibrary
subclass of: JavaClassLibrary
comment: JavaLibrary implementing the java.awt.datatransfer package for Java SE 6
comment: platform:implementsInterface some JavaAwtDatatransferAPI

JavaAwtEventClassLibrary
type: Class
subclass of: JavaAwtEventClassLibrary
comment: JavaLibrary implementing the java.awt.event package for Java SE 6
comment: platform:implementsInterface some JavaAwtEventAPI

JavaAwtImageClassLibrary
type: Class
subclass of: JavaAwtImageClassLibrary
comment: JavaLibrary implementing the java.awt.image package for Java SE 6
comment: platform:implementsInterface some JavaAwtImageAPI

JavaAwtImageRenderableClassLibrary
type: Class
equivalent class: JavaAwtImageRenderableClassLibrary
subclass of: JavaClassLibrary
comment: JavaLibrary implementing the java.awt.image.renderable package for Java SE 6
comment: platform:implementsInterface some JavaAwtImageRenderableAPI

JavaAwtGeomClassLibrary
type: Class
subclass of: JavaClassLibrary
comment: JavaLibrary implementing the java.awt.geom package for Java SE 6
comment: platform:implementsInterface some JavaAwtGeomAPI

JavaAwtImClassLibrary
type: Class
equivalent class: JavaAwtImClassLibrary
subclass of: JavaClassLibrary
comment: JavaLibrary implementing the java.awt.im package for Java SE 6
comment: platform:implementsInterface some JavaAwtImAPI

JavaAwtImSpiClassLibrary
type: Class
equivalent class: JavaAwtImSpiClassLibrary
subclass of: JavaClassLibrary
comment: JavaLibrary implementing the java.awt.im.spi package for Java SE 6
comment: platform:implementsInterface some JavaAwtImSpiAPI

JavaAwtColorClassLibrary
type: Class
equivalent class: JavaAwtColorClassLibrary
subclass of: JavaClassLibrary
comment: JavaLibrary implementing the java.awt.color package for Java SE 6
comment: platform:implementsInterface some JavaAwtColorAPI

JavaAwtDndClassLibrary
type: Class
equivalent class: JavaAwtDndClassLibrary
subclass of: JavaClassLibrary
comment: JavaLibrary implementing the java.awt.dnd package for Java SE 6
comment: platform:implementsInterface some JavaAwtDndAPI

JavaAwtFontClassLibrary
type: Class
subclass of: JavaAwtFontClassLibrary
comment: JavaLibrary implementing the java.awt.font package for Java SE 6
comment: platform:implementsInterface some JavaAwtFontAPI

JavaNetClassLibrary
type: Class
subclass of: JavaNetClassLibrary
comment: JavaLibrary implementing the java.net package for Java SE 6
comment: platform:implementsInterface some JavaNetAPI

JavaIoClassLibrary
type: Class
subclass of: JavaIoClassLibrary
comment: JavaLibrary implementing the java.io package for Java SE 6
comment: platform:implementsInterface some JavaIoAPI

JavaSecurityClassLibrary
type: Class
subclass of: JavaSecurityClassLibrary
comment: JavaLibrary implementing the java.security package for Java SE 6
comment: platform:implementsInterface some JavaSecurityAPI

JavaSecuritySpecClassLibrary
type: Class
equivalent class: JavaSecuritySpecClassLibrary
subclass of: JavaClassLibrary
comment: JavaLibrary implementing the java.security.spec package for Java SE 6
comment: platform:implementsInterface some JavaSecuritySpecAPI

JavaSecurityCertClassLibrary
type: Class
equivalent class: JavaSecurityCertClassLibrary
subclass of: JavaClassLibrary
comment: JavaLibrary implementing the java.security.cert package for Java SE 6
comment: platform:implementsInterface some JavaSecurityCertAPI

JavaSecurityAclClassLibrary
type: Class
equivalent class: JavaSecurityAclClassLibrary
subclass of: JavaClassLibrary
comment: JavaLibrary implementing the java.security.acl package for Java SE 6
comment: platform:implementsInterface some JavaSecurityAclAPI

JavaSecurityInterfacesClassLibrary
type: Class
equivalent class: JavaSecurityInterfacesClassLibrary
subclass of: JavaClassLibrary
comment: JavaLibrary implementing the java.security.interfaces package for Java SE 6
comment: platform:implementsInterface some JavaSecurityInterfacesAPI

JavaMathClassLibrary
type: Class
subclass of: JavaMathClassLibrary
comment: JavaLibrary implementing the java.math package for Java SE 6
comment: platform:implementsInterface some JavaMathAPI

JavaNioClassLibrary
type: Class
subclass of: JavaNioClassLibrary
comment: JavaLibrary implementing the java.nio package for Java SE 6
comment: platform:implementsInterface some JavaNioAPI

JavaNioChannelsClassLibrary
type: Class
equivalent class: JavaNioChannelsClassLibrary
subclass of: JavaClassLibrary
comment: JavaLibrary implementing the java.nio.channels package for Java SE 6
comment: platform:implementsInterface some JavaNioChannelsAPI

JavaNioChannelsSpiClassLibrary
type: Class
equivalent class: JavaNioChannelsSpiClassLibrary
subclass of: JavaClassLibrary
comment: JavaLibrary implementing the java.nio.channels.spi package for Java SE 6
comment: platform:implementsInterface some JavaNioChannelsSpiAPI

JavaNioCharsetClassLibrary
type: Class
equivalent class: JavaNioCharsetClassLibrary
subclass of: JavaClassLibrary
comment: JavaLibrary implementing the java.nio.charset package for Java SE 6
comment: platform:implementsInterface some JavaNioCharsetAPI

JavaNioCharsetSpiClassLibrary
type: Class
equivalent class: JavaNioCharsetSpiClassLibrary
subclass of: JavaClassLibrary
comment: JavaLibrary implementing the java.nio.charset.spi package for Java SE 6
comment: platform:implementsInterface some JavaNioCharsetSpiAPI

JavaUtilClassLibrary
type: Class
subclass of: JavaUtilClassLibrary
comment: JavaLibrary implementing the java.util package for Java SE 6
comment: platform:implementsInterface some JavaUtilAPI

JavaUtilJarClassLibrary
type: Class
equivalent class: JavaUtilJarClassLibrary
subclass of: JavaClassLibrary
comment: JavaLibrary implementing the java.util.jar package for Java SE 6
comment: platform:implementsInterface some JavaUtilJarAPI

JavaUtilSpiClassLibrary
type: Class
subclass of: JavaClassLibrary
comment: JavaLibrary implementing the java.util.spi package for Java SE 6
comment: platform:implementsInterface some JavaUtilSpiAPI

JavaUtilConcurrentClassLibrary
type: Class
subclass of: JavaClassLibrary
comment: JavaLibrary implementing the java.util.concurrent package for Java SE 6
comment: platform:implementsInterface some JavaUtilConcurrentAPI

JavaUtilConcurrentAtomicClassLibrary
type: Class
subclass of: JavaUtilConcurrentAtomicClassLibrary
comment: JavaLibrary implementing the java.util.concurrent.atomic package for Java SE 6
comment: platform:implementsInterface some JavaUtilConcurrentAtomicAPI

JavaUtilConcurrentLocksClassLibrary
type: Class
subclass of: JavaUtilConcurrentLocksClassLibrary
comment: JavaLibrary implementing the java.util.concurrent.locks package for Java SE 6
comment: platform:implementsInterface some JavaUtilConcurrentLocksAPI

JavaUtilZipClassLibrary
type: Class
subclass of: JavaUtilZipClassLibrary
comment: JavaLibrary implementing the java.util.zip package for Java SE 6
comment: platform:implementsInterface some JavaUtilZipAPI

JavaUtilLoggingClassLibrary
type: Class
subclass of: JavaUtilLoggingClassLibrary
comment: JavaLibrary implementing the java.util.logging package for Java SE 6
comment: platform:implementsInterface some JavaUtilLoggingAPI

JavaUtilPrefsClassLibrary
type: Class
equivalent class: JavaUtilPrefsClassLibrary
subclass of: JavaClassLibrary
comment: JavaLibrary implementing the java.util.prefs package for Java SE 6
comment: platform:implementsInterface some JavaUtilPrefsAPI

JavaUtilRegexClassLibrary
type: Class
equivalent class: JavaUtilRegexClassLibrary
subclass of: JavaClassLibrary
comment: JavaLibrary implementing the java.util.regex package for Java SE 6
comment: platform:implementsInterface some JavaUtilRegexAPI

JavaAppletClassLibrary
type: Class
subclass of: JavaAppletClassLibrary
comment: JavaLibrary implementing the java.applet package for Java SE 6
comment: platform:implementsInterface some JavaAppletAPI

JavaBeansClassLibrary
type: Class
subclass of: JavaBeansClassLibrary
comment: JavaLibrary implementing the java.beans package for Java SE 6
comment: platform:implementsInterface some JavaBeansAPI

JavaBeansBeancontextClassLibrary
type: Class
equivalent class: JavaBeansBeancontextClassLibrary
subclass of: JavaClassLibrary
comment: JavaLibrary implementing the java.beans.beancontext package for Java SE 6
comment: platform:implementsInterface some JavaBeansBeancontextAPI

JavaTextClassLibrary
type: Class
subclass of: JavaClassLibrary
comment: JavaLibrary implementing the java.text package for Java SE 6
comment: platform:implementsInterface some JavaTextAPI

JavaTextSpiClassLibrary
type: Class
subclass of: JavaClassLibrary
comment: JavaLibrary implementing the java.text.spi package for Java SE 6
comment: platform:implementsInterface some JavaTextSpiAPI

JavaRmiClassLibrary
type: Class
equivalent class: JavaRmiClassLibrary
subclass of: JavaClassLibrary
comment: JavaLibrary implementing the java.rmi package for Java SE 6
comment: platform:implementsInterface some JavaRmiAPI

JavaRmiActivationClassLibrary
type: Class
equivalent class: JavaRmiActivationClassLibrary
subclass of: JavaClassLibrary
comment: JavaLibrary implementing the java.rmi.activation package for Java SE 6
comment: platform:implementsInterface some JavaRmiActivationAPI

JavaRmiServerClassLibrary
type: Class
subclass of: JavaRmiServerClassLibrary
comment: JavaLibrary implementing the java.rmi.server package for Java SE 6
comment: platform:implementsInterface some JavaRmiServerAPI

JavaRmiDgcClassLibrary
type: Class
equivalent class: JavaRmiDgcClassLibrary
subclass of: JavaClassLibrary
comment: JavaLibrary implementing the java.rmi.dgc package for Java SE 6
comment: platform:implementsInterface some JavaRmiDgcAPI

JavaRmiRegistryClassLibrary
type: Class
equivalent class: JavaRmiRegistryClassLibrary
subclass of: JavaClassLibrary
comment: JavaLibrary implementing the java.rmi.registry package for Java SE 6
comment: platform:implementsInterface some JavaRmiRegistryAPI

JavaSqlClassLibrary
type: Class
subclass of: JavaSqlClassLibrary
comment: JavaLibrary implementing the java.sql package for Java SE 6
comment: platform:implementsInterface some JavaSqlAPI

OrgW3cDomClassLibrary
type: Class
equivalent class: OrgW3cDomClassLibrary
subclass of: JavaClassLibrary
comment: JavaLibrary implementing the org.w3c.dom package for Java SE 6
comment: platform:implementsInterface some OrgW3cDomAPI

OrgW3cDomLsClassLibrary
type: Class
equivalent class: OrgW3cDomLsClassLibrary
subclass of: JavaClassLibrary
comment: JavaLibrary implementing the org.w3c.dom.ls package for Java SE 6
comment: platform:implementsInterface some OrgW3cDomLsAPI

OrgW3cDomBootstrapClassLibrary
type: Class
equivalent class: OrgW3cDomBootstrapClassLibrary
subclass of: JavaClassLibrary
comment: JavaLibrary implementing the org.w3c.dom.bootstrap package for Java SE 6
comment: platform:implementsInterface some OrgW3cDomBootstrapAPI

OrgW3cDomCssClassLibrary
type: Class
equivalent class: OrgW3cDomCssClassLibrary
subclass of: JavaClassLibrary
comment: JavaLibrary implementing the org.w3c.dom.css package for Java SE 6
comment: platform:implementsInterface some OrgW3cDomCssAPI

OrgW3cDomStylesheetsClassLibrary
type: Class
equivalent class: OrgW3cDomStylesheetsClassLibrary
subclass of: JavaClassLibrary
comment: JavaLibrary implementing the org.w3c.dom.stylesheets package for Java SE 6
comment: platform:implementsInterface some OrgW3cDomStylesheetsAPI

OrgW3cDomViewsClassLibrary
type: Class
equivalent class: OrgW3cDomViewsClassLibrary
subclass of: JavaClassLibrary
comment: JavaLibrary implementing the org.w3c.dom.views package for Java SE 6
comment: platform:implementsInterface some OrgW3cDomViewsAPI

OrgW3cDomEventsClassLibrary
type: Class
equivalent class: OrgW3cDomEventsClassLibrary
subclass of: JavaClassLibrary
comment: JavaLibrary implementing the org.w3c.dom.events package for Java SE 6
comment: platform:implementsInterface some OrgW3cDomEventsAPI

OrgW3cDomHtmlClassLibrary
type: Class
equivalent class: OrgW3cDomHtmlClassLibrary
subclass of: JavaClassLibrary
comment: JavaLibrary implementing the org.w3c.dom.html package for Java SE 6
comment: platform:implementsInterface some OrgW3cDomHtmlAPI

OrgW3cDomTraversalClassLibrary
type: Class
equivalent class: OrgW3cDomTraversalClassLibrary
subclass of: JavaClassLibrary
comment: JavaLibrary implementing the org.w3c.dom.traversal package for Java SE 6
comment: platform:implementsInterface some OrgW3cDomTraversalAPI

OrgW3cDomRangesClassLibrary
type: Class
equivalent class: OrgW3cDomRangesClassLibrary
subclass of: JavaClassLibrary
comment: JavaLibrary implementing the org.w3c.dom.ranges package for Java SE 6
comment: platform:implementsInterface some OrgW3cDomRangesAPI

OrgW3cDomXpathClassLibrary
type: Class
subclass of: JavaClassLibrary
comment: JavaLibrary implementing the org.w3c.dom.xpath package for Java SE 6
comment: platform:implementsInterface some OrgW3cDomXpathAPI

OrgOmgCORBA 2 3ClassLibrary
type: Class
equivalent class: OrgOmgCORBA 2 3ClassLibrary
subclass of: JavaClassLibrary
comment: JavaLibrary implementing the org.omg.CORBA_2_3 package for Java SE 6
comment: platform:implementsInterface some OrgOmgCORBA_2_3API

OrgOmgCORBA 2 3PortableClassLibrary
type: Class
equivalent class: OrgOmgCORBA 2 3PortableClassLibrary
subclass of: JavaClassLibrary
comment: JavaLibrary implementing the org.omg.CORBA_2_3.portable package for Java SE 6
comment: platform:implementsInterface some OrgOmgCORBA_2_3PortableAPI

OrgOmgCORBAClassLibrary
type: Class
equivalent class: OrgOmgCORBAClassLibrary
subclass of: JavaClassLibrary
comment: JavaLibrary implementing the org.omg.CORBA package for Java SE 6
comment: platform:implementsInterface some OrgOmgCORBAAPI

OrgOmgCORBAPortableClassLibrary
type: Class
equivalent class: OrgOmgCORBAPortableClassLibrary
subclass of: JavaClassLibrary
comment: JavaLibrary implementing the org.omg.CORBA.portable package for Java SE 6
comment: platform:implementsInterface some OrgOmgCORBAPortableAPI

OrgOmgCORBADynAnyPackageClassLibrary
type: Class
equivalent class: OrgOmgCORBADynAnyPackageClassLibrary
subclass of: JavaClassLibrary
comment: JavaLibrary implementing the org.omg.CORBA.DynAnyPackage package for Java SE 6
comment: platform:implementsInterface some OrgOmgCORBADynAnyPackageAPI

OrgOmgCORBAORBPackageClassLibrary
type: Class
equivalent class: OrgOmgCORBAORBPackageClassLibrary
subclass of: JavaClassLibrary
comment: JavaLibrary implementing the org.omg.CORBA.ORBPackage package for Java SE 6
comment: platform:implementsInterface some OrgOmgCORBAORBPackageAPI

OrgOmgCORBATypeCodePackageClassLibrary
type: Class
equivalent class: OrgOmgCORBATypeCodePackageClassLibrary
subclass of: JavaClassLibrary
comment: JavaLibrary implementing the org.omg.CORBA.TypeCodePackage package for Java SE 6
comment: platform:implementsInterface some OrgOmgCORBATypeCodePackageAPI

OrgOmgSendingContextClassLibrary
type: Class
equivalent class: OrgOmgSendingContextClassLibrary
subclass of: JavaClassLibrary
comment: JavaLibrary implementing the org.omg.SendingContext package for Java SE 6
comment: platform:implementsInterface some OrgOmgSendingContextAPI

OrgOmgCosNamingClassLibrary
type: Class
equivalent class: OrgOmgCosNamingClassLibrary
subclass of: JavaClassLibrary
comment: JavaLibrary implementing the org.omg.CosNaming package for Java SE 6
comment: platform:implementsInterface some OrgOmgCosNamingAPI

OrgOmgCosNamingNamingContextExtPackageClassLibrary
type: Class
equivalent class: OrgOmgCosNamingNamingContextExtPackageClassLibrary
subclass of: JavaClassLibrary
comment: JavaLibrary implementing the org.omg.CosNaming.NamingContextExtPackage package for Java SE 6
comment: platform:implementsInterface some OrgOmgCosNamingNamingContextExtPackageAPI

OrgOmgCosNamingNamingContextPackageClassLibrary
type: Class
equivalent class: OrgOmgCosNamingNamingContextPackageClassLibrary
subclass of: JavaClassLibrary
comment: JavaLibrary implementing the org.omg.CosNaming.NamingContextPackage package for Java SE 6
comment: platform:implementsInterface some OrgOmgCosNamingNamingContextPackageAPI

OrgOmgPortableServerClassLibrary
type: Class
equivalent class: OrgOmgPortableServerClassLibrary
subclass of: JavaClassLibrary
comment: JavaLibrary implementing the org.omg.PortableServer package for Java SE 6
comment: platform:implementsInterface some OrgOmgPortableServerAPI

OrgOmgPortableServerCurrentPackageClassLibrary
type: Class
equivalent class: OrgOmgPortableServerCurrentPackageClassLibrary
subclass of: JavaClassLibrary
comment: JavaLibrary implementing the org.omg.PortableServer.CurrentPackage package for Java SE 6
comment: platform:implementsInterface some OrgOmgPortableServerCurrentPackageAPI

OrgOmgPortableServerPOAManagerPackageClassLibrary
type: Class
equivalent class: OrgOmgPortableServerPOAManagerPackageClassLibrary
subclass of: JavaClassLibrary
comment: JavaLibrary implementing the org.omg.PortableServer.POAManagerPackage package for Java SE 6
comment: platform:implementsInterface some OrgOmgPortableServerPOAManagerPackageAPI

OrgOmgPortableServerPOAPackageClassLibrary
type: Class
equivalent class: OrgOmgPortableServerPOAPackageClassLibrary
subclass of: JavaClassLibrary
comment: JavaLibrary implementing the org.omg.PortableServer.POAPackage package for Java SE 6
comment: platform:implementsInterface some OrgOmgPortableServerPOAPackageAPI

OrgOmgPortableServerPortableClassLibrary
type: Class
equivalent class: OrgOmgPortableServerPortableClassLibrary
subclass of: JavaClassLibrary
comment: JavaLibrary implementing the org.omg.PortableServer.portable package for Java SE 6
comment: platform:implementsInterface some OrgOmgPortableServerPortableAPI

OrgOmgPortableServerServantLocatorPackageClassLibrary
type: Class
equivalent class: OrgOmgPortableServerServantLocatorPackageClassLibrary
subclass of: JavaClassLibrary
comment: JavaLibrary implementing the org.omg.PortableServer.ServantLocatorPackage package for Java SE 6
comment: platform:implementsInterface some OrgOmgPortableServerServantLocatorPackageAPI

OrgOmgDynamicClassLibrary
type: Class
equivalent class: OrgOmgDynamicClassLibrary
subclass of: JavaClassLibrary
comment: JavaLibrary implementing the org.omg.Dynamic package for Java SE 6
comment: platform:implementsInterface some OrgOmgDynamicAPI

OrgOmgDynamicAnyClassLibrary
type: Class
equivalent class: OrgOmgDynamicAnyClassLibrary
subclass of: JavaClassLibrary
comment: JavaLibrary implementing the org.omg.DynamicAny package for Java SE 6
comment: platform:implementsInterface some OrgOmgDynamicAnyAPI

OrgOmgDynamicAnyDynAnyFactoryPackageClassLibrary
type: Class
equivalent class: OrgOmgDynamicAnyDynAnyFactoryPackageClassLibrary
subclass of: JavaClassLibrary
comment: JavaLibrary implementing the org.omg.DynamicAny.DynAnyFactoryPackage package for Java SE 6
comment: platform:implementsInterface some OrgOmgDynamicAnyDynAnyFactoryPackageAPI

OrgOmgDynamicAnyDynAnyPackageClassLibrary
type: Class
equivalent class: OrgOmgDynamicAnyDynAnyPackageClassLibrary
subclass of: JavaClassLibrary
comment: JavaLibrary implementing the org.omg.DynamicAny.DynAnyPackage package for Java SE 6
comment: platform:implementsInterface some OrgOmgDynamicAnyDynAnyPackageAPI

OrgOmgIOPClassLibrary
type: Class
equivalent class: OrgOmgIOPClassLibrary
subclass of: JavaClassLibrary
comment: JavaLibrary implementing the org.omg.IOP package for Java SE 6
comment: platform:implementsInterface some OrgOmgIOPAPI

OrgOmgIOPCodecFactoryPackageClassLibrary
type: Class
equivalent class: OrgOmgIOPCodecFactoryPackageClassLibrary
subclass of: JavaClassLibrary
comment: JavaLibrary implementing the org.omg.IOP.CodecFactoryPackage package for Java SE 6
comment: platform:implementsInterface some OrgOmgIOPCodecFactoryPackageAPI

OrgOmgIOPCodecPackageClassLibrary
type: Class
equivalent class: OrgOmgIOPCodecPackageClassLibrary
subclass of: JavaClassLibrary
comment: JavaLibrary implementing the org.omg.IOP.CodecPackage package for Java SE 6
comment: platform:implementsInterface some OrgOmgIOPCodecPackageAPI

OrgOmgMessagingClassLibrary
type: Class
equivalent class: OrgOmgMessagingClassLibrary
subclass of: JavaClassLibrary
comment: JavaLibrary implementing the org.omg.Messaging package for Java SE 6
comment: platform:implementsInterface some OrgOmgMessagingAPI

OrgOmgPortableInterceptorClassLibrary
type: Class
equivalent class: OrgOmgPortableInterceptorClassLibrary
subclass of: JavaClassLibrary
comment: JavaLibrary implementing the org.omg.PortableInterceptor package for Java SE 6
comment: platform:implementsInterface some OrgOmgPortableInterceptorAPI

OrgOmgPortableInterceptorORBInitInfoPackageClassLibrary
type: Class
equivalent class: OrgOmgPortableInterceptorORBInitInfoPackageClassLibrary
subclass of: JavaClassLibrary
comment: JavaLibrary implementing the org.omg.PortableInterceptor.ORBInitInfoPackage package for Java SE 6
comment: platform:implementsInterface some OrgOmgPortableInterceptorORBInitInfoPackageAPI

OrgOmgStubJavaRmiClassLibrary
type: Class
equivalent class: OrgOmgStubJavaRmiClassLibrary
subclass of: JavaClassLibrary
comment: JavaLibrary implementing the org.omg.stub.java.rmi package for Java SE 6
comment: platform:implementsInterface some OrgOmgStubJavaRmiAPI

OrgOmgStubJavaxManagementRemoteRmiClassLibrary
type: Class
equivalent class: OrgOmgStubJavaxManagementRemoteRmiClassLibrary
subclass of: JavaClassLibrary
comment: JavaLibrary implementing the org.omg.stub.javax.management.remote.rmi package for Java SE 6
comment: platform:implementsInterface some OrgOmgStubJavaxManagementRemoteRmiAPI

OrgXmlSaxClassLibrary
type: Class
equivalent class: OrgXmlSaxClassLibrary
subclass of: JavaClassLibrary
comment: JavaLibrary implementing the org.xml.sax package for Java SE 6
comment: platform:implementsInterface some OrgXmlSaxAPI

OrgXmlSaxHelpersClassLibrary
type: Class
equivalent class: OrgXmlSaxHelpersClassLibrary
subclass of: JavaClassLibrary
comment: JavaLibrary implementing the org.xml.sax.helpers package for Java SE 6
comment: platform:implementsInterface some OrgXmlSaxHelpersAPI

OrgXmlSaxExtClassLibrary
type: Class
equivalent class: OrgXmlSaxExtClassLibrary
subclass of: JavaClassLibrary
comment: JavaLibrary implementing the org.xml.sax.ext package for Java SE 6
comment: platform:implementsInterface some OrgXmlSaxExtAPI

OrgIetfJgssClassLibrary
type: Class
equivalent class: OrgIetfJgssClassLibrary
subclass of: JavaClassLibrary
comment: JavaLibrary implementing the org.ietf.jgss package for Java SE 6
comment: platform:implementsInterface some OrgIetfJgssAPI