SWT 3.4
type: Ontology
version info: $Id: UML2ToPackageAPIOntology.atl 8082 2010-03-18 21:11:00Z dwagelaa $
imports: platform.owl
imports: java.owl
imports: swt-3 3.owl#
imports: isa.owl
comment: Generated by [UML2ToSimplifiedPackageAPIOntology.atl 8080 2010-03-18 10:46:40Z dwagelaa], [UML2ToPackageAPIOntology.atl 8082 2010-03-18 21:11:00Z dwagelaa], [UML2ToAPIOntology.atl 8086 2010-03-19 09:49:17Z dwagelaa], and [UML2Comparison.atl 8086 2010-03-19 09:49:17Z dwagelaa]
comment: Dennis Wagelaar <dennis.wagelaar@vub.ac.be>
comment: © 2010, Vrije Universiteit Brussel. All rights reserved.

SWT3 4API
type: Class
subclass of: OrgEclipseSwtAPI
subclass of: OrgEclipseSwtAccessibilityAPI
subclass of: OrgEclipseSwtWidgetsAPI
subclass of: OrgEclipseSwtAwtAPI
subclass of: OrgEclipseSwtBrowserAPI
subclass of: OrgEclipseSwtEventsAPI
subclass of: OrgEclipseSwtGraphicsAPI
subclass of: OrgEclipseSwtCustomAPI
subclass of: OrgEclipseSwtPrintingAPI
subclass of: OrgEclipseSwtDndAPI
subclass of: OrgEclipseSwtLayoutAPI
subclass of: OrgEclipseSwtOpenglAPI
subclass of: OrgEclipseSwtProgramAPI
subclass of: SWT3 3API
comment: SWT 3.4 API
comment: platform:comprisesInterfacePart some OrgEclipseSwt and platform:comprisesInterfacePart some OrgEclipseSwtAccessibility and platform:comprisesInterfacePart some OrgEclipseSwtWidgets and platform:comprisesInterfacePart some OrgEclipseSwtAwt and platform:comprisesInterfacePart some OrgEclipseSwtBrowser and platform:comprisesInterfacePart some OrgEclipseSwtEvents and platform:comprisesInterfacePart some OrgEclipseSwtGraphics and platform:comprisesInterfacePart some OrgEclipseSwtCustom and platform:comprisesInterfacePart some OrgEclipseSwtPrinting and platform:comprisesInterfacePart some OrgEclipseSwtDnd and platform:comprisesInterfacePart some OrgEclipseSwtLayout and platform:comprisesInterfacePart some OrgEclipseSwtOpengl and platform:comprisesInterfacePart some OrgEclipseSwtProgram

SWT3 4ClassLibrary
type: Class
subclass of: OrgEclipseSwtClassLibrary
subclass of: OrgEclipseSwtAccessibilityClassLibrary
subclass of: OrgEclipseSwtWidgetsClassLibrary
subclass of: OrgEclipseSwtAwtClassLibrary
subclass of: OrgEclipseSwtBrowserClassLibrary
subclass of: OrgEclipseSwtEventsClassLibrary
subclass of: OrgEclipseSwtGraphicsClassLibrary
subclass of: OrgEclipseSwtCustomClassLibrary
subclass of: OrgEclipseSwtPrintingClassLibrary
subclass of: OrgEclipseSwtDndClassLibrary
subclass of: OrgEclipseSwtLayoutClassLibrary
subclass of: OrgEclipseSwtOpenglClassLibrary
subclass of: OrgEclipseSwtProgramClassLibrary
subclass of: SWT3 3ClassLibrary
comment: Java class library implementing the SWT 3.4 API
comment: platform:implementsInterface some SWT3_4API

SWT3 4BytecodeFormat
type: Class
equivalent class: SWT3 3BytecodeFormat
subclass of: JavaBytecode
comment: SWT 3.4 bytecode format
comment: java:majorVersionNumber some xsd:integer[>="46"^^xsd:integer] and java:preverified value false

theSWT3 4BytecodeFormat
type: SWT3 4BytecodeFormat
preverified: false
minor version number: 0
major version number: 46

SWT3 4VM
type: Class
equivalent class: Restriction
  on property: implementsInterface
  some values from: SWT3 4BytecodeFormat
subclass of: JavaVM
comment: SWT 3.4 virtual machine

SWT3 4JRE
type: Class
equivalent class: Class
  intersection of: Restriction
    on property: providesFeature
    some values from: SWT3 4ClassLibrary
  intersection of: Restriction
    on property: providesFeature
    some values from: SWT3 4VM
subclass of: JRE
comment: SWT 3.4 Java Runtime Environment

OrgEclipseSwt
type: Class
subclass of: OrgEclipseSwt
comment: Java API part implementing the org.eclipse.swt package for SWT 3.4

OrgEclipseSwtAccessibility
type: Class
equivalent class: OrgEclipseSwtAccessibility
subclass of: JavaAPIPart
comment: Java API part implementing the org.eclipse.swt.accessibility package for SWT 3.4

OrgEclipseSwtWidgets
type: Class
subclass of: OrgEclipseSwtWidgets
comment: Java API part implementing the org.eclipse.swt.widgets package for SWT 3.4

OrgEclipseSwtAwt
type: Class
equivalent class: OrgEclipseSwtAwt
subclass of: JavaAPIPart
comment: Java API part implementing the org.eclipse.swt.awt package for SWT 3.4

OrgEclipseSwtBrowser
type: Class
subclass of: OrgEclipseSwtBrowser
comment: Java API part implementing the org.eclipse.swt.browser package for SWT 3.4

OrgEclipseSwtEvents
type: Class
equivalent class: OrgEclipseSwtEvents
subclass of: JavaAPIPart
comment: Java API part implementing the org.eclipse.swt.events package for SWT 3.4

OrgEclipseSwtGraphics
type: Class
subclass of: OrgEclipseSwtGraphics
comment: Java API part implementing the org.eclipse.swt.graphics package for SWT 3.4

OrgEclipseSwtCustom
type: Class
subclass of: OrgEclipseSwtCustom
comment: Java API part implementing the org.eclipse.swt.custom package for SWT 3.4

OrgEclipseSwtPrinting
type: Class
subclass of: OrgEclipseSwtPrinting
comment: Java API part implementing the org.eclipse.swt.printing package for SWT 3.4

OrgEclipseSwtDnd
type: Class
subclass of: OrgEclipseSwtDnd
comment: Java API part implementing the org.eclipse.swt.dnd package for SWT 3.4

OrgEclipseSwtLayout
type: Class
subclass of: OrgEclipseSwtLayout
comment: Java API part implementing the org.eclipse.swt.layout package for SWT 3.4

OrgEclipseSwtOpengl
type: Class
subclass of: OrgEclipseSwtOpengl
comment: Java API part implementing the org.eclipse.swt.opengl package for SWT 3.4

OrgEclipseSwtProgram
type: Class
equivalent class: OrgEclipseSwtProgram
subclass of: JavaAPIPart
comment: Java API part implementing the org.eclipse.swt.program package for SWT 3.4

OrgEclipseSwtAPI
type: Class
subclass of: OrgEclipseSwtAPI
comment: JavaLibrary implementing the org.eclipse.swt package for SWT 3.4
comment: platform:comprisesInterfacePart some OrgEclipseSwt

OrgEclipseSwtAccessibilityAPI
type: Class
equivalent class: OrgEclipseSwtAccessibilityAPI
subclass of: JavaAPI
comment: JavaLibrary implementing the org.eclipse.swt.accessibility package for SWT 3.4
comment: platform:comprisesInterfacePart some OrgEclipseSwtAccessibility

OrgEclipseSwtWidgetsAPI
type: Class
subclass of: OrgEclipseSwtWidgetsAPI
comment: JavaLibrary implementing the org.eclipse.swt.widgets package for SWT 3.4
comment: platform:comprisesInterfacePart some OrgEclipseSwtWidgets

OrgEclipseSwtAwtAPI
type: Class
equivalent class: OrgEclipseSwtAwtAPI
subclass of: JavaAPI
comment: JavaLibrary implementing the org.eclipse.swt.awt package for SWT 3.4
comment: platform:comprisesInterfacePart some OrgEclipseSwtAwt

OrgEclipseSwtBrowserAPI
type: Class
subclass of: OrgEclipseSwtBrowserAPI
comment: JavaLibrary implementing the org.eclipse.swt.browser package for SWT 3.4
comment: platform:comprisesInterfacePart some OrgEclipseSwtBrowser

OrgEclipseSwtEventsAPI
type: Class
equivalent class: OrgEclipseSwtEventsAPI
subclass of: JavaAPI
comment: JavaLibrary implementing the org.eclipse.swt.events package for SWT 3.4
comment: platform:comprisesInterfacePart some OrgEclipseSwtEvents

OrgEclipseSwtGraphicsAPI
type: Class
subclass of: OrgEclipseSwtGraphicsAPI
comment: JavaLibrary implementing the org.eclipse.swt.graphics package for SWT 3.4
comment: platform:comprisesInterfacePart some OrgEclipseSwtGraphics

OrgEclipseSwtCustomAPI
type: Class
subclass of: OrgEclipseSwtCustomAPI
comment: JavaLibrary implementing the org.eclipse.swt.custom package for SWT 3.4
comment: platform:comprisesInterfacePart some OrgEclipseSwtCustom

OrgEclipseSwtPrintingAPI
type: Class
subclass of: OrgEclipseSwtPrintingAPI
comment: JavaLibrary implementing the org.eclipse.swt.printing package for SWT 3.4
comment: platform:comprisesInterfacePart some OrgEclipseSwtPrinting

OrgEclipseSwtDndAPI
type: Class
subclass of: OrgEclipseSwtDndAPI
comment: JavaLibrary implementing the org.eclipse.swt.dnd package for SWT 3.4
comment: platform:comprisesInterfacePart some OrgEclipseSwtDnd

OrgEclipseSwtLayoutAPI
type: Class
subclass of: OrgEclipseSwtLayoutAPI
comment: JavaLibrary implementing the org.eclipse.swt.layout package for SWT 3.4
comment: platform:comprisesInterfacePart some OrgEclipseSwtLayout

OrgEclipseSwtOpenglAPI
type: Class
subclass of: OrgEclipseSwtOpenglAPI
comment: JavaLibrary implementing the org.eclipse.swt.opengl package for SWT 3.4
comment: platform:comprisesInterfacePart some OrgEclipseSwtOpengl

OrgEclipseSwtProgramAPI
type: Class
equivalent class: OrgEclipseSwtProgramAPI
subclass of: JavaAPI
comment: JavaLibrary implementing the org.eclipse.swt.program package for SWT 3.4
comment: platform:comprisesInterfacePart some OrgEclipseSwtProgram

OrgEclipseSwtClassLibrary
type: Class
subclass of: OrgEclipseSwtClassLibrary
comment: JavaLibrary implementing the org.eclipse.swt package for SWT 3.4
comment: platform:implementsInterface some OrgEclipseSwtAPI

OrgEclipseSwtAccessibilityClassLibrary
type: Class
equivalent class: OrgEclipseSwtAccessibilityClassLibrary
subclass of: JavaClassLibrary
comment: JavaLibrary implementing the org.eclipse.swt.accessibility package for SWT 3.4
comment: platform:implementsInterface some OrgEclipseSwtAccessibilityAPI

OrgEclipseSwtWidgetsClassLibrary
type: Class
subclass of: OrgEclipseSwtWidgetsClassLibrary
comment: JavaLibrary implementing the org.eclipse.swt.widgets package for SWT 3.4
comment: platform:implementsInterface some OrgEclipseSwtWidgetsAPI

OrgEclipseSwtAwtClassLibrary
type: Class
equivalent class: OrgEclipseSwtAwtClassLibrary
subclass of: JavaClassLibrary
comment: JavaLibrary implementing the org.eclipse.swt.awt package for SWT 3.4
comment: platform:implementsInterface some OrgEclipseSwtAwtAPI

OrgEclipseSwtBrowserClassLibrary
type: Class
subclass of: OrgEclipseSwtBrowserClassLibrary
comment: JavaLibrary implementing the org.eclipse.swt.browser package for SWT 3.4
comment: platform:implementsInterface some OrgEclipseSwtBrowserAPI

OrgEclipseSwtEventsClassLibrary
type: Class
equivalent class: OrgEclipseSwtEventsClassLibrary
subclass of: JavaClassLibrary
comment: JavaLibrary implementing the org.eclipse.swt.events package for SWT 3.4
comment: platform:implementsInterface some OrgEclipseSwtEventsAPI

OrgEclipseSwtGraphicsClassLibrary
type: Class
subclass of: OrgEclipseSwtGraphicsClassLibrary
comment: JavaLibrary implementing the org.eclipse.swt.graphics package for SWT 3.4
comment: platform:implementsInterface some OrgEclipseSwtGraphicsAPI

OrgEclipseSwtCustomClassLibrary
type: Class
subclass of: OrgEclipseSwtCustomClassLibrary
comment: JavaLibrary implementing the org.eclipse.swt.custom package for SWT 3.4
comment: platform:implementsInterface some OrgEclipseSwtCustomAPI

OrgEclipseSwtPrintingClassLibrary
type: Class
subclass of: OrgEclipseSwtPrintingClassLibrary
comment: JavaLibrary implementing the org.eclipse.swt.printing package for SWT 3.4
comment: platform:implementsInterface some OrgEclipseSwtPrintingAPI

OrgEclipseSwtDndClassLibrary
type: Class
subclass of: OrgEclipseSwtDndClassLibrary
comment: JavaLibrary implementing the org.eclipse.swt.dnd package for SWT 3.4
comment: platform:implementsInterface some OrgEclipseSwtDndAPI

OrgEclipseSwtLayoutClassLibrary
type: Class
subclass of: OrgEclipseSwtLayoutClassLibrary
comment: JavaLibrary implementing the org.eclipse.swt.layout package for SWT 3.4
comment: platform:implementsInterface some OrgEclipseSwtLayoutAPI

OrgEclipseSwtOpenglClassLibrary
type: Class
subclass of: OrgEclipseSwtOpenglClassLibrary
comment: JavaLibrary implementing the org.eclipse.swt.opengl package for SWT 3.4
comment: platform:implementsInterface some OrgEclipseSwtOpenglAPI

OrgEclipseSwtProgramClassLibrary
type: Class
equivalent class: OrgEclipseSwtProgramClassLibrary
subclass of: JavaClassLibrary
comment: JavaLibrary implementing the org.eclipse.swt.program package for SWT 3.4
comment: platform:implementsInterface some OrgEclipseSwtProgramAPI