J2SE 1.3
type: Ontology
version info: $Id$
creator: Dennis Wagelaar <dennis.wagelaar@vub.ac.be>
comment: Generated by [UML2ToSimplifiedPackageAPIOntology.atl 8080 2010-03-18 10:46:40Z dwagelaa], [UML2ToPackageAPIOntology.atl 8082 2010-03-18 21:11:00Z dwagelaa], [UML2ToAPIOntology.atl 8082 2010-03-18 21:11:00Z dwagelaa], and [UML2Comparison.atl 8082 2010-03-18 21:11:00Z dwagelaa]
rights: © 2010, Vrije Universiteit Brussel. All rights reserved.
imports: isa.owl
imports: j2me-pp-1 0.owl
imports: j2se-1 2.owl
imports: java.owl
imports: platform.owl

J2SE1 3API
type: Class
subclass of: JavaAppletAPI
subclass of: JavaAwtAPI
subclass of: JavaAwtColorAPI
subclass of: JavaAwtDatatransferAPI
subclass of: JavaAwtDndAPI
subclass of: JavaAwtEventAPI
subclass of: JavaAwtFontAPI
subclass of: JavaAwtGeomAPI
subclass of: JavaAwtImAPI
subclass of: JavaAwtImSpiAPI
subclass of: JavaAwtImageAPI
subclass of: JavaAwtImageRenderableAPI
subclass of: JavaAwtPrintAPI
subclass of: JavaBeansAPI
subclass of: JavaBeansBeancontextAPI
subclass of: JavaIoAPI
subclass of: JavaLangAPI
subclass of: JavaLangRefAPI
subclass of: JavaLangReflectAPI
subclass of: JavaMathAPI
subclass of: JavaNetAPI
subclass of: JavaRmiAPI
subclass of: JavaRmiActivationAPI
subclass of: JavaRmiDgcAPI
subclass of: JavaRmiRegistryAPI
subclass of: JavaRmiServerAPI
subclass of: JavaSecurityAPI
subclass of: JavaSecurityAclAPI
subclass of: JavaSecurityCertAPI
subclass of: JavaSecurityInterfacesAPI
subclass of: JavaSecuritySpecAPI
subclass of: JavaSqlAPI
subclass of: JavaTextAPI
subclass of: JavaTextResourcesAPI
subclass of: JavaUtilAPI
subclass of: JavaUtilJarAPI
subclass of: JavaUtilZipAPI
subclass of: JavaxAccessibilityAPI
subclass of: JavaxNamingAPI
subclass of: JavaxNamingDirectoryAPI
subclass of: JavaxNamingEventAPI
subclass of: JavaxNamingLdapAPI
subclass of: JavaxNamingSpiAPI
subclass of: JavaxRmiAPI
subclass of: JavaxRmiCORBAAPI
subclass of: JavaxSoundMidiAPI
subclass of: JavaxSoundMidiSpiAPI
subclass of: JavaxSoundSampledAPI
subclass of: JavaxSoundSampledSpiAPI
subclass of: JavaxSwingAPI
subclass of: JavaxSwingBorderAPI
subclass of: JavaxSwingColorchooserAPI
subclass of: JavaxSwingEventAPI
subclass of: JavaxSwingFilechooserAPI
subclass of: JavaxSwingPlafAPI
subclass of: JavaxSwingPlafBasicAPI
subclass of: JavaxSwingPlafMetalAPI
subclass of: JavaxSwingPlafMultiAPI
subclass of: JavaxSwingTableAPI
subclass of: JavaxSwingTextAPI
subclass of: JavaxSwingTextHtmlAPI
subclass of: JavaxSwingTextHtmlParserAPI
subclass of: JavaxSwingTextRtfAPI
subclass of: JavaxSwingTreeAPI
subclass of: JavaxSwingUndoAPI
subclass of: JavaxTransactionAPI
subclass of: OrgOmgCORBAAPI
subclass of: OrgOmgCORBADynAnyPackageAPI
subclass of: OrgOmgCORBAORBPackageAPI
subclass of: OrgOmgCORBAPortableAPI
subclass of: OrgOmgCORBATypeCodePackageAPI
subclass of: OrgOmgCORBA 2 3API
subclass of: OrgOmgCORBA 2 3PortableAPI
subclass of: OrgOmgCosNamingAPI
subclass of: OrgOmgCosNamingNamingContextPackageAPI
subclass of: OrgOmgSendingContextAPI
subclass of: OrgOmgStubJavaRmiAPI
comment: platform:comprisesInterfacePart some JavaIo and platform:comprisesInterfacePart some JavaLang and platform:comprisesInterfacePart some JavaLangReflect and platform:comprisesInterfacePart some JavaLangRef and platform:comprisesInterfacePart some JavaNet and platform:comprisesInterfacePart some JavaSecurity and platform:comprisesInterfacePart some JavaSecurityCert and platform:comprisesInterfacePart some JavaSecuritySpec and platform:comprisesInterfacePart some JavaSecurityInterfaces and platform:comprisesInterfacePart some JavaSecurityAcl and platform:comprisesInterfacePart some JavaUtil and platform:comprisesInterfacePart some JavaUtilJar and platform:comprisesInterfacePart some JavaUtilZip and platform:comprisesInterfacePart some JavaMath and platform:comprisesInterfacePart some JavaText and platform:comprisesInterfacePart some JavaTextResources and platform:comprisesInterfacePart some JavaAwt and platform:comprisesInterfacePart some JavaAwtGeom and platform:comprisesInterfacePart some JavaAwtEvent and platform:comprisesInterfacePart some JavaAwtFont and platform:comprisesInterfacePart some JavaAwtImage and platform:comprisesInterfacePart some JavaAwtImageRenderable and platform:comprisesInterfacePart some JavaAwtDnd and platform:comprisesInterfacePart some JavaAwtIm and platform:comprisesInterfacePart some JavaAwtImSpi and platform:comprisesInterfacePart some JavaAwtColor and platform:comprisesInterfacePart some JavaAwtDatatransfer and platform:comprisesInterfacePart some JavaAwtPrint and platform:comprisesInterfacePart some JavaBeans and platform:comprisesInterfacePart some JavaBeansBeancontext and platform:comprisesInterfacePart some JavaApplet and platform:comprisesInterfacePart some JavaRmi and platform:comprisesInterfacePart some JavaRmiServer and platform:comprisesInterfacePart some JavaRmiDgc and platform:comprisesInterfacePart some JavaRmiRegistry and platform:comprisesInterfacePart some JavaRmiActivation and platform:comprisesInterfacePart some JavaSql an…
comment: J2SE 1.3 API

J2SE1 3BytecodeFormat
type: Class
equivalent class: Class
  intersection of: Restriction
    on property: majorVersionNumber
    some values from: Datatype
      on datatype: integer
      with restrictions:
        min inclusive: 47
  intersection of: Restriction
    on property: preverified
    has value: false
subclass of: J2SE1 2BytecodeFormat
comment: J2SE 1.3 bytecode format

J2SE1 3ClassLibrary
type: Class
subclass of: JavaAppletClassLibrary
subclass of: JavaAwtClassLibrary
subclass of: JavaAwtColorClassLibrary
subclass of: JavaAwtDatatransferClassLibrary
subclass of: JavaAwtDndClassLibrary
subclass of: JavaAwtEventClassLibrary
subclass of: JavaAwtFontClassLibrary
subclass of: JavaAwtGeomClassLibrary
subclass of: JavaAwtImClassLibrary
subclass of: JavaAwtImSpiClassLibrary
subclass of: JavaAwtImageClassLibrary
subclass of: JavaAwtImageRenderableClassLibrary
subclass of: JavaAwtPrintClassLibrary
subclass of: JavaBeansBeancontextClassLibrary
subclass of: JavaBeansClassLibrary
subclass of: JavaIoClassLibrary
subclass of: JavaLangClassLibrary
subclass of: JavaLangRefClassLibrary
subclass of: JavaLangReflectClassLibrary
subclass of: JavaMathClassLibrary
subclass of: JavaNetClassLibrary
subclass of: JavaRmiActivationClassLibrary
subclass of: JavaRmiClassLibrary
subclass of: JavaRmiDgcClassLibrary
subclass of: JavaRmiRegistryClassLibrary
subclass of: JavaRmiServerClassLibrary
subclass of: JavaSecurityAclClassLibrary
subclass of: JavaSecurityCertClassLibrary
subclass of: JavaSecurityClassLibrary
subclass of: JavaSecurityInterfacesClassLibrary
subclass of: JavaSecuritySpecClassLibrary
subclass of: JavaSqlClassLibrary
subclass of: JavaTextClassLibrary
subclass of: JavaTextResourcesClassLibrary
subclass of: JavaUtilClassLibrary
subclass of: JavaUtilJarClassLibrary
subclass of: JavaUtilZipClassLibrary
subclass of: JavaxAccessibilityClassLibrary
subclass of: JavaxNamingClassLibrary
subclass of: JavaxNamingDirectoryClassLibrary
subclass of: JavaxNamingEventClassLibrary
subclass of: JavaxNamingLdapClassLibrary
subclass of: JavaxNamingSpiClassLibrary
subclass of: JavaxRmiCORBAClassLibrary
subclass of: JavaxRmiClassLibrary
subclass of: JavaxSoundMidiClassLibrary
subclass of: JavaxSoundMidiSpiClassLibrary
subclass of: JavaxSoundSampledClassLibrary
subclass of: JavaxSoundSampledSpiClassLibrary
subclass of: JavaxSwingBorderClassLibrary
subclass of: JavaxSwingClassLibrary
subclass of: JavaxSwingColorchooserClassLibrary
subclass of: JavaxSwingEventClassLibrary
subclass of: JavaxSwingFilechooserClassLibrary
subclass of: JavaxSwingPlafBasicClassLibrary
subclass of: JavaxSwingPlafClassLibrary
subclass of: JavaxSwingPlafMetalClassLibrary
subclass of: JavaxSwingPlafMultiClassLibrary
subclass of: JavaxSwingTableClassLibrary
subclass of: JavaxSwingTextClassLibrary
subclass of: JavaxSwingTextHtmlClassLibrary
subclass of: JavaxSwingTextHtmlParserClassLibrary
subclass of: JavaxSwingTextRtfClassLibrary
subclass of: JavaxSwingTreeClassLibrary
subclass of: JavaxSwingUndoClassLibrary
subclass of: JavaxTransactionClassLibrary
subclass of: OrgOmgCORBAClassLibrary
subclass of: OrgOmgCORBADynAnyPackageClassLibrary
subclass of: OrgOmgCORBAORBPackageClassLibrary
subclass of: OrgOmgCORBAPortableClassLibrary
subclass of: OrgOmgCORBATypeCodePackageClassLibrary
subclass of: OrgOmgCORBA 2 3ClassLibrary
subclass of: OrgOmgCORBA 2 3PortableClassLibrary
subclass of: OrgOmgCosNamingClassLibrary
subclass of: OrgOmgCosNamingNamingContextPackageClassLibrary
subclass of: OrgOmgSendingContextClassLibrary
subclass of: OrgOmgStubJavaRmiClassLibrary
comment: platform:implementsInterface some J2SE1_3API
comment: Java class library implementing the J2SE 1.3 API

J2SE1 3JRE
type: Class
equivalent class: Class
  intersection of: Restriction
    on property: providesFeature
    some values from: J2SE1 3ClassLibrary
  intersection of: Restriction
    on property: providesFeature
    some values from: J2SE1 3VM
subclass of: JRE
comment: J2SE 1.3 Java Runtime Environment

J2SE1 3VM
type: Class
equivalent class: Restriction
  on property: implementsInterface
  some values from: J2SE1 3BytecodeFormat
subclass of: JavaVM
comment: J2SE 1.3 virtual machine

JavaApplet
type: Class
subclass of: JavaApplet
comment: Java API part implementing the java.applet package for J2SE 1.3

JavaAppletAPI
type: Class
subclass of: JavaAppletAPI
comment: platform:comprisesInterfacePart some JavaApplet
comment: JavaLibrary implementing the java.applet package for J2SE 1.3

JavaAppletClassLibrary
type: Class
subclass of: JavaAppletClassLibrary
comment: platform:implementsInterface some JavaAppletAPI
comment: JavaLibrary implementing the java.applet package for J2SE 1.3

JavaAwt
type: Class
subclass of: JavaAwt
comment: Java API part implementing the java.awt package for J2SE 1.3

JavaAwtAPI
type: Class
subclass of: JavaAwtAPI
comment: platform:comprisesInterfacePart some JavaAwt
comment: JavaLibrary implementing the java.awt package for J2SE 1.3

JavaAwtClassLibrary
type: Class
subclass of: JavaAwtClassLibrary
comment: platform:implementsInterface some JavaAwtAPI
comment: JavaLibrary implementing the java.awt package for J2SE 1.3

JavaAwtColor
type: Class
subclass of: JavaAwtColor
comment: Java API part implementing the java.awt.color package for J2SE 1.3

JavaAwtColorAPI
type: Class
subclass of: JavaAwtColorAPI
comment: platform:comprisesInterfacePart some JavaAwtColor
comment: JavaLibrary implementing the java.awt.color package for J2SE 1.3

JavaAwtColorClassLibrary
type: Class
subclass of: JavaAwtColorClassLibrary
comment: platform:implementsInterface some JavaAwtColorAPI
comment: JavaLibrary implementing the java.awt.color package for J2SE 1.3

JavaAwtDatatransfer
type: Class
subclass of: JavaAwtDatatransfer
comment: Java API part implementing the java.awt.datatransfer package for J2SE 1.3

JavaAwtDatatransferAPI
type: Class
subclass of: JavaAwtDatatransferAPI
comment: platform:comprisesInterfacePart some JavaAwtDatatransfer
comment: JavaLibrary implementing the java.awt.datatransfer package for J2SE 1.3

JavaAwtDatatransferClassLibrary
type: Class
subclass of: JavaAwtDatatransferClassLibrary
comment: platform:implementsInterface some JavaAwtDatatransferAPI
comment: JavaLibrary implementing the java.awt.datatransfer package for J2SE 1.3

JavaAwtDnd
type: Class
subclass of: JavaAPIPart
comment: Java API part implementing the java.awt.dnd package for J2SE 1.3

JavaAwtDndAPI
type: Class
subclass of: JavaAPI
comment: platform:comprisesInterfacePart some JavaAwtDnd
comment: JavaLibrary implementing the java.awt.dnd package for J2SE 1.3

JavaAwtDndClassLibrary
type: Class
subclass of: JavaClassLibrary
comment: platform:implementsInterface some JavaAwtDndAPI
comment: JavaLibrary implementing the java.awt.dnd package for J2SE 1.3

JavaAwtEvent
type: Class
subclass of: JavaAwtEvent
comment: Java API part implementing the java.awt.event package for J2SE 1.3

JavaAwtEventAPI
type: Class
subclass of: JavaAwtEventAPI
comment: platform:comprisesInterfacePart some JavaAwtEvent
comment: JavaLibrary implementing the java.awt.event package for J2SE 1.3

JavaAwtEventClassLibrary
type: Class
subclass of: JavaAwtEventClassLibrary
comment: platform:implementsInterface some JavaAwtEventAPI
comment: JavaLibrary implementing the java.awt.event package for J2SE 1.3

JavaAwtFont
type: Class
subclass of: JavaAPIPart
comment: Java API part implementing the java.awt.font package for J2SE 1.3

JavaAwtFontAPI
type: Class
subclass of: JavaAPI
comment: platform:comprisesInterfacePart some JavaAwtFont
comment: JavaLibrary implementing the java.awt.font package for J2SE 1.3

JavaAwtFontClassLibrary
type: Class
subclass of: JavaClassLibrary
comment: platform:implementsInterface some JavaAwtFontAPI
comment: JavaLibrary implementing the java.awt.font package for J2SE 1.3

JavaAwtGeom
type: Class
subclass of: JavaAwtGeom
comment: Java API part implementing the java.awt.geom package for J2SE 1.3

JavaAwtGeomAPI
type: Class
subclass of: JavaAwtGeomAPI
comment: platform:comprisesInterfacePart some JavaAwtGeom
comment: JavaLibrary implementing the java.awt.geom package for J2SE 1.3

JavaAwtGeomClassLibrary
type: Class
subclass of: JavaAwtGeomClassLibrary
comment: platform:implementsInterface some JavaAwtGeomAPI
comment: JavaLibrary implementing the java.awt.geom package for J2SE 1.3

JavaAwtIm
type: Class
subclass of: JavaAwtIm
comment: Java API part implementing the java.awt.im package for J2SE 1.3

JavaAwtImAPI
type: Class
subclass of: JavaAwtImAPI
comment: platform:comprisesInterfacePart some JavaAwtIm
comment: JavaLibrary implementing the java.awt.im package for J2SE 1.3

JavaAwtImClassLibrary
type: Class
subclass of: JavaAwtImClassLibrary
comment: platform:implementsInterface some JavaAwtImAPI
comment: JavaLibrary implementing the java.awt.im package for J2SE 1.3

JavaAwtImSpi
type: Class
subclass of: JavaAPIPart
comment: Java API part implementing the java.awt.im.spi package for J2SE 1.3

JavaAwtImSpiAPI
type: Class
subclass of: JavaAPI
comment: platform:comprisesInterfacePart some JavaAwtImSpi
comment: JavaLibrary implementing the java.awt.im.spi package for J2SE 1.3

JavaAwtImSpiClassLibrary
type: Class
subclass of: JavaClassLibrary
comment: platform:implementsInterface some JavaAwtImSpiAPI
comment: JavaLibrary implementing the java.awt.im.spi package for J2SE 1.3

JavaAwtImage
type: Class
subclass of: JavaAwtImage
comment: Java API part implementing the java.awt.image package for J2SE 1.3

JavaAwtImageAPI
type: Class
subclass of: JavaAwtImageAPI
comment: platform:comprisesInterfacePart some JavaAwtImage
comment: JavaLibrary implementing the java.awt.image package for J2SE 1.3

JavaAwtImageClassLibrary
type: Class
subclass of: JavaAwtImageClassLibrary
comment: platform:implementsInterface some JavaAwtImageAPI
comment: JavaLibrary implementing the java.awt.image package for J2SE 1.3

JavaAwtImageRenderable
type: Class
subclass of: JavaAwtImageRenderable
comment: Java API part implementing the java.awt.image.renderable package for J2SE 1.3

JavaAwtImageRenderableAPI
type: Class
subclass of: JavaAwtImageRenderableAPI
comment: platform:comprisesInterfacePart some JavaAwtImageRenderable
comment: JavaLibrary implementing the java.awt.image.renderable package for J2SE 1.3

JavaAwtImageRenderableClassLibrary
type: Class
subclass of: JavaAwtImageRenderableClassLibrary
comment: platform:implementsInterface some JavaAwtImageRenderableAPI
comment: JavaLibrary implementing the java.awt.image.renderable package for J2SE 1.3

JavaAwtPrint
type: Class
subclass of: JavaAPIPart
comment: Java API part implementing the java.awt.print package for J2SE 1.3

JavaAwtPrintAPI
type: Class
subclass of: JavaAPI
comment: platform:comprisesInterfacePart some JavaAwtPrint
comment: JavaLibrary implementing the java.awt.print package for J2SE 1.3

JavaAwtPrintClassLibrary
type: Class
subclass of: JavaClassLibrary
comment: platform:implementsInterface some JavaAwtPrintAPI
comment: JavaLibrary implementing the java.awt.print package for J2SE 1.3

JavaBeans
type: Class
subclass of: JavaBeans
comment: Java API part implementing the java.beans package for J2SE 1.3

JavaBeansAPI
type: Class
subclass of: JavaBeansAPI
comment: platform:comprisesInterfacePart some JavaBeans
comment: JavaLibrary implementing the java.beans package for J2SE 1.3

JavaBeansBeancontext
type: Class
subclass of: JavaAPIPart
comment: Java API part implementing the java.beans.beancontext package for J2SE 1.3

JavaBeansBeancontextAPI
type: Class
subclass of: JavaAPI
comment: platform:comprisesInterfacePart some JavaBeansBeancontext
comment: JavaLibrary implementing the java.beans.beancontext package for J2SE 1.3

JavaBeansBeancontextClassLibrary
type: Class
subclass of: JavaClassLibrary
comment: platform:implementsInterface some JavaBeansBeancontextAPI
comment: JavaLibrary implementing the java.beans.beancontext package for J2SE 1.3

JavaBeansClassLibrary
type: Class
subclass of: JavaBeansClassLibrary
comment: platform:implementsInterface some JavaBeansAPI
comment: JavaLibrary implementing the java.beans package for J2SE 1.3

JavaIo
type: Class
subclass of: JavaIo
comment: Java API part implementing the java.io package for J2SE 1.3

JavaIoAPI
type: Class
subclass of: JavaIoAPI
comment: platform:comprisesInterfacePart some JavaIo
comment: JavaLibrary implementing the java.io package for J2SE 1.3

JavaIoClassLibrary
type: Class
subclass of: JavaIoClassLibrary
comment: platform:implementsInterface some JavaIoAPI
comment: JavaLibrary implementing the java.io package for J2SE 1.3

JavaLang
type: Class
subclass of: JavaLang
comment: Java API part implementing the java.lang package for J2SE 1.3

JavaLangAPI
type: Class
subclass of: JavaLangAPI
comment: platform:comprisesInterfacePart some JavaLang
comment: JavaLibrary implementing the java.lang package for J2SE 1.3

JavaLangClassLibrary
type: Class
subclass of: JavaLangClassLibrary
comment: platform:implementsInterface some JavaLangAPI
comment: JavaLibrary implementing the java.lang package for J2SE 1.3

JavaLangRef
type: Class
subclass of: JavaAPIPart
comment: Java API part implementing the java.lang.ref package for J2SE 1.3

JavaLangRefAPI
type: Class
subclass of: JavaAPI
comment: platform:comprisesInterfacePart some JavaLangRef
comment: JavaLibrary implementing the java.lang.ref package for J2SE 1.3

JavaLangRefClassLibrary
type: Class
subclass of: JavaClassLibrary
comment: platform:implementsInterface some JavaLangRefAPI
comment: JavaLibrary implementing the java.lang.ref package for J2SE 1.3

JavaLangReflect
type: Class
subclass of: JavaLangReflect
comment: Java API part implementing the java.lang.reflect package for J2SE 1.3

JavaLangReflectAPI
type: Class
subclass of: JavaLangReflectAPI
comment: platform:comprisesInterfacePart some JavaLangReflect
comment: JavaLibrary implementing the java.lang.reflect package for J2SE 1.3

JavaLangReflectClassLibrary
type: Class
subclass of: JavaLangReflectClassLibrary
comment: platform:implementsInterface some JavaLangReflectAPI
comment: JavaLibrary implementing the java.lang.reflect package for J2SE 1.3

JavaMath
type: Class
subclass of: JavaAPIPart
comment: Java API part implementing the java.math package for J2SE 1.3

JavaMathAPI
type: Class
subclass of: JavaAPI
comment: platform:comprisesInterfacePart some JavaMath
comment: JavaLibrary implementing the java.math package for J2SE 1.3

JavaMathClassLibrary
type: Class
subclass of: JavaClassLibrary
comment: platform:implementsInterface some JavaMathAPI
comment: JavaLibrary implementing the java.math package for J2SE 1.3

JavaNet
type: Class
subclass of: JavaNet
comment: Java API part implementing the java.net package for J2SE 1.3

JavaNetAPI
type: Class
subclass of: JavaNetAPI
comment: platform:comprisesInterfacePart some JavaNet
comment: JavaLibrary implementing the java.net package for J2SE 1.3

JavaNetClassLibrary
type: Class
subclass of: JavaNetClassLibrary
comment: platform:implementsInterface some JavaNetAPI
comment: JavaLibrary implementing the java.net package for J2SE 1.3

JavaRmi
type: Class
subclass of: JavaRmi
comment: Java API part implementing the java.rmi package for J2SE 1.3

JavaRmiAPI
type: Class
subclass of: JavaRmiAPI
comment: platform:comprisesInterfacePart some JavaRmi
comment: JavaLibrary implementing the java.rmi package for J2SE 1.3

JavaRmiActivation
type: Class
subclass of: JavaAPIPart
comment: Java API part implementing the java.rmi.activation package for J2SE 1.3

JavaRmiActivationAPI
type: Class
subclass of: JavaAPI
comment: platform:comprisesInterfacePart some JavaRmiActivation
comment: JavaLibrary implementing the java.rmi.activation package for J2SE 1.3

JavaRmiActivationClassLibrary
type: Class
subclass of: JavaClassLibrary
comment: platform:implementsInterface some JavaRmiActivationAPI
comment: JavaLibrary implementing the java.rmi.activation package for J2SE 1.3

JavaRmiClassLibrary
type: Class
subclass of: JavaRmiClassLibrary
comment: platform:implementsInterface some JavaRmiAPI
comment: JavaLibrary implementing the java.rmi package for J2SE 1.3

JavaRmiDgc
type: Class
subclass of: JavaAPIPart
comment: Java API part implementing the java.rmi.dgc package for J2SE 1.3

JavaRmiDgcAPI
type: Class
subclass of: JavaAPI
comment: platform:comprisesInterfacePart some JavaRmiDgc
comment: JavaLibrary implementing the java.rmi.dgc package for J2SE 1.3

JavaRmiDgcClassLibrary
type: Class
subclass of: JavaClassLibrary
comment: platform:implementsInterface some JavaRmiDgcAPI
comment: JavaLibrary implementing the java.rmi.dgc package for J2SE 1.3

JavaRmiRegistry
type: Class
subclass of: JavaRmiRegistry
comment: Java API part implementing the java.rmi.registry package for J2SE 1.3

JavaRmiRegistryAPI
type: Class
subclass of: JavaRmiRegistryAPI
comment: platform:comprisesInterfacePart some JavaRmiRegistry
comment: JavaLibrary implementing the java.rmi.registry package for J2SE 1.3

JavaRmiRegistryClassLibrary
type: Class
subclass of: JavaRmiRegistryClassLibrary
comment: platform:implementsInterface some JavaRmiRegistryAPI
comment: JavaLibrary implementing the java.rmi.registry package for J2SE 1.3

JavaRmiServer
type: Class
subclass of: JavaRmiServer
comment: Java API part implementing the java.rmi.server package for J2SE 1.3

JavaRmiServerAPI
type: Class
subclass of: JavaRmiServerAPI
comment: platform:comprisesInterfacePart some JavaRmiServer
comment: JavaLibrary implementing the java.rmi.server package for J2SE 1.3

JavaRmiServerClassLibrary
type: Class
subclass of: JavaRmiServerClassLibrary
comment: platform:implementsInterface some JavaRmiServerAPI
comment: JavaLibrary implementing the java.rmi.server package for J2SE 1.3

JavaSecurity
type: Class
subclass of: JavaSecurity
comment: Java API part implementing the java.security package for J2SE 1.3

JavaSecurityAPI
type: Class
subclass of: JavaSecurityAPI
comment: platform:comprisesInterfacePart some JavaSecurity
comment: JavaLibrary implementing the java.security package for J2SE 1.3

JavaSecurityAcl
type: Class
subclass of: JavaAPIPart
comment: Java API part implementing the java.security.acl package for J2SE 1.3

JavaSecurityAclAPI
type: Class
subclass of: JavaAPI
comment: platform:comprisesInterfacePart some JavaSecurityAcl
comment: JavaLibrary implementing the java.security.acl package for J2SE 1.3

JavaSecurityAclClassLibrary
type: Class
subclass of: JavaClassLibrary
comment: platform:implementsInterface some JavaSecurityAclAPI
comment: JavaLibrary implementing the java.security.acl package for J2SE 1.3

JavaSecurityCert
type: Class
subclass of: JavaSecurityCert
comment: Java API part implementing the java.security.cert package for J2SE 1.3

JavaSecurityCertAPI
type: Class
subclass of: JavaSecurityCertAPI
comment: platform:comprisesInterfacePart some JavaSecurityCert
comment: JavaLibrary implementing the java.security.cert package for J2SE 1.3

JavaSecurityCertClassLibrary
type: Class
subclass of: JavaSecurityCertClassLibrary
comment: platform:implementsInterface some JavaSecurityCertAPI
comment: JavaLibrary implementing the java.security.cert package for J2SE 1.3

JavaSecurityClassLibrary
type: Class
subclass of: JavaSecurityClassLibrary
comment: platform:implementsInterface some JavaSecurityAPI
comment: JavaLibrary implementing the java.security package for J2SE 1.3

JavaSecurityInterfaces
type: Class
subclass of: JavaSecurityInterfaces
comment: Java API part implementing the java.security.interfaces package for J2SE 1.3

JavaSecurityInterfacesAPI
type: Class
subclass of: JavaSecurityInterfacesAPI
comment: platform:comprisesInterfacePart some JavaSecurityInterfaces
comment: JavaLibrary implementing the java.security.interfaces package for J2SE 1.3

JavaSecurityInterfacesClassLibrary
type: Class
subclass of: JavaSecurityInterfacesClassLibrary
comment: platform:implementsInterface some JavaSecurityInterfacesAPI
comment: JavaLibrary implementing the java.security.interfaces package for J2SE 1.3

JavaSecuritySpec
type: Class
subclass of: JavaSecuritySpec
comment: Java API part implementing the java.security.spec package for J2SE 1.3

JavaSecuritySpecAPI
type: Class
subclass of: JavaSecuritySpecAPI
comment: platform:comprisesInterfacePart some JavaSecuritySpec
comment: JavaLibrary implementing the java.security.spec package for J2SE 1.3

JavaSecuritySpecClassLibrary
type: Class
subclass of: JavaSecuritySpecClassLibrary
comment: platform:implementsInterface some JavaSecuritySpecAPI
comment: JavaLibrary implementing the java.security.spec package for J2SE 1.3

JavaSql
type: Class
subclass of: JavaSql
comment: Java API part implementing the java.sql package for J2SE 1.3

JavaSqlAPI
type: Class
subclass of: JavaSqlAPI
comment: platform:comprisesInterfacePart some JavaSql
comment: JavaLibrary implementing the java.sql package for J2SE 1.3

JavaSqlClassLibrary
type: Class
subclass of: JavaSqlClassLibrary
comment: platform:implementsInterface some JavaSqlAPI
comment: JavaLibrary implementing the java.sql package for J2SE 1.3

JavaText
type: Class
subclass of: JavaAPIPart
comment: Java API part implementing the java.text package for J2SE 1.3

JavaTextAPI
type: Class
subclass of: JavaAPI
comment: platform:comprisesInterfacePart some JavaText
comment: JavaLibrary implementing the java.text package for J2SE 1.3

JavaTextClassLibrary
type: Class
subclass of: JavaClassLibrary
comment: platform:implementsInterface some JavaTextAPI
comment: JavaLibrary implementing the java.text package for J2SE 1.3

JavaTextResources
type: Class
subclass of: JavaAPIPart
comment: Java API part implementing the java.text.resources package for J2SE 1.3

JavaTextResourcesAPI
type: Class
subclass of: JavaAPI
comment: platform:comprisesInterfacePart some JavaTextResources
comment: JavaLibrary implementing the java.text.resources package for J2SE 1.3

JavaTextResourcesClassLibrary
type: Class
subclass of: JavaClassLibrary
comment: platform:implementsInterface some JavaTextResourcesAPI
comment: JavaLibrary implementing the java.text.resources package for J2SE 1.3

JavaUtil
type: Class
subclass of: JavaUtil
comment: Java API part implementing the java.util package for J2SE 1.3

JavaUtilAPI
type: Class
subclass of: JavaUtilAPI
comment: platform:comprisesInterfacePart some JavaUtil
comment: JavaLibrary implementing the java.util package for J2SE 1.3

JavaUtilClassLibrary
type: Class
subclass of: JavaUtilClassLibrary
comment: platform:implementsInterface some JavaUtilAPI
comment: JavaLibrary implementing the java.util package for J2SE 1.3

JavaUtilJar
type: Class
subclass of: JavaUtilJar
comment: Java API part implementing the java.util.jar package for J2SE 1.3

JavaUtilJarAPI
type: Class
subclass of: JavaUtilJarAPI
comment: platform:comprisesInterfacePart some JavaUtilJar
comment: JavaLibrary implementing the java.util.jar package for J2SE 1.3

JavaUtilJarClassLibrary
type: Class
subclass of: JavaUtilJarClassLibrary
comment: platform:implementsInterface some JavaUtilJarAPI
comment: JavaLibrary implementing the java.util.jar package for J2SE 1.3

JavaUtilZip
type: Class
subclass of: JavaUtilZip
comment: Java API part implementing the java.util.zip package for J2SE 1.3

JavaUtilZipAPI
type: Class
subclass of: JavaUtilZipAPI
comment: platform:comprisesInterfacePart some JavaUtilZip
comment: JavaLibrary implementing the java.util.zip package for J2SE 1.3

JavaUtilZipClassLibrary
type: Class
subclass of: JavaUtilZipClassLibrary
comment: platform:implementsInterface some JavaUtilZipAPI
comment: JavaLibrary implementing the java.util.zip package for J2SE 1.3

JavaxAccessibility
type: Class
subclass of: JavaxAccessibility
comment: Java API part implementing the javax.accessibility package for J2SE 1.3

JavaxAccessibilityAPI
type: Class
subclass of: JavaxAccessibilityAPI
comment: platform:comprisesInterfacePart some JavaxAccessibility
comment: JavaLibrary implementing the javax.accessibility package for J2SE 1.3

JavaxAccessibilityClassLibrary
type: Class
subclass of: JavaxAccessibilityClassLibrary
comment: platform:implementsInterface some JavaxAccessibilityAPI
comment: JavaLibrary implementing the javax.accessibility package for J2SE 1.3

JavaxNaming
type: Class
subclass of: JavaAPIPart
comment: Java API part implementing the javax.naming package for J2SE 1.3

JavaxNamingAPI
type: Class
subclass of: JavaAPI
comment: platform:comprisesInterfacePart some JavaxNaming
comment: JavaLibrary implementing the javax.naming package for J2SE 1.3

JavaxNamingClassLibrary
type: Class
subclass of: JavaClassLibrary
comment: platform:implementsInterface some JavaxNamingAPI
comment: JavaLibrary implementing the javax.naming package for J2SE 1.3

JavaxNamingDirectory
type: Class
subclass of: JavaAPIPart
comment: Java API part implementing the javax.naming.directory package for J2SE 1.3

JavaxNamingDirectoryAPI
type: Class
subclass of: JavaAPI
comment: platform:comprisesInterfacePart some JavaxNamingDirectory
comment: JavaLibrary implementing the javax.naming.directory package for J2SE 1.3

JavaxNamingDirectoryClassLibrary
type: Class
subclass of: JavaClassLibrary
comment: platform:implementsInterface some JavaxNamingDirectoryAPI
comment: JavaLibrary implementing the javax.naming.directory package for J2SE 1.3

JavaxNamingEvent
type: Class
subclass of: JavaAPIPart
comment: Java API part implementing the javax.naming.event package for J2SE 1.3

JavaxNamingEventAPI
type: Class
subclass of: JavaAPI
comment: platform:comprisesInterfacePart some JavaxNamingEvent
comment: JavaLibrary implementing the javax.naming.event package for J2SE 1.3

JavaxNamingEventClassLibrary
type: Class
subclass of: JavaClassLibrary
comment: platform:implementsInterface some JavaxNamingEventAPI
comment: JavaLibrary implementing the javax.naming.event package for J2SE 1.3

JavaxNamingLdap
type: Class
subclass of: JavaAPIPart
comment: Java API part implementing the javax.naming.ldap package for J2SE 1.3

JavaxNamingLdapAPI
type: Class
subclass of: JavaAPI
comment: platform:comprisesInterfacePart some JavaxNamingLdap
comment: JavaLibrary implementing the javax.naming.ldap package for J2SE 1.3

JavaxNamingLdapClassLibrary
type: Class
subclass of: JavaClassLibrary
comment: platform:implementsInterface some JavaxNamingLdapAPI
comment: JavaLibrary implementing the javax.naming.ldap package for J2SE 1.3

JavaxNamingSpi
type: Class
subclass of: JavaAPIPart
comment: Java API part implementing the javax.naming.spi package for J2SE 1.3

JavaxNamingSpiAPI
type: Class
subclass of: JavaAPI
comment: platform:comprisesInterfacePart some JavaxNamingSpi
comment: JavaLibrary implementing the javax.naming.spi package for J2SE 1.3

JavaxNamingSpiClassLibrary
type: Class
subclass of: JavaClassLibrary
comment: platform:implementsInterface some JavaxNamingSpiAPI
comment: JavaLibrary implementing the javax.naming.spi package for J2SE 1.3

JavaxRmi
type: Class
subclass of: JavaAPIPart
comment: Java API part implementing the javax.rmi package for J2SE 1.3

JavaxRmiAPI
type: Class
subclass of: JavaAPI
comment: platform:comprisesInterfacePart some JavaxRmi
comment: JavaLibrary implementing the javax.rmi package for J2SE 1.3

JavaxRmiCORBA
type: Class
subclass of: JavaAPIPart
comment: Java API part implementing the javax.rmi.CORBA package for J2SE 1.3

JavaxRmiCORBAAPI
type: Class
subclass of: JavaAPI
comment: platform:comprisesInterfacePart some JavaxRmiCORBA
comment: JavaLibrary implementing the javax.rmi.CORBA package for J2SE 1.3

JavaxRmiCORBAClassLibrary
type: Class
subclass of: JavaClassLibrary
comment: platform:implementsInterface some JavaxRmiCORBAAPI
comment: JavaLibrary implementing the javax.rmi.CORBA package for J2SE 1.3

JavaxRmiClassLibrary
type: Class
subclass of: JavaClassLibrary
comment: platform:implementsInterface some JavaxRmiAPI
comment: JavaLibrary implementing the javax.rmi package for J2SE 1.3

JavaxSoundMidi
type: Class
subclass of: JavaAPIPart
comment: Java API part implementing the javax.sound.midi package for J2SE 1.3

JavaxSoundMidiAPI
type: Class
subclass of: JavaAPI
comment: platform:comprisesInterfacePart some JavaxSoundMidi
comment: JavaLibrary implementing the javax.sound.midi package for J2SE 1.3

JavaxSoundMidiClassLibrary
type: Class
subclass of: JavaClassLibrary
comment: platform:implementsInterface some JavaxSoundMidiAPI
comment: JavaLibrary implementing the javax.sound.midi package for J2SE 1.3

JavaxSoundMidiSpi
type: Class
subclass of: JavaAPIPart
comment: Java API part implementing the javax.sound.midi.spi package for J2SE 1.3

JavaxSoundMidiSpiAPI
type: Class
subclass of: JavaAPI
comment: platform:comprisesInterfacePart some JavaxSoundMidiSpi
comment: JavaLibrary implementing the javax.sound.midi.spi package for J2SE 1.3

JavaxSoundMidiSpiClassLibrary
type: Class
subclass of: JavaClassLibrary
comment: platform:implementsInterface some JavaxSoundMidiSpiAPI
comment: JavaLibrary implementing the javax.sound.midi.spi package for J2SE 1.3

JavaxSoundSampled
type: Class
subclass of: JavaAPIPart
comment: Java API part implementing the javax.sound.sampled package for J2SE 1.3

JavaxSoundSampledAPI
type: Class
subclass of: JavaAPI
comment: platform:comprisesInterfacePart some JavaxSoundSampled
comment: JavaLibrary implementing the javax.sound.sampled package for J2SE 1.3

JavaxSoundSampledClassLibrary
type: Class
subclass of: JavaClassLibrary
comment: platform:implementsInterface some JavaxSoundSampledAPI
comment: JavaLibrary implementing the javax.sound.sampled package for J2SE 1.3

JavaxSoundSampledSpi
type: Class
subclass of: JavaAPIPart
comment: Java API part implementing the javax.sound.sampled.spi package for J2SE 1.3

JavaxSoundSampledSpiAPI
type: Class
subclass of: JavaAPI
comment: platform:comprisesInterfacePart some JavaxSoundSampledSpi
comment: JavaLibrary implementing the javax.sound.sampled.spi package for J2SE 1.3

JavaxSoundSampledSpiClassLibrary
type: Class
subclass of: JavaClassLibrary
comment: platform:implementsInterface some JavaxSoundSampledSpiAPI
comment: JavaLibrary implementing the javax.sound.sampled.spi package for J2SE 1.3

JavaxSwing
type: Class
subclass of: JavaAPIPart
comment: Java API part implementing the javax.swing package for J2SE 1.3

JavaxSwingAPI
type: Class
subclass of: JavaAPI
comment: platform:comprisesInterfacePart some JavaxSwing
comment: JavaLibrary implementing the javax.swing package for J2SE 1.3

JavaxSwingBorder
type: Class
subclass of: JavaxSwingBorder
comment: Java API part implementing the javax.swing.border package for J2SE 1.3

JavaxSwingBorderAPI
type: Class
subclass of: JavaxSwingBorderAPI
comment: platform:comprisesInterfacePart some JavaxSwingBorder
comment: JavaLibrary implementing the javax.swing.border package for J2SE 1.3

JavaxSwingBorderClassLibrary
type: Class
subclass of: JavaxSwingBorderClassLibrary
comment: platform:implementsInterface some JavaxSwingBorderAPI
comment: JavaLibrary implementing the javax.swing.border package for J2SE 1.3

JavaxSwingClassLibrary
type: Class
subclass of: JavaClassLibrary
comment: platform:implementsInterface some JavaxSwingAPI
comment: JavaLibrary implementing the javax.swing package for J2SE 1.3

JavaxSwingColorchooser
type: Class
subclass of: JavaxSwingColorchooser
comment: Java API part implementing the javax.swing.colorchooser package for J2SE 1.3

JavaxSwingColorchooserAPI
type: Class
subclass of: JavaxSwingColorchooserAPI
comment: platform:comprisesInterfacePart some JavaxSwingColorchooser
comment: JavaLibrary implementing the javax.swing.colorchooser package for J2SE 1.3

JavaxSwingColorchooserClassLibrary
type: Class
subclass of: JavaxSwingColorchooserClassLibrary
comment: platform:implementsInterface some JavaxSwingColorchooserAPI
comment: JavaLibrary implementing the javax.swing.colorchooser package for J2SE 1.3

JavaxSwingEvent
type: Class
subclass of: JavaxSwingEvent
comment: Java API part implementing the javax.swing.event package for J2SE 1.3

JavaxSwingEventAPI
type: Class
subclass of: JavaxSwingEventAPI
comment: platform:comprisesInterfacePart some JavaxSwingEvent
comment: JavaLibrary implementing the javax.swing.event package for J2SE 1.3

JavaxSwingEventClassLibrary
type: Class
subclass of: JavaxSwingEventClassLibrary
comment: platform:implementsInterface some JavaxSwingEventAPI
comment: JavaLibrary implementing the javax.swing.event package for J2SE 1.3

JavaxSwingFilechooser
type: Class
subclass of: JavaxSwingFilechooser
comment: Java API part implementing the javax.swing.filechooser package for J2SE 1.3

JavaxSwingFilechooserAPI
type: Class
subclass of: JavaxSwingFilechooserAPI
comment: platform:comprisesInterfacePart some JavaxSwingFilechooser
comment: JavaLibrary implementing the javax.swing.filechooser package for J2SE 1.3

JavaxSwingFilechooserClassLibrary
type: Class
subclass of: JavaxSwingFilechooserClassLibrary
comment: platform:implementsInterface some JavaxSwingFilechooserAPI
comment: JavaLibrary implementing the javax.swing.filechooser package for J2SE 1.3

JavaxSwingPlaf
type: Class
subclass of: JavaxSwingPlaf
comment: Java API part implementing the javax.swing.plaf package for J2SE 1.3

JavaxSwingPlafAPI
type: Class
subclass of: JavaxSwingPlafAPI
comment: platform:comprisesInterfacePart some JavaxSwingPlaf
comment: JavaLibrary implementing the javax.swing.plaf package for J2SE 1.3

JavaxSwingPlafBasic
type: Class
subclass of: JavaxSwingPlafBasic
comment: Java API part implementing the javax.swing.plaf.basic package for J2SE 1.3

JavaxSwingPlafBasicAPI
type: Class
subclass of: JavaxSwingPlafBasicAPI
comment: platform:comprisesInterfacePart some JavaxSwingPlafBasic
comment: JavaLibrary implementing the javax.swing.plaf.basic package for J2SE 1.3

JavaxSwingPlafBasicClassLibrary
type: Class
subclass of: JavaxSwingPlafBasicClassLibrary
comment: platform:implementsInterface some JavaxSwingPlafBasicAPI
comment: JavaLibrary implementing the javax.swing.plaf.basic package for J2SE 1.3

JavaxSwingPlafClassLibrary
type: Class
subclass of: JavaxSwingPlafClassLibrary
comment: platform:implementsInterface some JavaxSwingPlafAPI
comment: JavaLibrary implementing the javax.swing.plaf package for J2SE 1.3

JavaxSwingPlafMetal
type: Class
subclass of: JavaxSwingPlafMetal
comment: Java API part implementing the javax.swing.plaf.metal package for J2SE 1.3

JavaxSwingPlafMetalAPI
type: Class
subclass of: JavaxSwingPlafMetalAPI
comment: platform:comprisesInterfacePart some JavaxSwingPlafMetal
comment: JavaLibrary implementing the javax.swing.plaf.metal package for J2SE 1.3

JavaxSwingPlafMetalClassLibrary
type: Class
subclass of: JavaxSwingPlafMetalClassLibrary
comment: platform:implementsInterface some JavaxSwingPlafMetalAPI
comment: JavaLibrary implementing the javax.swing.plaf.metal package for J2SE 1.3

JavaxSwingPlafMulti
type: Class
subclass of: JavaxSwingPlafMulti
comment: Java API part implementing the javax.swing.plaf.multi package for J2SE 1.3

JavaxSwingPlafMultiAPI
type: Class
subclass of: JavaxSwingPlafMultiAPI
comment: platform:comprisesInterfacePart some JavaxSwingPlafMulti
comment: JavaLibrary implementing the javax.swing.plaf.multi package for J2SE 1.3

JavaxSwingPlafMultiClassLibrary
type: Class
subclass of: JavaxSwingPlafMultiClassLibrary
comment: platform:implementsInterface some JavaxSwingPlafMultiAPI
comment: JavaLibrary implementing the javax.swing.plaf.multi package for J2SE 1.3

JavaxSwingTable
type: Class
subclass of: JavaxSwingTable
comment: Java API part implementing the javax.swing.table package for J2SE 1.3

JavaxSwingTableAPI
type: Class
subclass of: JavaxSwingTableAPI
comment: platform:comprisesInterfacePart some JavaxSwingTable
comment: JavaLibrary implementing the javax.swing.table package for J2SE 1.3

JavaxSwingTableClassLibrary
type: Class
subclass of: JavaxSwingTableClassLibrary
comment: platform:implementsInterface some JavaxSwingTableAPI
comment: JavaLibrary implementing the javax.swing.table package for J2SE 1.3

JavaxSwingText
type: Class
subclass of: JavaxSwingText
comment: Java API part implementing the javax.swing.text package for J2SE 1.3

JavaxSwingTextAPI
type: Class
subclass of: JavaxSwingTextAPI
comment: platform:comprisesInterfacePart some JavaxSwingText
comment: JavaLibrary implementing the javax.swing.text package for J2SE 1.3

JavaxSwingTextClassLibrary
type: Class
subclass of: JavaxSwingTextClassLibrary
comment: platform:implementsInterface some JavaxSwingTextAPI
comment: JavaLibrary implementing the javax.swing.text package for J2SE 1.3

JavaxSwingTextHtml
type: Class
subclass of: JavaxSwingTextHtml
comment: Java API part implementing the javax.swing.text.html package for J2SE 1.3

JavaxSwingTextHtmlAPI
type: Class
subclass of: JavaxSwingTextHtmlAPI
comment: platform:comprisesInterfacePart some JavaxSwingTextHtml
comment: JavaLibrary implementing the javax.swing.text.html package for J2SE 1.3

JavaxSwingTextHtmlClassLibrary
type: Class
subclass of: JavaxSwingTextHtmlClassLibrary
comment: platform:implementsInterface some JavaxSwingTextHtmlAPI
comment: JavaLibrary implementing the javax.swing.text.html package for J2SE 1.3

JavaxSwingTextHtmlParser
type: Class
subclass of: JavaxSwingTextHtmlParser
comment: Java API part implementing the javax.swing.text.html.parser package for J2SE 1.3

JavaxSwingTextHtmlParserAPI
type: Class
subclass of: JavaxSwingTextHtmlParserAPI
comment: platform:comprisesInterfacePart some JavaxSwingTextHtmlParser
comment: JavaLibrary implementing the javax.swing.text.html.parser package for J2SE 1.3

JavaxSwingTextHtmlParserClassLibrary
type: Class
subclass of: JavaxSwingTextHtmlParserClassLibrary
comment: platform:implementsInterface some JavaxSwingTextHtmlParserAPI
comment: JavaLibrary implementing the javax.swing.text.html.parser package for J2SE 1.3

JavaxSwingTextRtf
type: Class
subclass of: JavaAPIPart
comment: Java API part implementing the javax.swing.text.rtf package for J2SE 1.3

JavaxSwingTextRtfAPI
type: Class
subclass of: JavaAPI
comment: platform:comprisesInterfacePart some JavaxSwingTextRtf
comment: JavaLibrary implementing the javax.swing.text.rtf package for J2SE 1.3

JavaxSwingTextRtfClassLibrary
type: Class
subclass of: JavaClassLibrary
comment: platform:implementsInterface some JavaxSwingTextRtfAPI
comment: JavaLibrary implementing the javax.swing.text.rtf package for J2SE 1.3

JavaxSwingTree
type: Class
subclass of: JavaxSwingTree
comment: Java API part implementing the javax.swing.tree package for J2SE 1.3

JavaxSwingTreeAPI
type: Class
subclass of: JavaxSwingTreeAPI
comment: platform:comprisesInterfacePart some JavaxSwingTree
comment: JavaLibrary implementing the javax.swing.tree package for J2SE 1.3

JavaxSwingTreeClassLibrary
type: Class
subclass of: JavaxSwingTreeClassLibrary
comment: platform:implementsInterface some JavaxSwingTreeAPI
comment: JavaLibrary implementing the javax.swing.tree package for J2SE 1.3

JavaxSwingUndo
type: Class
subclass of: JavaAPIPart
comment: Java API part implementing the javax.swing.undo package for J2SE 1.3

JavaxSwingUndoAPI
type: Class
subclass of: JavaAPI
comment: platform:comprisesInterfacePart some JavaxSwingUndo
comment: JavaLibrary implementing the javax.swing.undo package for J2SE 1.3

JavaxSwingUndoClassLibrary
type: Class
subclass of: JavaClassLibrary
comment: platform:implementsInterface some JavaxSwingUndoAPI
comment: JavaLibrary implementing the javax.swing.undo package for J2SE 1.3

JavaxTransaction
type: Class
subclass of: JavaAPIPart
comment: Java API part implementing the javax.transaction package for J2SE 1.3

JavaxTransactionAPI
type: Class
subclass of: JavaAPI
comment: platform:comprisesInterfacePart some JavaxTransaction
comment: JavaLibrary implementing the javax.transaction package for J2SE 1.3

JavaxTransactionClassLibrary
type: Class
subclass of: JavaClassLibrary
comment: platform:implementsInterface some JavaxTransactionAPI
comment: JavaLibrary implementing the javax.transaction package for J2SE 1.3

OrgOmgCORBA
type: Class
subclass of: OrgOmgCORBA
comment: Java API part implementing the org.omg.CORBA package for J2SE 1.3

OrgOmgCORBAAPI
type: Class
subclass of: OrgOmgCORBAAPI
comment: platform:comprisesInterfacePart some OrgOmgCORBA
comment: JavaLibrary implementing the org.omg.CORBA package for J2SE 1.3

OrgOmgCORBAClassLibrary
type: Class
subclass of: OrgOmgCORBAClassLibrary
comment: platform:implementsInterface some OrgOmgCORBAAPI
comment: JavaLibrary implementing the org.omg.CORBA package for J2SE 1.3

OrgOmgCORBADynAnyPackage
type: Class
subclass of: JavaAPIPart
comment: Java API part implementing the org.omg.CORBA.DynAnyPackage package for J2SE 1.3

OrgOmgCORBADynAnyPackageAPI
type: Class
subclass of: JavaAPI
comment: platform:comprisesInterfacePart some OrgOmgCORBADynAnyPackage
comment: JavaLibrary implementing the org.omg.CORBA.DynAnyPackage package for J2SE 1.3

OrgOmgCORBADynAnyPackageClassLibrary
type: Class
subclass of: JavaClassLibrary
comment: platform:implementsInterface some OrgOmgCORBADynAnyPackageAPI
comment: JavaLibrary implementing the org.omg.CORBA.DynAnyPackage package for J2SE 1.3

OrgOmgCORBAORBPackage
type: Class
subclass of: JavaAPIPart
comment: Java API part implementing the org.omg.CORBA.ORBPackage package for J2SE 1.3

OrgOmgCORBAORBPackageAPI
type: Class
subclass of: JavaAPI
comment: platform:comprisesInterfacePart some OrgOmgCORBAORBPackage
comment: JavaLibrary implementing the org.omg.CORBA.ORBPackage package for J2SE 1.3

OrgOmgCORBAORBPackageClassLibrary
type: Class
subclass of: JavaClassLibrary
comment: platform:implementsInterface some OrgOmgCORBAORBPackageAPI
comment: JavaLibrary implementing the org.omg.CORBA.ORBPackage package for J2SE 1.3

OrgOmgCORBAPortable
type: Class
subclass of: OrgOmgCORBAPortable
comment: Java API part implementing the org.omg.CORBA.portable package for J2SE 1.3

OrgOmgCORBAPortableAPI
type: Class
subclass of: OrgOmgCORBAPortableAPI
comment: platform:comprisesInterfacePart some OrgOmgCORBAPortable
comment: JavaLibrary implementing the org.omg.CORBA.portable package for J2SE 1.3

OrgOmgCORBAPortableClassLibrary
type: Class
subclass of: OrgOmgCORBAPortableClassLibrary
comment: platform:implementsInterface some OrgOmgCORBAPortableAPI
comment: JavaLibrary implementing the org.omg.CORBA.portable package for J2SE 1.3

OrgOmgCORBATypeCodePackage
type: Class
subclass of: JavaAPIPart
comment: Java API part implementing the org.omg.CORBA.TypeCodePackage package for J2SE 1.3

OrgOmgCORBATypeCodePackageAPI
type: Class
subclass of: JavaAPI
comment: platform:comprisesInterfacePart some OrgOmgCORBATypeCodePackage
comment: JavaLibrary implementing the org.omg.CORBA.TypeCodePackage package for J2SE 1.3

OrgOmgCORBATypeCodePackageClassLibrary
type: Class
subclass of: JavaClassLibrary
comment: platform:implementsInterface some OrgOmgCORBATypeCodePackageAPI
comment: JavaLibrary implementing the org.omg.CORBA.TypeCodePackage package for J2SE 1.3

OrgOmgCORBA 2 3
type: Class
subclass of: JavaAPIPart
comment: Java API part implementing the org.omg.CORBA_2_3 package for J2SE 1.3

OrgOmgCORBA 2 3API
type: Class
subclass of: JavaAPI
comment: platform:comprisesInterfacePart some OrgOmgCORBA_2_3
comment: JavaLibrary implementing the org.omg.CORBA_2_3 package for J2SE 1.3

OrgOmgCORBA 2 3ClassLibrary
type: Class
subclass of: JavaClassLibrary
comment: platform:implementsInterface some OrgOmgCORBA_2_3API
comment: JavaLibrary implementing the org.omg.CORBA_2_3 package for J2SE 1.3

OrgOmgCORBA 2 3Portable
type: Class
subclass of: JavaAPIPart
comment: Java API part implementing the org.omg.CORBA_2_3.portable package for J2SE 1.3

OrgOmgCORBA 2 3PortableAPI
type: Class
subclass of: JavaAPI
comment: platform:comprisesInterfacePart some OrgOmgCORBA_2_3Portable
comment: JavaLibrary implementing the org.omg.CORBA_2_3.portable package for J2SE 1.3

OrgOmgCORBA 2 3PortableClassLibrary
type: Class
subclass of: JavaClassLibrary
comment: platform:implementsInterface some OrgOmgCORBA_2_3PortableAPI
comment: JavaLibrary implementing the org.omg.CORBA_2_3.portable package for J2SE 1.3

OrgOmgCosNaming
type: Class
subclass of: OrgOmgCosNaming
comment: Java API part implementing the org.omg.CosNaming package for J2SE 1.3

OrgOmgCosNamingAPI
type: Class
subclass of: OrgOmgCosNamingAPI
comment: platform:comprisesInterfacePart some OrgOmgCosNaming
comment: JavaLibrary implementing the org.omg.CosNaming package for J2SE 1.3

OrgOmgCosNamingClassLibrary
type: Class
subclass of: OrgOmgCosNamingClassLibrary
comment: platform:implementsInterface some OrgOmgCosNamingAPI
comment: JavaLibrary implementing the org.omg.CosNaming package for J2SE 1.3

OrgOmgCosNamingNamingContextPackage
type: Class
subclass of: JavaAPIPart
comment: Java API part implementing the org.omg.CosNaming.NamingContextPackage package for J2SE 1.3

OrgOmgCosNamingNamingContextPackageAPI
type: Class
subclass of: JavaAPI
comment: platform:comprisesInterfacePart some OrgOmgCosNamingNamingContextPackage
comment: JavaLibrary implementing the org.omg.CosNaming.NamingContextPackage package for J2SE 1.3

OrgOmgCosNamingNamingContextPackageClassLibrary
type: Class
subclass of: JavaClassLibrary
comment: platform:implementsInterface some OrgOmgCosNamingNamingContextPackageAPI
comment: JavaLibrary implementing the org.omg.CosNaming.NamingContextPackage package for J2SE 1.3

OrgOmgSendingContext
type: Class
subclass of: JavaAPIPart
comment: Java API part implementing the org.omg.SendingContext package for J2SE 1.3

OrgOmgSendingContextAPI
type: Class
subclass of: JavaAPI
comment: platform:comprisesInterfacePart some OrgOmgSendingContext
comment: JavaLibrary implementing the org.omg.SendingContext package for J2SE 1.3

OrgOmgSendingContextClassLibrary
type: Class
subclass of: JavaClassLibrary
comment: platform:implementsInterface some OrgOmgSendingContextAPI
comment: JavaLibrary implementing the org.omg.SendingContext package for J2SE 1.3

OrgOmgStubJavaRmi
type: Class
subclass of: JavaAPIPart
comment: Java API part implementing the org.omg.stub.java.rmi package for J2SE 1.3

OrgOmgStubJavaRmiAPI
type: Class
subclass of: JavaAPI
comment: platform:comprisesInterfacePart some OrgOmgStubJavaRmi
comment: JavaLibrary implementing the org.omg.stub.java.rmi package for J2SE 1.3

OrgOmgStubJavaRmiClassLibrary
type: Class
subclass of: JavaClassLibrary
comment: platform:implementsInterface some OrgOmgStubJavaRmiAPI
comment: JavaLibrary implementing the org.omg.stub.java.rmi package for J2SE 1.3

theJ2SE1 3BytecodeFormat
type: J2SE1 3BytecodeFormat
type: Thing
minor version number: 0
major version number: 47
preverified: false