J2SE 5.0
type: Ontology
version info: $Id$
creator: Dennis Wagelaar <dennis.wagelaar@vub.ac.be>
comment: Generated by [UML2ToSimplifiedPackageAPIOntology.atl 8080 2010-03-18 10:46:40Z dwagelaa], [UML2ToPackageAPIOntology.atl 8082 2010-03-18 21:11:00Z dwagelaa], [UML2ToAPIOntology.atl 8082 2010-03-18 21:11:00Z dwagelaa], and [UML2Comparison.atl 8082 2010-03-18 21:11:00Z dwagelaa]
rights: © 2010, Vrije Universiteit Brussel. All rights reserved.
imports: isa.owl
imports: j2se-1 4.owl
imports: java.owl
imports: platform.owl

J2SE5 0API
type: Class
subclass of: JavaAppletAPI
subclass of: JavaAwtAPI
subclass of: JavaAwtColorAPI
subclass of: JavaAwtDatatransferAPI
subclass of: JavaAwtDndAPI
subclass of: JavaAwtEventAPI
subclass of: JavaAwtFontAPI
subclass of: JavaAwtGeomAPI
subclass of: JavaAwtImAPI
subclass of: JavaAwtImSpiAPI
subclass of: JavaAwtImageAPI
subclass of: JavaAwtImageRenderableAPI
subclass of: JavaAwtPrintAPI
subclass of: JavaBeansAPI
subclass of: JavaBeansBeancontextAPI
subclass of: JavaIoAPI
subclass of: JavaLangAPI
subclass of: JavaLangAnnotationAPI
subclass of: JavaLangInstrumentAPI
subclass of: JavaLangManagementAPI
subclass of: JavaLangRefAPI
subclass of: JavaLangReflectAPI
subclass of: JavaMathAPI
subclass of: JavaNetAPI
subclass of: JavaNioAPI
subclass of: JavaNioChannelsAPI
subclass of: JavaNioChannelsSpiAPI
subclass of: JavaNioCharsetAPI
subclass of: JavaNioCharsetSpiAPI
subclass of: JavaRmiAPI
subclass of: JavaRmiActivationAPI
subclass of: JavaRmiDgcAPI
subclass of: JavaRmiRegistryAPI
subclass of: JavaRmiServerAPI
subclass of: JavaSecurityAPI
subclass of: JavaSecurityAclAPI
subclass of: JavaSecurityCertAPI
subclass of: JavaSecurityInterfacesAPI
subclass of: JavaSecuritySpecAPI
subclass of: JavaSqlAPI
subclass of: JavaTextAPI
subclass of: JavaUtilAPI
subclass of: JavaUtilConcurrentAPI
subclass of: JavaUtilConcurrentAtomicAPI
subclass of: JavaUtilConcurrentLocksAPI
subclass of: JavaUtilJarAPI
subclass of: JavaUtilLoggingAPI
subclass of: JavaUtilPrefsAPI
subclass of: JavaUtilRegexAPI
subclass of: JavaUtilZipAPI
subclass of: JavaxAccessibilityAPI
subclass of: JavaxActivityAPI
subclass of: JavaxCryptoAPI
subclass of: JavaxCryptoInterfacesAPI
subclass of: JavaxCryptoSpecAPI
subclass of: JavaxImageioAPI
subclass of: JavaxImageioEventAPI
subclass of: JavaxImageioMetadataAPI
subclass of: JavaxImageioPluginsBmpAPI
subclass of: JavaxImageioPluginsJpegAPI
subclass of: JavaxImageioSpiAPI
subclass of: JavaxImageioStreamAPI
subclass of: JavaxManagementAPI
subclass of: JavaxManagementLoadingAPI
subclass of: JavaxManagementModelmbeanAPI
subclass of: JavaxManagementMonitorAPI
subclass of: JavaxManagementOpenmbeanAPI
subclass of: JavaxManagementRelationAPI
subclass of: JavaxManagementRemoteAPI
subclass of: JavaxManagementRemoteRmiAPI
subclass of: JavaxManagementTimerAPI
subclass of: JavaxNamingAPI
subclass of: JavaxNamingDirectoryAPI
subclass of: JavaxNamingEventAPI
subclass of: JavaxNamingLdapAPI
subclass of: JavaxNamingSpiAPI
subclass of: JavaxNetAPI
subclass of: JavaxNetSslAPI
subclass of: JavaxPrintAPI

J2SE5 0BytecodeFormat
type: Class
equivalent class: Class
  intersection of: Restriction
    on property: majorVersionNumber
    some values from: Datatype
      on datatype: integer
      with restrictions:
        min inclusive: 49
  intersection of: Restriction
    on property: preverified
    has value: false
subclass of: J2SE1 4BytecodeFormat
comment: J2SE 5.0 bytecode format

J2SE5 0ClassLibrary
type: Class
subclass of: JavaAppletClassLibrary
subclass of: JavaAwtClassLibrary
subclass of: JavaAwtColorClassLibrary
subclass of: JavaAwtDatatransferClassLibrary
subclass of: JavaAwtDndClassLibrary
subclass of: JavaAwtEventClassLibrary
subclass of: JavaAwtFontClassLibrary
subclass of: JavaAwtGeomClassLibrary
subclass of: JavaAwtImClassLibrary
subclass of: JavaAwtImSpiClassLibrary
subclass of: JavaAwtImageClassLibrary
subclass of: JavaAwtImageRenderableClassLibrary
subclass of: JavaAwtPrintClassLibrary
subclass of: JavaBeansBeancontextClassLibrary
subclass of: JavaBeansClassLibrary
subclass of: JavaIoClassLibrary
subclass of: JavaLangAnnotationClassLibrary
subclass of: JavaLangClassLibrary
subclass of: JavaLangInstrumentClassLibrary
subclass of: JavaLangManagementClassLibrary
subclass of: JavaLangRefClassLibrary
subclass of: JavaLangReflectClassLibrary
subclass of: JavaMathClassLibrary
subclass of: JavaNetClassLibrary
subclass of: JavaNioChannelsClassLibrary
subclass of: JavaNioChannelsSpiClassLibrary
subclass of: JavaNioCharsetClassLibrary
subclass of: JavaNioCharsetSpiClassLibrary
subclass of: JavaNioClassLibrary
subclass of: JavaRmiActivationClassLibrary
subclass of: JavaRmiClassLibrary
subclass of: JavaRmiDgcClassLibrary
subclass of: JavaRmiRegistryClassLibrary
subclass of: JavaRmiServerClassLibrary
subclass of: JavaSecurityAclClassLibrary
subclass of: JavaSecurityCertClassLibrary
subclass of: JavaSecurityClassLibrary
subclass of: JavaSecurityInterfacesClassLibrary
subclass of: JavaSecuritySpecClassLibrary
subclass of: JavaSqlClassLibrary
subclass of: JavaTextClassLibrary
subclass of: JavaUtilClassLibrary
subclass of: JavaUtilConcurrentAtomicClassLibrary
subclass of: JavaUtilConcurrentClassLibrary
subclass of: JavaUtilConcurrentLocksClassLibrary
subclass of: JavaUtilJarClassLibrary
subclass of: JavaUtilLoggingClassLibrary
subclass of: JavaUtilPrefsClassLibrary
subclass of: JavaUtilRegexClassLibrary
subclass of: JavaUtilZipClassLibrary
subclass of: JavaxAccessibilityClassLibrary
subclass of: JavaxActivityClassLibrary
subclass of: JavaxCryptoClassLibrary
subclass of: JavaxCryptoInterfacesClassLibrary
subclass of: JavaxCryptoSpecClassLibrary
subclass of: JavaxImageioClassLibrary
subclass of: JavaxImageioEventClassLibrary
subclass of: JavaxImageioMetadataClassLibrary
subclass of: JavaxImageioPluginsBmpClassLibrary
subclass of: JavaxImageioPluginsJpegClassLibrary
subclass of: JavaxImageioSpiClassLibrary
subclass of: JavaxImageioStreamClassLibrary
subclass of: JavaxManagementClassLibrary
subclass of: JavaxManagementLoadingClassLibrary
subclass of: JavaxManagementModelmbeanClassLibrary
subclass of: JavaxManagementMonitorClassLibrary
subclass of: JavaxManagementOpenmbeanClassLibrary
subclass of: JavaxManagementRelationClassLibrary
subclass of: JavaxManagementRemoteClassLibrary
subclass of: JavaxManagementRemoteRmiClassLibrary
subclass of: JavaxManagementTimerClassLibrary
subclass of: JavaxNamingClassLibrary
subclass of: JavaxNamingDirectoryClassLibrary
subclass of: JavaxNamingEventClassLibrary
subclass of: JavaxNamingLdapClassLibrary
subclass of: JavaxNamingSpiClassLibrary
subclass of: JavaxNetClassLibrary
subclass of: JavaxNetSslClassLibrary
subclass of: JavaxPrintAttributeClassLibrary

J2SE5 0JRE
type: Class
equivalent class: Class
  intersection of: Restriction
    on property: providesFeature
    some values from: J2SE5 0ClassLibrary
  intersection of: Restriction
    on property: providesFeature
    some values from: J2SE5 0VM
subclass of: JRE
comment: J2SE 5.0 Java Runtime Environment

J2SE5 0VM
type: Class
equivalent class: Restriction
  on property: implementsInterface
  some values from: J2SE5 0BytecodeFormat
subclass of: JavaVM
comment: J2SE 5.0 virtual machine

JavaApplet
type: Class
subclass of: JavaApplet
comment: Java API part implementing the java.applet package for J2SE 5.0

JavaAppletAPI
type: Class
subclass of: JavaAppletAPI
comment: platform:comprisesInterfacePart some JavaApplet
comment: JavaLibrary implementing the java.applet package for J2SE 5.0

JavaAppletClassLibrary
type: Class
subclass of: JavaAppletClassLibrary
comment: platform:implementsInterface some JavaAppletAPI
comment: JavaLibrary implementing the java.applet package for J2SE 5.0

JavaAwt
type: Class
subclass of: JavaAwt
comment: Java API part implementing the java.awt package for J2SE 5.0

JavaAwtAPI
type: Class
subclass of: JavaAwtAPI
comment: platform:comprisesInterfacePart some JavaAwt
comment: JavaLibrary implementing the java.awt package for J2SE 5.0

JavaAwtClassLibrary
type: Class
subclass of: JavaAwtClassLibrary
comment: platform:implementsInterface some JavaAwtAPI
comment: JavaLibrary implementing the java.awt package for J2SE 5.0

JavaAwtColor
type: Class
subclass of: JavaAwtColor
comment: Java API part implementing the java.awt.color package for J2SE 5.0

JavaAwtColorAPI
type: Class
subclass of: JavaAwtColorAPI
comment: platform:comprisesInterfacePart some JavaAwtColor
comment: JavaLibrary implementing the java.awt.color package for J2SE 5.0

JavaAwtColorClassLibrary
type: Class
subclass of: JavaAwtColorClassLibrary
comment: platform:implementsInterface some JavaAwtColorAPI
comment: JavaLibrary implementing the java.awt.color package for J2SE 5.0

JavaAwtDatatransfer
type: Class
subclass of: JavaAwtDatatransfer
comment: Java API part implementing the java.awt.datatransfer package for J2SE 5.0

JavaAwtDatatransferAPI
type: Class
subclass of: JavaAwtDatatransferAPI
comment: platform:comprisesInterfacePart some JavaAwtDatatransfer
comment: JavaLibrary implementing the java.awt.datatransfer package for J2SE 5.0

JavaAwtDatatransferClassLibrary
type: Class
subclass of: JavaAwtDatatransferClassLibrary
comment: platform:implementsInterface some JavaAwtDatatransferAPI
comment: JavaLibrary implementing the java.awt.datatransfer package for J2SE 5.0

JavaAwtDnd
type: Class
subclass of: JavaAwtDnd
comment: Java API part implementing the java.awt.dnd package for J2SE 5.0

JavaAwtDndAPI
type: Class
subclass of: JavaAwtDndAPI
comment: platform:comprisesInterfacePart some JavaAwtDnd
comment: JavaLibrary implementing the java.awt.dnd package for J2SE 5.0

JavaAwtDndClassLibrary
type: Class
subclass of: JavaAwtDndClassLibrary
comment: platform:implementsInterface some JavaAwtDndAPI
comment: JavaLibrary implementing the java.awt.dnd package for J2SE 5.0

JavaAwtEvent
type: Class
subclass of: JavaAwtEvent
comment: Java API part implementing the java.awt.event package for J2SE 5.0

JavaAwtEventAPI
type: Class
subclass of: JavaAwtEventAPI
comment: platform:comprisesInterfacePart some JavaAwtEvent
comment: JavaLibrary implementing the java.awt.event package for J2SE 5.0

JavaAwtEventClassLibrary
type: Class
subclass of: JavaAwtEventClassLibrary
comment: platform:implementsInterface some JavaAwtEventAPI
comment: JavaLibrary implementing the java.awt.event package for J2SE 5.0

JavaAwtFont
type: Class
subclass of: JavaAPIPart
comment: Java API part implementing the java.awt.font package for J2SE 5.0

JavaAwtFontAPI
type: Class
subclass of: JavaAPI
comment: platform:comprisesInterfacePart some JavaAwtFont
comment: JavaLibrary implementing the java.awt.font package for J2SE 5.0

JavaAwtFontClassLibrary
type: Class
subclass of: JavaClassLibrary
comment: platform:implementsInterface some JavaAwtFontAPI
comment: JavaLibrary implementing the java.awt.font package for J2SE 5.0

JavaAwtGeom
type: Class
subclass of: JavaAPIPart
comment: Java API part implementing the java.awt.geom package for J2SE 5.0

JavaAwtGeomAPI
type: Class
subclass of: JavaAPI
comment: platform:comprisesInterfacePart some JavaAwtGeom
comment: JavaLibrary implementing the java.awt.geom package for J2SE 5.0

JavaAwtGeomClassLibrary
type: Class
subclass of: JavaClassLibrary
comment: platform:implementsInterface some JavaAwtGeomAPI
comment: JavaLibrary implementing the java.awt.geom package for J2SE 5.0

JavaAwtIm
type: Class
subclass of: JavaAPIPart
comment: Java API part implementing the java.awt.im package for J2SE 5.0

JavaAwtImAPI
type: Class
subclass of: JavaAPI
comment: platform:comprisesInterfacePart some JavaAwtIm
comment: JavaLibrary implementing the java.awt.im package for J2SE 5.0

JavaAwtImClassLibrary
type: Class
subclass of: JavaClassLibrary
comment: platform:implementsInterface some JavaAwtImAPI
comment: JavaLibrary implementing the java.awt.im package for J2SE 5.0

JavaAwtImSpi
type: Class
subclass of: JavaAPIPart
comment: Java API part implementing the java.awt.im.spi package for J2SE 5.0

JavaAwtImSpiAPI
type: Class
subclass of: JavaAPI
comment: platform:comprisesInterfacePart some JavaAwtImSpi
comment: JavaLibrary implementing the java.awt.im.spi package for J2SE 5.0

JavaAwtImSpiClassLibrary
type: Class
subclass of: JavaClassLibrary
comment: platform:implementsInterface some JavaAwtImSpiAPI
comment: JavaLibrary implementing the java.awt.im.spi package for J2SE 5.0

JavaAwtImage
type: Class
subclass of: JavaAwtImage
comment: Java API part implementing the java.awt.image package for J2SE 5.0

JavaAwtImageAPI
type: Class
subclass of: JavaAwtImageAPI
comment: platform:comprisesInterfacePart some JavaAwtImage
comment: JavaLibrary implementing the java.awt.image package for J2SE 5.0

JavaAwtImageClassLibrary
type: Class
subclass of: JavaAwtImageClassLibrary
comment: platform:implementsInterface some JavaAwtImageAPI
comment: JavaLibrary implementing the java.awt.image package for J2SE 5.0

JavaAwtImageRenderable
type: Class
subclass of: JavaAPIPart
comment: Java API part implementing the java.awt.image.renderable package for J2SE 5.0

JavaAwtImageRenderableAPI
type: Class
subclass of: JavaAPI
comment: platform:comprisesInterfacePart some JavaAwtImageRenderable
comment: JavaLibrary implementing the java.awt.image.renderable package for J2SE 5.0

JavaAwtImageRenderableClassLibrary
type: Class
subclass of: JavaClassLibrary
comment: platform:implementsInterface some JavaAwtImageRenderableAPI
comment: JavaLibrary implementing the java.awt.image.renderable package for J2SE 5.0

JavaAwtPrint
type: Class
subclass of: JavaAPIPart
comment: Java API part implementing the java.awt.print package for J2SE 5.0

JavaAwtPrintAPI
type: Class
subclass of: JavaAPI
comment: platform:comprisesInterfacePart some JavaAwtPrint
comment: JavaLibrary implementing the java.awt.print package for J2SE 5.0

JavaAwtPrintClassLibrary
type: Class
subclass of: JavaClassLibrary
comment: platform:implementsInterface some JavaAwtPrintAPI
comment: JavaLibrary implementing the java.awt.print package for J2SE 5.0

JavaBeans
type: Class
subclass of: JavaBeans
comment: Java API part implementing the java.beans package for J2SE 5.0

JavaBeansAPI
type: Class
subclass of: JavaBeansAPI
comment: platform:comprisesInterfacePart some JavaBeans
comment: JavaLibrary implementing the java.beans package for J2SE 5.0

JavaBeansBeancontext
type: Class
subclass of: JavaAPIPart
comment: Java API part implementing the java.beans.beancontext package for J2SE 5.0

JavaBeansBeancontextAPI
type: Class
subclass of: JavaAPI
comment: platform:comprisesInterfacePart some JavaBeansBeancontext
comment: JavaLibrary implementing the java.beans.beancontext package for J2SE 5.0

JavaBeansBeancontextClassLibrary
type: Class
subclass of: JavaClassLibrary
comment: platform:implementsInterface some JavaBeansBeancontextAPI
comment: JavaLibrary implementing the java.beans.beancontext package for J2SE 5.0

JavaBeansClassLibrary
type: Class
subclass of: JavaBeansClassLibrary
comment: platform:implementsInterface some JavaBeansAPI
comment: JavaLibrary implementing the java.beans package for J2SE 5.0

JavaIo
type: Class
subclass of: JavaIo
comment: Java API part implementing the java.io package for J2SE 5.0

JavaIoAPI
type: Class
subclass of: JavaIoAPI
comment: platform:comprisesInterfacePart some JavaIo
comment: JavaLibrary implementing the java.io package for J2SE 5.0

JavaIoClassLibrary
type: Class
subclass of: JavaIoClassLibrary
comment: platform:implementsInterface some JavaIoAPI
comment: JavaLibrary implementing the java.io package for J2SE 5.0

JavaLang
type: Class
subclass of: JavaLang
comment: Java API part implementing the java.lang package for J2SE 5.0

JavaLangAPI
type: Class
subclass of: JavaLangAPI
comment: platform:comprisesInterfacePart some JavaLang
comment: JavaLibrary implementing the java.lang package for J2SE 5.0

JavaLangAnnotation
type: Class
subclass of: JavaAPIPart
comment: Java API part implementing the java.lang.annotation package for J2SE 5.0

JavaLangAnnotationAPI
type: Class
subclass of: JavaAPI
comment: platform:comprisesInterfacePart some JavaLangAnnotation
comment: JavaLibrary implementing the java.lang.annotation package for J2SE 5.0

JavaLangAnnotationClassLibrary
type: Class
subclass of: JavaClassLibrary
comment: platform:implementsInterface some JavaLangAnnotationAPI
comment: JavaLibrary implementing the java.lang.annotation package for J2SE 5.0

JavaLangClassLibrary
type: Class
subclass of: JavaLangClassLibrary
comment: platform:implementsInterface some JavaLangAPI
comment: JavaLibrary implementing the java.lang package for J2SE 5.0

JavaLangInstrument
type: Class
subclass of: JavaAPIPart
comment: Java API part implementing the java.lang.instrument package for J2SE 5.0

JavaLangInstrumentAPI
type: Class
subclass of: JavaAPI
comment: platform:comprisesInterfacePart some JavaLangInstrument
comment: JavaLibrary implementing the java.lang.instrument package for J2SE 5.0

JavaLangInstrumentClassLibrary
type: Class
subclass of: JavaClassLibrary
comment: platform:implementsInterface some JavaLangInstrumentAPI
comment: JavaLibrary implementing the java.lang.instrument package for J2SE 5.0

JavaLangManagement
type: Class
subclass of: JavaAPIPart
comment: Java API part implementing the java.lang.management package for J2SE 5.0

JavaLangManagementAPI
type: Class
subclass of: JavaAPI
comment: platform:comprisesInterfacePart some JavaLangManagement
comment: JavaLibrary implementing the java.lang.management package for J2SE 5.0

JavaLangManagementClassLibrary
type: Class
subclass of: JavaClassLibrary
comment: platform:implementsInterface some JavaLangManagementAPI
comment: JavaLibrary implementing the java.lang.management package for J2SE 5.0

JavaLangRef
type: Class
subclass of: JavaAPIPart
comment: Java API part implementing the java.lang.ref package for J2SE 5.0

JavaLangRefAPI
type: Class
subclass of: JavaAPI
comment: platform:comprisesInterfacePart some JavaLangRef
comment: JavaLibrary implementing the java.lang.ref package for J2SE 5.0

JavaLangRefClassLibrary
type: Class
subclass of: JavaClassLibrary
comment: platform:implementsInterface some JavaLangRefAPI
comment: JavaLibrary implementing the java.lang.ref package for J2SE 5.0

JavaLangReflect
type: Class
subclass of: JavaLangReflect
comment: Java API part implementing the java.lang.reflect package for J2SE 5.0

JavaLangReflectAPI
type: Class
subclass of: JavaLangReflectAPI
comment: platform:comprisesInterfacePart some JavaLangReflect
comment: JavaLibrary implementing the java.lang.reflect package for J2SE 5.0

JavaLangReflectClassLibrary
type: Class
subclass of: JavaLangReflectClassLibrary
comment: platform:implementsInterface some JavaLangReflectAPI
comment: JavaLibrary implementing the java.lang.reflect package for J2SE 5.0

JavaMath
type: Class
subclass of: JavaMath
comment: Java API part implementing the java.math package for J2SE 5.0

JavaMathAPI
type: Class
subclass of: JavaMathAPI
comment: platform:comprisesInterfacePart some JavaMath
comment: JavaLibrary implementing the java.math package for J2SE 5.0

JavaMathClassLibrary
type: Class
subclass of: JavaMathClassLibrary
comment: platform:implementsInterface some JavaMathAPI
comment: JavaLibrary implementing the java.math package for J2SE 5.0

JavaNet
type: Class
subclass of: JavaNet
comment: Java API part implementing the java.net package for J2SE 5.0

JavaNetAPI
type: Class
subclass of: JavaNetAPI
comment: platform:comprisesInterfacePart some JavaNet
comment: JavaLibrary implementing the java.net package for J2SE 5.0

JavaNetClassLibrary
type: Class
subclass of: JavaNetClassLibrary
comment: platform:implementsInterface some JavaNetAPI
comment: JavaLibrary implementing the java.net package for J2SE 5.0

JavaNio
type: Class
subclass of: JavaNio
comment: Java API part implementing the java.nio package for J2SE 5.0

JavaNioAPI
type: Class
subclass of: JavaNioAPI
comment: platform:comprisesInterfacePart some JavaNio
comment: JavaLibrary implementing the java.nio package for J2SE 5.0

JavaNioChannels
type: Class
subclass of: JavaNioChannels
comment: Java API part implementing the java.nio.channels package for J2SE 5.0

JavaNioChannelsAPI
type: Class
subclass of: JavaNioChannelsAPI
comment: platform:comprisesInterfacePart some JavaNioChannels
comment: JavaLibrary implementing the java.nio.channels package for J2SE 5.0

JavaNioChannelsClassLibrary
type: Class
subclass of: JavaNioChannelsClassLibrary
comment: platform:implementsInterface some JavaNioChannelsAPI
comment: JavaLibrary implementing the java.nio.channels package for J2SE 5.0

JavaNioChannelsSpi
type: Class
subclass of: JavaNioChannelsSpi
comment: Java API part implementing the java.nio.channels.spi package for J2SE 5.0

JavaNioChannelsSpiAPI
type: Class
subclass of: JavaNioChannelsSpiAPI
comment: platform:comprisesInterfacePart some JavaNioChannelsSpi
comment: JavaLibrary implementing the java.nio.channels.spi package for J2SE 5.0

JavaNioChannelsSpiClassLibrary
type: Class
subclass of: JavaNioChannelsSpiClassLibrary
comment: platform:implementsInterface some JavaNioChannelsSpiAPI
comment: JavaLibrary implementing the java.nio.channels.spi package for J2SE 5.0

JavaNioCharset
type: Class
subclass of: JavaNioCharset
comment: Java API part implementing the java.nio.charset package for J2SE 5.0

JavaNioCharsetAPI
type: Class
subclass of: JavaNioCharsetAPI
comment: platform:comprisesInterfacePart some JavaNioCharset
comment: JavaLibrary implementing the java.nio.charset package for J2SE 5.0

JavaNioCharsetClassLibrary
type: Class
subclass of: JavaNioCharsetClassLibrary
comment: platform:implementsInterface some JavaNioCharsetAPI
comment: JavaLibrary implementing the java.nio.charset package for J2SE 5.0

JavaNioCharsetSpi
type: Class
subclass of: JavaAPIPart
comment: Java API part implementing the java.nio.charset.spi package for J2SE 5.0

JavaNioCharsetSpiAPI
type: Class
subclass of: JavaAPI
comment: platform:comprisesInterfacePart some JavaNioCharsetSpi
comment: JavaLibrary implementing the java.nio.charset.spi package for J2SE 5.0

JavaNioCharsetSpiClassLibrary
type: Class
subclass of: JavaClassLibrary
comment: platform:implementsInterface some JavaNioCharsetSpiAPI
comment: JavaLibrary implementing the java.nio.charset.spi package for J2SE 5.0

JavaNioClassLibrary
type: Class
subclass of: JavaNioClassLibrary
comment: platform:implementsInterface some JavaNioAPI
comment: JavaLibrary implementing the java.nio package for J2SE 5.0

JavaRmi
type: Class
subclass of: JavaAPIPart
comment: Java API part implementing the java.rmi package for J2SE 5.0

JavaRmiAPI
type: Class
subclass of: JavaAPI
comment: platform:comprisesInterfacePart some JavaRmi
comment: JavaLibrary implementing the java.rmi package for J2SE 5.0

JavaRmiActivation
type: Class
subclass of: JavaAPIPart
comment: Java API part implementing the java.rmi.activation package for J2SE 5.0

JavaRmiActivationAPI
type: Class
subclass of: JavaAPI
comment: platform:comprisesInterfacePart some JavaRmiActivation
comment: JavaLibrary implementing the java.rmi.activation package for J2SE 5.0

JavaRmiActivationClassLibrary
type: Class
subclass of: JavaClassLibrary
comment: platform:implementsInterface some JavaRmiActivationAPI
comment: JavaLibrary implementing the java.rmi.activation package for J2SE 5.0

JavaRmiClassLibrary
type: Class
subclass of: JavaClassLibrary
comment: platform:implementsInterface some JavaRmiAPI
comment: JavaLibrary implementing the java.rmi package for J2SE 5.0

JavaRmiDgc
type: Class
subclass of: JavaAPIPart
comment: Java API part implementing the java.rmi.dgc package for J2SE 5.0

JavaRmiDgcAPI
type: Class
subclass of: JavaAPI
comment: platform:comprisesInterfacePart some JavaRmiDgc
comment: JavaLibrary implementing the java.rmi.dgc package for J2SE 5.0

JavaRmiDgcClassLibrary
type: Class
subclass of: JavaClassLibrary
comment: platform:implementsInterface some JavaRmiDgcAPI
comment: JavaLibrary implementing the java.rmi.dgc package for J2SE 5.0

JavaRmiRegistry
type: Class
subclass of: JavaAPIPart
comment: Java API part implementing the java.rmi.registry package for J2SE 5.0

JavaRmiRegistryAPI
type: Class
subclass of: JavaAPI
comment: platform:comprisesInterfacePart some JavaRmiRegistry
comment: JavaLibrary implementing the java.rmi.registry package for J2SE 5.0

JavaRmiRegistryClassLibrary
type: Class
subclass of: JavaClassLibrary
comment: platform:implementsInterface some JavaRmiRegistryAPI
comment: JavaLibrary implementing the java.rmi.registry package for J2SE 5.0

JavaRmiServer
type: Class
subclass of: JavaRmiServer
comment: Java API part implementing the java.rmi.server package for J2SE 5.0

JavaRmiServerAPI
type: Class
subclass of: JavaRmiServerAPI
comment: platform:comprisesInterfacePart some JavaRmiServer
comment: JavaLibrary implementing the java.rmi.server package for J2SE 5.0

JavaRmiServerClassLibrary
type: Class
subclass of: JavaRmiServerClassLibrary
comment: platform:implementsInterface some JavaRmiServerAPI
comment: JavaLibrary implementing the java.rmi.server package for J2SE 5.0

JavaSecurity
type: Class
subclass of: JavaSecurity
comment: Java API part implementing the java.security package for J2SE 5.0

JavaSecurityAPI
type: Class
subclass of: JavaSecurityAPI
comment: platform:comprisesInterfacePart some JavaSecurity
comment: JavaLibrary implementing the java.security package for J2SE 5.0

JavaSecurityAcl
type: Class
subclass of: JavaAPIPart
comment: Java API part implementing the java.security.acl package for J2SE 5.0

JavaSecurityAclAPI
type: Class
subclass of: JavaAPI
comment: platform:comprisesInterfacePart some JavaSecurityAcl
comment: JavaLibrary implementing the java.security.acl package for J2SE 5.0

JavaSecurityAclClassLibrary
type: Class
subclass of: JavaClassLibrary
comment: platform:implementsInterface some JavaSecurityAclAPI
comment: JavaLibrary implementing the java.security.acl package for J2SE 5.0

JavaSecurityCert
type: Class
subclass of: JavaAPIPart
comment: Java API part implementing the java.security.cert package for J2SE 5.0

JavaSecurityCertAPI
type: Class
subclass of: JavaAPI
comment: platform:comprisesInterfacePart some JavaSecurityCert
comment: JavaLibrary implementing the java.security.cert package for J2SE 5.0

JavaSecurityCertClassLibrary
type: Class
subclass of: JavaClassLibrary
comment: platform:implementsInterface some JavaSecurityCertAPI
comment: JavaLibrary implementing the java.security.cert package for J2SE 5.0

JavaSecurityClassLibrary
type: Class
subclass of: JavaSecurityClassLibrary
comment: platform:implementsInterface some JavaSecurityAPI
comment: JavaLibrary implementing the java.security package for J2SE 5.0

JavaSecurityInterfaces
type: Class
subclass of: JavaSecurityInterfaces
comment: Java API part implementing the java.security.interfaces package for J2SE 5.0

JavaSecurityInterfacesAPI
type: Class
subclass of: JavaSecurityInterfacesAPI
comment: platform:comprisesInterfacePart some JavaSecurityInterfaces
comment: JavaLibrary implementing the java.security.interfaces package for J2SE 5.0

JavaSecurityInterfacesClassLibrary
type: Class
subclass of: JavaSecurityInterfacesClassLibrary
comment: platform:implementsInterface some JavaSecurityInterfacesAPI
comment: JavaLibrary implementing the java.security.interfaces package for J2SE 5.0

JavaSecuritySpec
type: Class
subclass of: JavaSecuritySpec
comment: Java API part implementing the java.security.spec package for J2SE 5.0

JavaSecuritySpecAPI
type: Class
subclass of: JavaSecuritySpecAPI
comment: platform:comprisesInterfacePart some JavaSecuritySpec
comment: JavaLibrary implementing the java.security.spec package for J2SE 5.0

JavaSecuritySpecClassLibrary
type: Class
subclass of: JavaSecuritySpecClassLibrary
comment: platform:implementsInterface some JavaSecuritySpecAPI
comment: JavaLibrary implementing the java.security.spec package for J2SE 5.0

JavaSql
type: Class
subclass of: JavaAPIPart
comment: Java API part implementing the java.sql package for J2SE 5.0

JavaSqlAPI
type: Class
subclass of: JavaAPI
comment: platform:comprisesInterfacePart some JavaSql
comment: JavaLibrary implementing the java.sql package for J2SE 5.0

JavaSqlClassLibrary
type: Class
subclass of: JavaClassLibrary
comment: platform:implementsInterface some JavaSqlAPI
comment: JavaLibrary implementing the java.sql package for J2SE 5.0

JavaText
type: Class
subclass of: JavaText
comment: Java API part implementing the java.text package for J2SE 5.0

JavaTextAPI
type: Class
subclass of: JavaTextAPI
comment: platform:comprisesInterfacePart some JavaText
comment: JavaLibrary implementing the java.text package for J2SE 5.0

JavaTextClassLibrary
type: Class
subclass of: JavaTextClassLibrary
comment: platform:implementsInterface some JavaTextAPI
comment: JavaLibrary implementing the java.text package for J2SE 5.0

JavaUtil
type: Class
subclass of: JavaUtil
comment: Java API part implementing the java.util package for J2SE 5.0

JavaUtilAPI
type: Class
subclass of: JavaUtilAPI
comment: platform:comprisesInterfacePart some JavaUtil
comment: JavaLibrary implementing the java.util package for J2SE 5.0

JavaUtilClassLibrary
type: Class
subclass of: JavaUtilClassLibrary
comment: platform:implementsInterface some JavaUtilAPI
comment: JavaLibrary implementing the java.util package for J2SE 5.0

JavaUtilConcurrent
type: Class
subclass of: JavaAPIPart
comment: Java API part implementing the java.util.concurrent package for J2SE 5.0

JavaUtilConcurrentAPI
type: Class
subclass of: JavaAPI
comment: platform:comprisesInterfacePart some JavaUtilConcurrent
comment: JavaLibrary implementing the java.util.concurrent package for J2SE 5.0

JavaUtilConcurrentAtomic
type: Class
subclass of: JavaAPIPart
comment: Java API part implementing the java.util.concurrent.atomic package for J2SE 5.0

JavaUtilConcurrentAtomicAPI
type: Class
subclass of: JavaAPI
comment: platform:comprisesInterfacePart some JavaUtilConcurrentAtomic
comment: JavaLibrary implementing the java.util.concurrent.atomic package for J2SE 5.0

JavaUtilConcurrentAtomicClassLibrary
type: Class
subclass of: JavaClassLibrary
comment: platform:implementsInterface some JavaUtilConcurrentAtomicAPI
comment: JavaLibrary implementing the java.util.concurrent.atomic package for J2SE 5.0

JavaUtilConcurrentClassLibrary
type: Class
subclass of: JavaClassLibrary
comment: platform:implementsInterface some JavaUtilConcurrentAPI
comment: JavaLibrary implementing the java.util.concurrent package for J2SE 5.0

JavaUtilConcurrentLocks
type: Class
subclass of: JavaAPIPart
comment: Java API part implementing the java.util.concurrent.locks package for J2SE 5.0

JavaUtilConcurrentLocksAPI
type: Class
subclass of: JavaAPI
comment: platform:comprisesInterfacePart some JavaUtilConcurrentLocks
comment: JavaLibrary implementing the java.util.concurrent.locks package for J2SE 5.0

JavaUtilConcurrentLocksClassLibrary
type: Class
subclass of: JavaClassLibrary
comment: platform:implementsInterface some JavaUtilConcurrentLocksAPI
comment: JavaLibrary implementing the java.util.concurrent.locks package for J2SE 5.0

JavaUtilJar
type: Class
subclass of: JavaUtilJar
comment: Java API part implementing the java.util.jar package for J2SE 5.0

JavaUtilJarAPI
type: Class
subclass of: JavaUtilJarAPI
comment: platform:comprisesInterfacePart some JavaUtilJar
comment: JavaLibrary implementing the java.util.jar package for J2SE 5.0

JavaUtilJarClassLibrary
type: Class
subclass of: JavaUtilJarClassLibrary
comment: platform:implementsInterface some JavaUtilJarAPI
comment: JavaLibrary implementing the java.util.jar package for J2SE 5.0

JavaUtilLogging
type: Class
subclass of: JavaUtilLogging
comment: Java API part implementing the java.util.logging package for J2SE 5.0

JavaUtilLoggingAPI
type: Class
subclass of: JavaUtilLoggingAPI
comment: platform:comprisesInterfacePart some JavaUtilLogging
comment: JavaLibrary implementing the java.util.logging package for J2SE 5.0

JavaUtilLoggingClassLibrary
type: Class
subclass of: JavaUtilLoggingClassLibrary
comment: platform:implementsInterface some JavaUtilLoggingAPI
comment: JavaLibrary implementing the java.util.logging package for J2SE 5.0

JavaUtilPrefs
type: Class
subclass of: JavaAPIPart
comment: Java API part implementing the java.util.prefs package for J2SE 5.0

JavaUtilPrefsAPI
type: Class
subclass of: JavaAPI
comment: platform:comprisesInterfacePart some JavaUtilPrefs
comment: JavaLibrary implementing the java.util.prefs package for J2SE 5.0

JavaUtilPrefsClassLibrary
type: Class
subclass of: JavaClassLibrary
comment: platform:implementsInterface some JavaUtilPrefsAPI
comment: JavaLibrary implementing the java.util.prefs package for J2SE 5.0

JavaUtilRegex
type: Class
subclass of: JavaUtilRegex
comment: Java API part implementing the java.util.regex package for J2SE 5.0

JavaUtilRegexAPI
type: Class
subclass of: JavaUtilRegexAPI
comment: platform:comprisesInterfacePart some JavaUtilRegex
comment: JavaLibrary implementing the java.util.regex package for J2SE 5.0

JavaUtilRegexClassLibrary
type: Class
subclass of: JavaUtilRegexClassLibrary
comment: platform:implementsInterface some JavaUtilRegexAPI
comment: JavaLibrary implementing the java.util.regex package for J2SE 5.0

JavaUtilZip
type: Class
subclass of: JavaUtilZip
comment: Java API part implementing the java.util.zip package for J2SE 5.0

JavaUtilZipAPI
type: Class
subclass of: JavaUtilZipAPI
comment: platform:comprisesInterfacePart some JavaUtilZip
comment: JavaLibrary implementing the java.util.zip package for J2SE 5.0

JavaUtilZipClassLibrary
type: Class
subclass of: JavaUtilZipClassLibrary
comment: platform:implementsInterface some JavaUtilZipAPI
comment: JavaLibrary implementing the java.util.zip package for J2SE 5.0

JavaxAccessibility
type: Class
subclass of: JavaxAccessibility
comment: Java API part implementing the javax.accessibility package for J2SE 5.0

JavaxAccessibilityAPI
type: Class
subclass of: JavaxAccessibilityAPI
comment: platform:comprisesInterfacePart some JavaxAccessibility
comment: JavaLibrary implementing the javax.accessibility package for J2SE 5.0

JavaxAccessibilityClassLibrary
type: Class
subclass of: JavaxAccessibilityClassLibrary
comment: platform:implementsInterface some JavaxAccessibilityAPI
comment: JavaLibrary implementing the javax.accessibility package for J2SE 5.0

JavaxActivity
type: Class
subclass of: JavaAPIPart
comment: Java API part implementing the javax.activity package for J2SE 5.0

JavaxActivityAPI
type: Class
subclass of: JavaAPI
comment: platform:comprisesInterfacePart some JavaxActivity
comment: JavaLibrary implementing the javax.activity package for J2SE 5.0

JavaxActivityClassLibrary
type: Class
subclass of: JavaClassLibrary
comment: platform:implementsInterface some JavaxActivityAPI
comment: JavaLibrary implementing the javax.activity package for J2SE 5.0

JavaxCrypto
type: Class
subclass of: JavaxCrypto
comment: Java API part implementing the javax.crypto package for J2SE 5.0

JavaxCryptoAPI
type: Class
subclass of: JavaxCryptoAPI
comment: platform:comprisesInterfacePart some JavaxCrypto
comment: JavaLibrary implementing the javax.crypto package for J2SE 5.0

JavaxCryptoClassLibrary
type: Class
subclass of: JavaxCryptoClassLibrary
comment: platform:implementsInterface some JavaxCryptoAPI
comment: JavaLibrary implementing the javax.crypto package for J2SE 5.0

JavaxCryptoInterfaces
type: Class
subclass of: JavaAPIPart
comment: Java API part implementing the javax.crypto.interfaces package for J2SE 5.0

JavaxCryptoInterfacesAPI
type: Class
subclass of: JavaAPI
comment: platform:comprisesInterfacePart some JavaxCryptoInterfaces
comment: JavaLibrary implementing the javax.crypto.interfaces package for J2SE 5.0

JavaxCryptoInterfacesClassLibrary
type: Class
subclass of: JavaClassLibrary
comment: platform:implementsInterface some JavaxCryptoInterfacesAPI
comment: JavaLibrary implementing the javax.crypto.interfaces package for J2SE 5.0

JavaxCryptoSpec
type: Class
subclass of: JavaxCryptoSpec
comment: Java API part implementing the javax.crypto.spec package for J2SE 5.0

JavaxCryptoSpecAPI
type: Class
subclass of: JavaxCryptoSpecAPI
comment: platform:comprisesInterfacePart some JavaxCryptoSpec
comment: JavaLibrary implementing the javax.crypto.spec package for J2SE 5.0

JavaxCryptoSpecClassLibrary
type: Class
subclass of: JavaxCryptoSpecClassLibrary
comment: platform:implementsInterface some JavaxCryptoSpecAPI
comment: JavaLibrary implementing the javax.crypto.spec package for J2SE 5.0

JavaxImageio
type: Class
subclass of: JavaAPIPart
comment: Java API part implementing the javax.imageio package for J2SE 5.0

JavaxImageioAPI
type: Class
subclass of: JavaAPI
comment: platform:comprisesInterfacePart some JavaxImageio
comment: JavaLibrary implementing the javax.imageio package for J2SE 5.0

JavaxImageioClassLibrary
type: Class
subclass of: JavaClassLibrary
comment: platform:implementsInterface some JavaxImageioAPI
comment: JavaLibrary implementing the javax.imageio package for J2SE 5.0

JavaxImageioEvent
type: Class
subclass of: JavaAPIPart
comment: Java API part implementing the javax.imageio.event package for J2SE 5.0

JavaxImageioEventAPI
type: Class
subclass of: JavaAPI
comment: platform:comprisesInterfacePart some JavaxImageioEvent
comment: JavaLibrary implementing the javax.imageio.event package for J2SE 5.0

JavaxImageioEventClassLibrary
type: Class
subclass of: JavaClassLibrary
comment: platform:implementsInterface some JavaxImageioEventAPI
comment: JavaLibrary implementing the javax.imageio.event package for J2SE 5.0

JavaxImageioMetadata
type: Class
subclass of: JavaxImageioMetadata
comment: Java API part implementing the javax.imageio.metadata package for J2SE 5.0

JavaxImageioMetadataAPI
type: Class
subclass of: JavaxImageioMetadataAPI
comment: platform:comprisesInterfacePart some JavaxImageioMetadata
comment: JavaLibrary implementing the javax.imageio.metadata package for J2SE 5.0

JavaxImageioMetadataClassLibrary
type: Class
subclass of: JavaxImageioMetadataClassLibrary
comment: platform:implementsInterface some JavaxImageioMetadataAPI
comment: JavaLibrary implementing the javax.imageio.metadata package for J2SE 5.0

JavaxImageioPluginsBmp
type: Class
subclass of: JavaAPIPart
comment: Java API part implementing the javax.imageio.plugins.bmp package for J2SE 5.0

JavaxImageioPluginsBmpAPI
type: Class
subclass of: JavaAPI
comment: platform:comprisesInterfacePart some JavaxImageioPluginsBmp
comment: JavaLibrary implementing the javax.imageio.plugins.bmp package for J2SE 5.0

JavaxImageioPluginsBmpClassLibrary
type: Class
subclass of: JavaClassLibrary
comment: platform:implementsInterface some JavaxImageioPluginsBmpAPI
comment: JavaLibrary implementing the javax.imageio.plugins.bmp package for J2SE 5.0

JavaxImageioPluginsJpeg
type: Class
subclass of: JavaAPIPart
comment: Java API part implementing the javax.imageio.plugins.jpeg package for J2SE 5.0

JavaxImageioPluginsJpegAPI
type: Class
subclass of: JavaAPI
comment: platform:comprisesInterfacePart some JavaxImageioPluginsJpeg
comment: JavaLibrary implementing the javax.imageio.plugins.jpeg package for J2SE 5.0

JavaxImageioPluginsJpegClassLibrary
type: Class
subclass of: JavaClassLibrary
comment: platform:implementsInterface some JavaxImageioPluginsJpegAPI
comment: JavaLibrary implementing the javax.imageio.plugins.jpeg package for J2SE 5.0

JavaxImageioSpi
type: Class
subclass of: JavaAPIPart
comment: Java API part implementing the javax.imageio.spi package for J2SE 5.0

JavaxImageioSpiAPI
type: Class
subclass of: JavaAPI
comment: platform:comprisesInterfacePart some JavaxImageioSpi
comment: JavaLibrary implementing the javax.imageio.spi package for J2SE 5.0

JavaxImageioSpiClassLibrary
type: Class
subclass of: JavaClassLibrary
comment: platform:implementsInterface some JavaxImageioSpiAPI
comment: JavaLibrary implementing the javax.imageio.spi package for J2SE 5.0

JavaxImageioStream
type: Class
subclass of: JavaAPIPart
comment: Java API part implementing the javax.imageio.stream package for J2SE 5.0

JavaxImageioStreamAPI
type: Class
subclass of: JavaAPI
comment: platform:comprisesInterfacePart some JavaxImageioStream
comment: JavaLibrary implementing the javax.imageio.stream package for J2SE 5.0

JavaxImageioStreamClassLibrary
type: Class
subclass of: JavaClassLibrary
comment: platform:implementsInterface some JavaxImageioStreamAPI
comment: JavaLibrary implementing the javax.imageio.stream package for J2SE 5.0

JavaxManagement
type: Class
subclass of: JavaAPIPart
comment: Java API part implementing the javax.management package for J2SE 5.0

JavaxManagementAPI
type: Class
subclass of: JavaAPI
comment: platform:comprisesInterfacePart some JavaxManagement
comment: JavaLibrary implementing the javax.management package for J2SE 5.0

JavaxManagementClassLibrary
type: Class
subclass of: JavaClassLibrary
comment: platform:implementsInterface some JavaxManagementAPI
comment: JavaLibrary implementing the javax.management package for J2SE 5.0

JavaxManagementLoading
type: Class
subclass of: JavaAPIPart
comment: Java API part implementing the javax.management.loading package for J2SE 5.0

JavaxManagementLoadingAPI
type: Class
subclass of: JavaAPI
comment: platform:comprisesInterfacePart some JavaxManagementLoading
comment: JavaLibrary implementing the javax.management.loading package for J2SE 5.0

JavaxManagementLoadingClassLibrary
type: Class
subclass of: JavaClassLibrary
comment: platform:implementsInterface some JavaxManagementLoadingAPI
comment: JavaLibrary implementing the javax.management.loading package for J2SE 5.0

JavaxManagementModelmbean
type: Class
subclass of: JavaAPIPart
comment: Java API part implementing the javax.management.modelmbean package for J2SE 5.0

JavaxManagementModelmbeanAPI
type: Class
subclass of: JavaAPI
comment: platform:comprisesInterfacePart some JavaxManagementModelmbean
comment: JavaLibrary implementing the javax.management.modelmbean package for J2SE 5.0

JavaxManagementModelmbeanClassLibrary
type: Class
subclass of: JavaClassLibrary
comment: platform:implementsInterface some JavaxManagementModelmbeanAPI
comment: JavaLibrary implementing the javax.management.modelmbean package for J2SE 5.0

JavaxManagementMonitor
type: Class
subclass of: JavaAPIPart
comment: Java API part implementing the javax.management.monitor package for J2SE 5.0

JavaxManagementMonitorAPI
type: Class
subclass of: JavaAPI
comment: platform:comprisesInterfacePart some JavaxManagementMonitor
comment: JavaLibrary implementing the javax.management.monitor package for J2SE 5.0

JavaxManagementMonitorClassLibrary
type: Class
subclass of: JavaClassLibrary
comment: platform:implementsInterface some JavaxManagementMonitorAPI
comment: JavaLibrary implementing the javax.management.monitor package for J2SE 5.0

JavaxManagementOpenmbean
type: Class
subclass of: JavaAPIPart
comment: Java API part implementing the javax.management.openmbean package for J2SE 5.0

JavaxManagementOpenmbeanAPI
type: Class
subclass of: JavaAPI
comment: platform:comprisesInterfacePart some JavaxManagementOpenmbean
comment: JavaLibrary implementing the javax.management.openmbean package for J2SE 5.0

JavaxManagementOpenmbeanClassLibrary
type: Class
subclass of: JavaClassLibrary
comment: platform:implementsInterface some JavaxManagementOpenmbeanAPI
comment: JavaLibrary implementing the javax.management.openmbean package for J2SE 5.0

JavaxManagementRelation
type: Class
subclass of: JavaAPIPart
comment: Java API part implementing the javax.management.relation package for J2SE 5.0

JavaxManagementRelationAPI
type: Class
subclass of: JavaAPI
comment: platform:comprisesInterfacePart some JavaxManagementRelation
comment: JavaLibrary implementing the javax.management.relation package for J2SE 5.0

JavaxManagementRelationClassLibrary
type: Class
subclass of: JavaClassLibrary
comment: platform:implementsInterface some JavaxManagementRelationAPI
comment: JavaLibrary implementing the javax.management.relation package for J2SE 5.0

JavaxManagementRemote
type: Class
subclass of: JavaAPIPart
comment: Java API part implementing the javax.management.remote package for J2SE 5.0

JavaxManagementRemoteAPI
type: Class
subclass of: JavaAPI
comment: platform:comprisesInterfacePart some JavaxManagementRemote
comment: JavaLibrary implementing the javax.management.remote package for J2SE 5.0

JavaxManagementRemoteClassLibrary
type: Class
subclass of: JavaClassLibrary
comment: platform:implementsInterface some JavaxManagementRemoteAPI
comment: JavaLibrary implementing the javax.management.remote package for J2SE 5.0

JavaxManagementRemoteRmi
type: Class
subclass of: JavaAPIPart
comment: Java API part implementing the javax.management.remote.rmi package for J2SE 5.0

JavaxManagementRemoteRmiAPI
type: Class
subclass of: JavaAPI
comment: platform:comprisesInterfacePart some JavaxManagementRemoteRmi
comment: JavaLibrary implementing the javax.management.remote.rmi package for J2SE 5.0

JavaxManagementRemoteRmiClassLibrary
type: Class
subclass of: JavaClassLibrary
comment: platform:implementsInterface some JavaxManagementRemoteRmiAPI
comment: JavaLibrary implementing the javax.management.remote.rmi package for J2SE 5.0

JavaxManagementTimer
type: Class
subclass of: JavaAPIPart
comment: Java API part implementing the javax.management.timer package for J2SE 5.0

JavaxManagementTimerAPI
type: Class
subclass of: JavaAPI
comment: platform:comprisesInterfacePart some JavaxManagementTimer
comment: JavaLibrary implementing the javax.management.timer package for J2SE 5.0

JavaxManagementTimerClassLibrary
type: Class
subclass of: JavaClassLibrary
comment: platform:implementsInterface some JavaxManagementTimerAPI
comment: JavaLibrary implementing the javax.management.timer package for J2SE 5.0

JavaxNaming
type: Class
subclass of: JavaxNaming
comment: Java API part implementing the javax.naming package for J2SE 5.0

JavaxNamingAPI
type: Class
subclass of: JavaxNamingAPI
comment: platform:comprisesInterfacePart some JavaxNaming
comment: JavaLibrary implementing the javax.naming package for J2SE 5.0

JavaxNamingClassLibrary
type: Class
subclass of: JavaxNamingClassLibrary
comment: platform:implementsInterface some JavaxNamingAPI
comment: JavaLibrary implementing the javax.naming package for J2SE 5.0

JavaxNamingDirectory
type: Class
subclass of: JavaxNamingDirectory
comment: Java API part implementing the javax.naming.directory package for J2SE 5.0

JavaxNamingDirectoryAPI
type: Class
subclass of: JavaxNamingDirectoryAPI
comment: platform:comprisesInterfacePart some JavaxNamingDirectory
comment: JavaLibrary implementing the javax.naming.directory package for J2SE 5.0

JavaxNamingDirectoryClassLibrary
type: Class
subclass of: JavaxNamingDirectoryClassLibrary
comment: platform:implementsInterface some JavaxNamingDirectoryAPI
comment: JavaLibrary implementing the javax.naming.directory package for J2SE 5.0

JavaxNamingEvent
type: Class
subclass of: JavaAPIPart
comment: Java API part implementing the javax.naming.event package for J2SE 5.0

JavaxNamingEventAPI
type: Class
subclass of: JavaAPI
comment: platform:comprisesInterfacePart some JavaxNamingEvent
comment: JavaLibrary implementing the javax.naming.event package for J2SE 5.0

JavaxNamingEventClassLibrary
type: Class
subclass of: JavaClassLibrary
comment: platform:implementsInterface some JavaxNamingEventAPI
comment: JavaLibrary implementing the javax.naming.event package for J2SE 5.0

JavaxNamingLdap
type: Class
subclass of: JavaxNamingLdap
comment: Java API part implementing the javax.naming.ldap package for J2SE 5.0

JavaxNamingLdapAPI
type: Class
subclass of: JavaxNamingLdapAPI
comment: platform:comprisesInterfacePart some JavaxNamingLdap
comment: JavaLibrary implementing the javax.naming.ldap package for J2SE 5.0

JavaxNamingLdapClassLibrary
type: Class
subclass of: JavaxNamingLdapClassLibrary
comment: platform:implementsInterface some JavaxNamingLdapAPI
comment: JavaLibrary implementing the javax.naming.ldap package for J2SE 5.0

JavaxNamingSpi
type: Class
subclass of: JavaAPIPart
comment: Java API part implementing the javax.naming.spi package for J2SE 5.0

JavaxNamingSpiAPI
type: Class
subclass of: JavaAPI
comment: platform:comprisesInterfacePart some JavaxNamingSpi
comment: JavaLibrary implementing the javax.naming.spi package for J2SE 5.0

JavaxNamingSpiClassLibrary
type: Class
subclass of: JavaClassLibrary
comment: platform:implementsInterface some JavaxNamingSpiAPI
comment: JavaLibrary implementing the javax.naming.spi package for J2SE 5.0

JavaxNet
type: Class
subclass of: JavaAPIPart
comment: Java API part implementing the javax.net package for J2SE 5.0

JavaxNetAPI
type: Class
subclass of: JavaAPI
comment: platform:comprisesInterfacePart some JavaxNet
comment: JavaLibrary implementing the javax.net package for J2SE 5.0

JavaxNetClassLibrary
type: Class
subclass of: JavaClassLibrary
comment: platform:implementsInterface some JavaxNetAPI
comment: JavaLibrary implementing the javax.net package for J2SE 5.0

JavaxNetSsl
type: Class
subclass of: JavaxNetSsl
comment: Java API part implementing the javax.net.ssl package for J2SE 5.0

JavaxNetSslAPI
type: Class
subclass of: JavaxNetSslAPI
comment: platform:comprisesInterfacePart some JavaxNetSsl
comment: JavaLibrary implementing the javax.net.ssl package for J2SE 5.0

JavaxNetSslClassLibrary
type: Class
subclass of: JavaxNetSslClassLibrary
comment: platform:implementsInterface some JavaxNetSslAPI
comment: JavaLibrary implementing the javax.net.ssl package for J2SE 5.0

JavaxPrint
type: Class
subclass of: JavaAPIPart
comment: Java API part implementing the javax.print package for J2SE 5.0

JavaxPrintAPI
type: Class
subclass of: JavaAPI
comment: platform:comprisesInterfacePart some JavaxPrint
comment: JavaLibrary implementing the javax.print package for J2SE 5.0

JavaxPrintAttribute
type: Class
subclass of: JavaAPIPart
comment: Java API part implementing the javax.print.attribute package for J2SE 5.0

JavaxPrintAttributeAPI
type: Class
subclass of: JavaAPI
comment: platform:comprisesInterfacePart some JavaxPrintAttribute
comment: JavaLibrary implementing the javax.print.attribute package for J2SE 5.0

JavaxPrintAttributeClassLibrary
type: Class
subclass of: JavaClassLibrary
comment: platform:implementsInterface some JavaxPrintAttributeAPI
comment: JavaLibrary implementing the javax.print.attribute package for J2SE 5.0

JavaxPrintAttributeStandard
type: Class
subclass of: JavaxPrintAttributeStandard
comment: Java API part implementing the javax.print.attribute.standard package for J2SE 5.0

JavaxPrintAttributeStandardAPI
type: Class
subclass of: JavaxPrintAttributeStandardAPI
comment: platform:comprisesInterfacePart some JavaxPrintAttributeStandard
comment: JavaLibrary implementing the javax.print.attribute.standard package for J2SE 5.0

JavaxPrintAttributeStandardClassLibrary
type: Class
subclass of: JavaxPrintAttributeStandardClassLibrary
comment: platform:implementsInterface some JavaxPrintAttributeStandardAPI
comment: JavaLibrary implementing the javax.print.attribute.standard package for J2SE 5.0

JavaxPrintClassLibrary
type: Class
subclass of: JavaClassLibrary
comment: platform:implementsInterface some JavaxPrintAPI
comment: JavaLibrary implementing the javax.print package for J2SE 5.0

JavaxPrintEvent
type: Class
subclass of: JavaAPIPart
comment: Java API part implementing the javax.print.event package for J2SE 5.0

JavaxPrintEventAPI
type: Class
subclass of: JavaAPI
comment: platform:comprisesInterfacePart some JavaxPrintEvent
comment: JavaLibrary implementing the javax.print.event package for J2SE 5.0

JavaxPrintEventClassLibrary
type: Class
subclass of: JavaClassLibrary
comment: platform:implementsInterface some JavaxPrintEventAPI
comment: JavaLibrary implementing the javax.print.event package for J2SE 5.0

JavaxRmi
type: Class
subclass of: JavaAPIPart
comment: Java API part implementing the javax.rmi package for J2SE 5.0

JavaxRmiAPI
type: Class
subclass of: JavaAPI
comment: platform:comprisesInterfacePart some JavaxRmi
comment: JavaLibrary implementing the javax.rmi package for J2SE 5.0

JavaxRmiCORBA
type: Class
subclass of: JavaxRmiCORBA
comment: Java API part implementing the javax.rmi.CORBA package for J2SE 5.0

JavaxRmiCORBAAPI
type: Class
subclass of: JavaxRmiCORBAAPI
comment: platform:comprisesInterfacePart some JavaxRmiCORBA
comment: JavaLibrary implementing the javax.rmi.CORBA package for J2SE 5.0

JavaxRmiCORBAClassLibrary
type: Class
subclass of: JavaxRmiCORBAClassLibrary
comment: platform:implementsInterface some JavaxRmiCORBAAPI
comment: JavaLibrary implementing the javax.rmi.CORBA package for J2SE 5.0

JavaxRmiClassLibrary
type: Class
subclass of: JavaClassLibrary
comment: platform:implementsInterface some JavaxRmiAPI
comment: JavaLibrary implementing the javax.rmi package for J2SE 5.0

JavaxRmiSsl
type: Class
subclass of: JavaAPIPart
comment: Java API part implementing the javax.rmi.ssl package for J2SE 5.0

JavaxRmiSslAPI
type: Class
subclass of: JavaAPI
comment: platform:comprisesInterfacePart some JavaxRmiSsl
comment: JavaLibrary implementing the javax.rmi.ssl package for J2SE 5.0

JavaxRmiSslClassLibrary
type: Class
subclass of: JavaClassLibrary
comment: platform:implementsInterface some JavaxRmiSslAPI
comment: JavaLibrary implementing the javax.rmi.ssl package for J2SE 5.0

JavaxSecurityAuth
type: Class
subclass of: JavaAPIPart
comment: Java API part implementing the javax.security.auth package for J2SE 5.0

JavaxSecurityAuthAPI
type: Class
subclass of: JavaAPI
comment: platform:comprisesInterfacePart some JavaxSecurityAuth
comment: JavaLibrary implementing the javax.security.auth package for J2SE 5.0

JavaxSecurityAuthCallback
type: Class
subclass of: JavaAPIPart
comment: Java API part implementing the javax.security.auth.callback package for J2SE 5.0

JavaxSecurityAuthCallbackAPI
type: Class
subclass of: JavaAPI
comment: platform:comprisesInterfacePart some JavaxSecurityAuthCallback
comment: JavaLibrary implementing the javax.security.auth.callback package for J2SE 5.0

JavaxSecurityAuthCallbackClassLibrary
type: Class
subclass of: JavaClassLibrary
comment: platform:implementsInterface some JavaxSecurityAuthCallbackAPI
comment: JavaLibrary implementing the javax.security.auth.callback package for J2SE 5.0

JavaxSecurityAuthClassLibrary
type: Class
subclass of: JavaClassLibrary
comment: platform:implementsInterface some JavaxSecurityAuthAPI
comment: JavaLibrary implementing the javax.security.auth package for J2SE 5.0

JavaxSecurityAuthKerberos
type: Class
subclass of: JavaAPIPart
comment: Java API part implementing the javax.security.auth.kerberos package for J2SE 5.0

JavaxSecurityAuthKerberosAPI
type: Class
subclass of: JavaAPI
comment: platform:comprisesInterfacePart some JavaxSecurityAuthKerberos
comment: JavaLibrary implementing the javax.security.auth.kerberos package for J2SE 5.0

JavaxSecurityAuthKerberosClassLibrary
type: Class
subclass of: JavaClassLibrary
comment: platform:implementsInterface some JavaxSecurityAuthKerberosAPI
comment: JavaLibrary implementing the javax.security.auth.kerberos package for J2SE 5.0

JavaxSecurityAuthLogin
type: Class
subclass of: JavaxSecurityAuthLogin
comment: Java API part implementing the javax.security.auth.login package for J2SE 5.0

JavaxSecurityAuthLoginAPI
type: Class
subclass of: JavaxSecurityAuthLoginAPI
comment: platform:comprisesInterfacePart some JavaxSecurityAuthLogin
comment: JavaLibrary implementing the javax.security.auth.login package for J2SE 5.0

JavaxSecurityAuthLoginClassLibrary
type: Class
subclass of: JavaxSecurityAuthLoginClassLibrary
comment: platform:implementsInterface some JavaxSecurityAuthLoginAPI
comment: JavaLibrary implementing the javax.security.auth.login package for J2SE 5.0

JavaxSecurityAuthSpi
type: Class
subclass of: JavaAPIPart
comment: Java API part implementing the javax.security.auth.spi package for J2SE 5.0

JavaxSecurityAuthSpiAPI
type: Class
subclass of: JavaAPI
comment: platform:comprisesInterfacePart some JavaxSecurityAuthSpi
comment: JavaLibrary implementing the javax.security.auth.spi package for J2SE 5.0

JavaxSecurityAuthSpiClassLibrary
type: Class
subclass of: JavaClassLibrary
comment: platform:implementsInterface some JavaxSecurityAuthSpiAPI
comment: JavaLibrary implementing the javax.security.auth.spi package for J2SE 5.0

JavaxSecurityAuthX500
type: Class
subclass of: JavaAPIPart
comment: Java API part implementing the javax.security.auth.x500 package for J2SE 5.0

JavaxSecurityAuthX500API
type: Class
subclass of: JavaAPI
comment: platform:comprisesInterfacePart some JavaxSecurityAuthX500
comment: JavaLibrary implementing the javax.security.auth.x500 package for J2SE 5.0

JavaxSecurityAuthX500ClassLibrary
type: Class
subclass of: JavaClassLibrary
comment: platform:implementsInterface some JavaxSecurityAuthX500API
comment: JavaLibrary implementing the javax.security.auth.x500 package for J2SE 5.0

JavaxSecurityCert
type: Class
subclass of: JavaAPIPart
comment: Java API part implementing the javax.security.cert package for J2SE 5.0

JavaxSecurityCertAPI
type: Class
subclass of: JavaAPI
comment: platform:comprisesInterfacePart some JavaxSecurityCert
comment: JavaLibrary implementing the javax.security.cert package for J2SE 5.0

JavaxSecurityCertClassLibrary
type: Class
subclass of: JavaClassLibrary
comment: platform:implementsInterface some JavaxSecurityCertAPI
comment: JavaLibrary implementing the javax.security.cert package for J2SE 5.0

JavaxSecuritySasl
type: Class
subclass of: JavaAPIPart
comment: Java API part implementing the javax.security.sasl package for J2SE 5.0

JavaxSecuritySaslAPI
type: Class
subclass of: JavaAPI
comment: platform:comprisesInterfacePart some JavaxSecuritySasl
comment: JavaLibrary implementing the javax.security.sasl package for J2SE 5.0

JavaxSecuritySaslClassLibrary
type: Class
subclass of: JavaClassLibrary
comment: platform:implementsInterface some JavaxSecuritySaslAPI
comment: JavaLibrary implementing the javax.security.sasl package for J2SE 5.0

JavaxSoundMidi
type: Class
subclass of: JavaAPIPart
comment: Java API part implementing the javax.sound.midi package for J2SE 5.0

JavaxSoundMidiAPI
type: Class
subclass of: JavaAPI
comment: platform:comprisesInterfacePart some JavaxSoundMidi
comment: JavaLibrary implementing the javax.sound.midi package for J2SE 5.0

JavaxSoundMidiClassLibrary
type: Class
subclass of: JavaClassLibrary
comment: platform:implementsInterface some JavaxSoundMidiAPI
comment: JavaLibrary implementing the javax.sound.midi package for J2SE 5.0

JavaxSoundMidiSpi
type: Class
subclass of: JavaAPIPart
comment: Java API part implementing the javax.sound.midi.spi package for J2SE 5.0

JavaxSoundMidiSpiAPI
type: Class
subclass of: JavaAPI
comment: platform:comprisesInterfacePart some JavaxSoundMidiSpi
comment: JavaLibrary implementing the javax.sound.midi.spi package for J2SE 5.0

JavaxSoundMidiSpiClassLibrary
type: Class
subclass of: JavaClassLibrary
comment: platform:implementsInterface some JavaxSoundMidiSpiAPI
comment: JavaLibrary implementing the javax.sound.midi.spi package for J2SE 5.0

JavaxSoundSampled
type: Class
subclass of: JavaxSoundSampled
comment: Java API part implementing the javax.sound.sampled package for J2SE 5.0

JavaxSoundSampledAPI
type: Class
subclass of: JavaxSoundSampledAPI
comment: platform:comprisesInterfacePart some JavaxSoundSampled
comment: JavaLibrary implementing the javax.sound.sampled package for J2SE 5.0

JavaxSoundSampledClassLibrary
type: Class
subclass of: JavaxSoundSampledClassLibrary
comment: platform:implementsInterface some JavaxSoundSampledAPI
comment: JavaLibrary implementing the javax.sound.sampled package for J2SE 5.0

JavaxSoundSampledSpi
type: Class
subclass of: JavaAPIPart
comment: Java API part implementing the javax.sound.sampled.spi package for J2SE 5.0

JavaxSoundSampledSpiAPI
type: Class
subclass of: JavaAPI
comment: platform:comprisesInterfacePart some JavaxSoundSampledSpi
comment: JavaLibrary implementing the javax.sound.sampled.spi package for J2SE 5.0

JavaxSoundSampledSpiClassLibrary
type: Class
subclass of: JavaClassLibrary
comment: platform:implementsInterface some JavaxSoundSampledSpiAPI
comment: JavaLibrary implementing the javax.sound.sampled.spi package for J2SE 5.0

JavaxSql
type: Class
subclass of: JavaAPIPart
comment: Java API part implementing the javax.sql package for J2SE 5.0

JavaxSqlAPI
type: Class
subclass of: JavaAPI
comment: platform:comprisesInterfacePart some JavaxSql
comment: JavaLibrary implementing the javax.sql package for J2SE 5.0

JavaxSqlClassLibrary
type: Class
subclass of: JavaClassLibrary
comment: platform:implementsInterface some JavaxSqlAPI
comment: JavaLibrary implementing the javax.sql package for J2SE 5.0

JavaxSqlRowset
type: Class
subclass of: JavaAPIPart
comment: Java API part implementing the javax.sql.rowset package for J2SE 5.0

JavaxSqlRowsetAPI
type: Class
subclass of: JavaAPI
comment: platform:comprisesInterfacePart some JavaxSqlRowset
comment: JavaLibrary implementing the javax.sql.rowset package for J2SE 5.0

JavaxSqlRowsetClassLibrary
type: Class
subclass of: JavaClassLibrary
comment: platform:implementsInterface some JavaxSqlRowsetAPI
comment: JavaLibrary implementing the javax.sql.rowset package for J2SE 5.0

JavaxSqlRowsetSerial
type: Class
subclass of: JavaAPIPart
comment: Java API part implementing the javax.sql.rowset.serial package for J2SE 5.0

JavaxSqlRowsetSerialAPI
type: Class
subclass of: JavaAPI
comment: platform:comprisesInterfacePart some JavaxSqlRowsetSerial
comment: JavaLibrary implementing the javax.sql.rowset.serial package for J2SE 5.0

JavaxSqlRowsetSerialClassLibrary
type: Class
subclass of: JavaClassLibrary
comment: platform:implementsInterface some JavaxSqlRowsetSerialAPI
comment: JavaLibrary implementing the javax.sql.rowset.serial package for J2SE 5.0

JavaxSqlRowsetSpi
type: Class
subclass of: JavaAPIPart
comment: Java API part implementing the javax.sql.rowset.spi package for J2SE 5.0

JavaxSqlRowsetSpiAPI
type: Class
subclass of: JavaAPI
comment: platform:comprisesInterfacePart some JavaxSqlRowsetSpi
comment: JavaLibrary implementing the javax.sql.rowset.spi package for J2SE 5.0

JavaxSqlRowsetSpiClassLibrary
type: Class
subclass of: JavaClassLibrary
comment: platform:implementsInterface some JavaxSqlRowsetSpiAPI
comment: JavaLibrary implementing the javax.sql.rowset.spi package for J2SE 5.0

JavaxSwing
type: Class
subclass of: JavaxSwing
comment: Java API part implementing the javax.swing package for J2SE 5.0

JavaxSwingAPI
type: Class
subclass of: JavaxSwingAPI
comment: platform:comprisesInterfacePart some JavaxSwing
comment: JavaLibrary implementing the javax.swing package for J2SE 5.0

JavaxSwingBorder
type: Class
subclass of: JavaAPIPart
comment: Java API part implementing the javax.swing.border package for J2SE 5.0

JavaxSwingBorderAPI
type: Class
subclass of: JavaAPI
comment: platform:comprisesInterfacePart some JavaxSwingBorder
comment: JavaLibrary implementing the javax.swing.border package for J2SE 5.0

JavaxSwingBorderClassLibrary
type: Class
subclass of: JavaClassLibrary
comment: platform:implementsInterface some JavaxSwingBorderAPI
comment: JavaLibrary implementing the javax.swing.border package for J2SE 5.0

JavaxSwingClassLibrary
type: Class
subclass of: JavaxSwingClassLibrary
comment: platform:implementsInterface some JavaxSwingAPI
comment: JavaLibrary implementing the javax.swing package for J2SE 5.0

JavaxSwingColorchooser
type: Class
subclass of: JavaxSwingColorchooser
comment: Java API part implementing the javax.swing.colorchooser package for J2SE 5.0

JavaxSwingColorchooserAPI
type: Class
subclass of: JavaxSwingColorchooserAPI
comment: platform:comprisesInterfacePart some JavaxSwingColorchooser
comment: JavaLibrary implementing the javax.swing.colorchooser package for J2SE 5.0

JavaxSwingColorchooserClassLibrary
type: Class
subclass of: JavaxSwingColorchooserClassLibrary
comment: platform:implementsInterface some JavaxSwingColorchooserAPI
comment: JavaLibrary implementing the javax.swing.colorchooser package for J2SE 5.0

JavaxSwingEvent
type: Class
subclass of: JavaxSwingEvent
comment: Java API part implementing the javax.swing.event package for J2SE 5.0

JavaxSwingEventAPI
type: Class
subclass of: JavaxSwingEventAPI
comment: platform:comprisesInterfacePart some JavaxSwingEvent
comment: JavaLibrary implementing the javax.swing.event package for J2SE 5.0

JavaxSwingEventClassLibrary
type: Class
subclass of: JavaxSwingEventClassLibrary
comment: platform:implementsInterface some JavaxSwingEventAPI
comment: JavaLibrary implementing the javax.swing.event package for J2SE 5.0

JavaxSwingFilechooser
type: Class
subclass of: JavaAPIPart
comment: Java API part implementing the javax.swing.filechooser package for J2SE 5.0

JavaxSwingFilechooserAPI
type: Class
subclass of: JavaAPI
comment: platform:comprisesInterfacePart some JavaxSwingFilechooser
comment: JavaLibrary implementing the javax.swing.filechooser package for J2SE 5.0

JavaxSwingFilechooserClassLibrary
type: Class
subclass of: JavaClassLibrary
comment: platform:implementsInterface some JavaxSwingFilechooserAPI
comment: JavaLibrary implementing the javax.swing.filechooser package for J2SE 5.0

JavaxSwingPlaf
type: Class
subclass of: JavaxSwingPlaf
comment: Java API part implementing the javax.swing.plaf package for J2SE 5.0

JavaxSwingPlafAPI
type: Class
subclass of: JavaxSwingPlafAPI
comment: platform:comprisesInterfacePart some JavaxSwingPlaf
comment: JavaLibrary implementing the javax.swing.plaf package for J2SE 5.0

JavaxSwingPlafBasic
type: Class
subclass of: JavaxSwingPlafBasic
comment: Java API part implementing the javax.swing.plaf.basic package for J2SE 5.0

JavaxSwingPlafBasicAPI
type: Class
subclass of: JavaxSwingPlafBasicAPI
comment: platform:comprisesInterfacePart some JavaxSwingPlafBasic
comment: JavaLibrary implementing the javax.swing.plaf.basic package for J2SE 5.0

JavaxSwingPlafBasicClassLibrary
type: Class
subclass of: JavaxSwingPlafBasicClassLibrary
comment: platform:implementsInterface some JavaxSwingPlafBasicAPI
comment: JavaLibrary implementing the javax.swing.plaf.basic package for J2SE 5.0

JavaxSwingPlafClassLibrary
type: Class
subclass of: JavaxSwingPlafClassLibrary
comment: platform:implementsInterface some JavaxSwingPlafAPI
comment: JavaLibrary implementing the javax.swing.plaf package for J2SE 5.0

JavaxSwingPlafMetal
type: Class
subclass of: JavaxSwingPlafMetal
comment: Java API part implementing the javax.swing.plaf.metal package for J2SE 5.0

JavaxSwingPlafMetalAPI
type: Class
subclass of: JavaxSwingPlafMetalAPI
comment: platform:comprisesInterfacePart some JavaxSwingPlafMetal
comment: JavaLibrary implementing the javax.swing.plaf.metal package for J2SE 5.0

JavaxSwingPlafMetalClassLibrary
type: Class
subclass of: JavaxSwingPlafMetalClassLibrary
comment: platform:implementsInterface some JavaxSwingPlafMetalAPI
comment: JavaLibrary implementing the javax.swing.plaf.metal package for J2SE 5.0

JavaxSwingPlafMulti
type: Class
subclass of: JavaxSwingPlafMulti
comment: Java API part implementing the javax.swing.plaf.multi package for J2SE 5.0

JavaxSwingPlafMultiAPI
type: Class
subclass of: JavaxSwingPlafMultiAPI
comment: platform:comprisesInterfacePart some JavaxSwingPlafMulti
comment: JavaLibrary implementing the javax.swing.plaf.multi package for J2SE 5.0

JavaxSwingPlafMultiClassLibrary
type: Class
subclass of: JavaxSwingPlafMultiClassLibrary
comment: platform:implementsInterface some JavaxSwingPlafMultiAPI
comment: JavaLibrary implementing the javax.swing.plaf.multi package for J2SE 5.0

JavaxSwingPlafSynth
type: Class
subclass of: JavaAPIPart
comment: Java API part implementing the javax.swing.plaf.synth package for J2SE 5.0

JavaxSwingPlafSynthAPI
type: Class
subclass of: JavaAPI
comment: platform:comprisesInterfacePart some JavaxSwingPlafSynth
comment: JavaLibrary implementing the javax.swing.plaf.synth package for J2SE 5.0

JavaxSwingPlafSynthClassLibrary
type: Class
subclass of: JavaClassLibrary
comment: platform:implementsInterface some JavaxSwingPlafSynthAPI
comment: JavaLibrary implementing the javax.swing.plaf.synth package for J2SE 5.0

JavaxSwingTable
type: Class
subclass of: JavaxSwingTable
comment: Java API part implementing the javax.swing.table package for J2SE 5.0

JavaxSwingTableAPI
type: Class
subclass of: JavaxSwingTableAPI
comment: platform:comprisesInterfacePart some JavaxSwingTable
comment: JavaLibrary implementing the javax.swing.table package for J2SE 5.0

JavaxSwingTableClassLibrary
type: Class
subclass of: JavaxSwingTableClassLibrary
comment: platform:implementsInterface some JavaxSwingTableAPI
comment: JavaLibrary implementing the javax.swing.table package for J2SE 5.0

JavaxSwingText
type: Class
subclass of: JavaxSwingText
comment: Java API part implementing the javax.swing.text package for J2SE 5.0

JavaxSwingTextAPI
type: Class
subclass of: JavaxSwingTextAPI
comment: platform:comprisesInterfacePart some JavaxSwingText
comment: JavaLibrary implementing the javax.swing.text package for J2SE 5.0

JavaxSwingTextClassLibrary
type: Class
subclass of: JavaxSwingTextClassLibrary
comment: platform:implementsInterface some JavaxSwingTextAPI
comment: JavaLibrary implementing the javax.swing.text package for J2SE 5.0

JavaxSwingTextHtml
type: Class
subclass of: JavaxSwingTextHtml
comment: Java API part implementing the javax.swing.text.html package for J2SE 5.0

JavaxSwingTextHtmlAPI
type: Class
subclass of: JavaxSwingTextHtmlAPI
comment: platform:comprisesInterfacePart some JavaxSwingTextHtml
comment: JavaLibrary implementing the javax.swing.text.html package for J2SE 5.0

JavaxSwingTextHtmlClassLibrary
type: Class
subclass of: JavaxSwingTextHtmlClassLibrary
comment: platform:implementsInterface some JavaxSwingTextHtmlAPI
comment: JavaLibrary implementing the javax.swing.text.html package for J2SE 5.0

JavaxSwingTextHtmlParser
type: Class
subclass of: JavaAPIPart
comment: Java API part implementing the javax.swing.text.html.parser package for J2SE 5.0

JavaxSwingTextHtmlParserAPI
type: Class
subclass of: JavaAPI
comment: platform:comprisesInterfacePart some JavaxSwingTextHtmlParser
comment: JavaLibrary implementing the javax.swing.text.html.parser package for J2SE 5.0

JavaxSwingTextHtmlParserClassLibrary
type: Class
subclass of: JavaClassLibrary
comment: platform:implementsInterface some JavaxSwingTextHtmlParserAPI
comment: JavaLibrary implementing the javax.swing.text.html.parser package for J2SE 5.0

JavaxSwingTextRtf
type: Class
subclass of: JavaAPIPart
comment: Java API part implementing the javax.swing.text.rtf package for J2SE 5.0

JavaxSwingTextRtfAPI
type: Class
subclass of: JavaAPI
comment: platform:comprisesInterfacePart some JavaxSwingTextRtf
comment: JavaLibrary implementing the javax.swing.text.rtf package for J2SE 5.0

JavaxSwingTextRtfClassLibrary
type: Class
subclass of: JavaClassLibrary
comment: platform:implementsInterface some JavaxSwingTextRtfAPI
comment: JavaLibrary implementing the javax.swing.text.rtf package for J2SE 5.0

JavaxSwingTree
type: Class
subclass of: JavaxSwingTree
comment: Java API part implementing the javax.swing.tree package for J2SE 5.0

JavaxSwingTreeAPI
type: Class
subclass of: JavaxSwingTreeAPI
comment: platform:comprisesInterfacePart some JavaxSwingTree
comment: JavaLibrary implementing the javax.swing.tree package for J2SE 5.0

JavaxSwingTreeClassLibrary
type: Class
subclass of: JavaxSwingTreeClassLibrary
comment: platform:implementsInterface some JavaxSwingTreeAPI
comment: JavaLibrary implementing the javax.swing.tree package for J2SE 5.0

JavaxSwingUndo
type: Class
subclass of: JavaAPIPart
comment: Java API part implementing the javax.swing.undo package for J2SE 5.0

JavaxSwingUndoAPI
type: Class
subclass of: JavaAPI
comment: platform:comprisesInterfacePart some JavaxSwingUndo
comment: JavaLibrary implementing the javax.swing.undo package for J2SE 5.0

JavaxSwingUndoClassLibrary
type: Class
subclass of: JavaClassLibrary
comment: platform:implementsInterface some JavaxSwingUndoAPI
comment: JavaLibrary implementing the javax.swing.undo package for J2SE 5.0

JavaxTransaction
type: Class
subclass of: JavaAPIPart
comment: Java API part implementing the javax.transaction package for J2SE 5.0

JavaxTransactionAPI
type: Class
subclass of: JavaAPI
comment: platform:comprisesInterfacePart some JavaxTransaction
comment: JavaLibrary implementing the javax.transaction package for J2SE 5.0

JavaxTransactionClassLibrary
type: Class
subclass of: JavaClassLibrary
comment: platform:implementsInterface some JavaxTransactionAPI
comment: JavaLibrary implementing the javax.transaction package for J2SE 5.0

JavaxTransactionXa
type: Class
subclass of: JavaAPIPart
comment: Java API part implementing the javax.transaction.xa package for J2SE 5.0

JavaxTransactionXaAPI
type: Class
subclass of: JavaAPI
comment: platform:comprisesInterfacePart some JavaxTransactionXa
comment: JavaLibrary implementing the javax.transaction.xa package for J2SE 5.0

JavaxTransactionXaClassLibrary
type: Class
subclass of: JavaClassLibrary
comment: platform:implementsInterface some JavaxTransactionXaAPI
comment: JavaLibrary implementing the javax.transaction.xa package for J2SE 5.0

JavaxXml
type: Class
subclass of: JavaAPIPart
comment: Java API part implementing the javax.xml package for J2SE 5.0

JavaxXmlAPI
type: Class
subclass of: JavaAPI
comment: platform:comprisesInterfacePart some JavaxXml
comment: JavaLibrary implementing the javax.xml package for J2SE 5.0

JavaxXmlClassLibrary
type: Class
subclass of: JavaClassLibrary
comment: platform:implementsInterface some JavaxXmlAPI
comment: JavaLibrary implementing the javax.xml package for J2SE 5.0

JavaxXmlDatatype
type: Class
subclass of: JavaAPIPart
comment: Java API part implementing the javax.xml.datatype package for J2SE 5.0

JavaxXmlDatatypeAPI
type: Class
subclass of: JavaAPI
comment: platform:comprisesInterfacePart some JavaxXmlDatatype
comment: JavaLibrary implementing the javax.xml.datatype package for J2SE 5.0

JavaxXmlDatatypeClassLibrary
type: Class
subclass of: JavaClassLibrary
comment: platform:implementsInterface some JavaxXmlDatatypeAPI
comment: JavaLibrary implementing the javax.xml.datatype package for J2SE 5.0

JavaxXmlNamespace
type: Class
subclass of: JavaAPIPart
comment: Java API part implementing the javax.xml.namespace package for J2SE 5.0

JavaxXmlNamespaceAPI
type: Class
subclass of: JavaAPI
comment: platform:comprisesInterfacePart some JavaxXmlNamespace
comment: JavaLibrary implementing the javax.xml.namespace package for J2SE 5.0

JavaxXmlNamespaceClassLibrary
type: Class
subclass of: JavaClassLibrary
comment: platform:implementsInterface some JavaxXmlNamespaceAPI
comment: JavaLibrary implementing the javax.xml.namespace package for J2SE 5.0

JavaxXmlParsers
type: Class
subclass of: JavaxXmlParsers
comment: Java API part implementing the javax.xml.parsers package for J2SE 5.0

JavaxXmlParsersAPI
type: Class
subclass of: JavaxXmlParsersAPI
comment: platform:comprisesInterfacePart some JavaxXmlParsers
comment: JavaLibrary implementing the javax.xml.parsers package for J2SE 5.0

JavaxXmlParsersClassLibrary
type: Class
subclass of: JavaxXmlParsersClassLibrary
comment: platform:implementsInterface some JavaxXmlParsersAPI
comment: JavaLibrary implementing the javax.xml.parsers package for J2SE 5.0

JavaxXmlTransform
type: Class
subclass of: JavaxXmlTransform
comment: Java API part implementing the javax.xml.transform package for J2SE 5.0

JavaxXmlTransformAPI
type: Class
subclass of: JavaxXmlTransformAPI
comment: platform:comprisesInterfacePart some JavaxXmlTransform
comment: JavaLibrary implementing the javax.xml.transform package for J2SE 5.0

JavaxXmlTransformClassLibrary
type: Class
subclass of: JavaxXmlTransformClassLibrary
comment: platform:implementsInterface some JavaxXmlTransformAPI
comment: JavaLibrary implementing the javax.xml.transform package for J2SE 5.0

JavaxXmlTransformDom
type: Class
subclass of: JavaxXmlTransformDom
comment: Java API part implementing the javax.xml.transform.dom package for J2SE 5.0

JavaxXmlTransformDomAPI
type: Class
subclass of: JavaxXmlTransformDomAPI
comment: platform:comprisesInterfacePart some JavaxXmlTransformDom
comment: JavaLibrary implementing the javax.xml.transform.dom package for J2SE 5.0

JavaxXmlTransformDomClassLibrary
type: Class
subclass of: JavaxXmlTransformDomClassLibrary
comment: platform:implementsInterface some JavaxXmlTransformDomAPI
comment: JavaLibrary implementing the javax.xml.transform.dom package for J2SE 5.0

JavaxXmlTransformSax
type: Class
subclass of: JavaxXmlTransformSax
comment: Java API part implementing the javax.xml.transform.sax package for J2SE 5.0

JavaxXmlTransformSaxAPI
type: Class
subclass of: JavaxXmlTransformSaxAPI
comment: platform:comprisesInterfacePart some JavaxXmlTransformSax
comment: JavaLibrary implementing the javax.xml.transform.sax package for J2SE 5.0

JavaxXmlTransformSaxClassLibrary
type: Class
subclass of: JavaxXmlTransformSaxClassLibrary
comment: platform:implementsInterface some JavaxXmlTransformSaxAPI
comment: JavaLibrary implementing the javax.xml.transform.sax package for J2SE 5.0

JavaxXmlTransformStream
type: Class
subclass of: JavaAPIPart
comment: Java API part implementing the javax.xml.transform.stream package for J2SE 5.0

JavaxXmlTransformStreamAPI
type: Class
subclass of: JavaAPI
comment: platform:comprisesInterfacePart some JavaxXmlTransformStream
comment: JavaLibrary implementing the javax.xml.transform.stream package for J2SE 5.0

JavaxXmlTransformStreamClassLibrary
type: Class
subclass of: JavaClassLibrary
comment: platform:implementsInterface some JavaxXmlTransformStreamAPI
comment: JavaLibrary implementing the javax.xml.transform.stream package for J2SE 5.0

JavaxXmlValidation
type: Class
subclass of: JavaAPIPart
comment: Java API part implementing the javax.xml.validation package for J2SE 5.0

JavaxXmlValidationAPI
type: Class
subclass of: JavaAPI
comment: platform:comprisesInterfacePart some JavaxXmlValidation
comment: JavaLibrary implementing the javax.xml.validation package for J2SE 5.0

JavaxXmlValidationClassLibrary
type: Class
subclass of: JavaClassLibrary
comment: platform:implementsInterface some JavaxXmlValidationAPI
comment: JavaLibrary implementing the javax.xml.validation package for J2SE 5.0

JavaxXmlXpath
type: Class
subclass of: JavaAPIPart
comment: Java API part implementing the javax.xml.xpath package for J2SE 5.0

JavaxXmlXpathAPI
type: Class
subclass of: JavaAPI
comment: platform:comprisesInterfacePart some JavaxXmlXpath
comment: JavaLibrary implementing the javax.xml.xpath package for J2SE 5.0

JavaxXmlXpathClassLibrary
type: Class
subclass of: JavaClassLibrary
comment: platform:implementsInterface some JavaxXmlXpathAPI
comment: JavaLibrary implementing the javax.xml.xpath package for J2SE 5.0

OrgIetfJgss
type: Class
subclass of: JavaAPIPart
comment: Java API part implementing the org.ietf.jgss package for J2SE 5.0

OrgIetfJgssAPI
type: Class
subclass of: JavaAPI
comment: platform:comprisesInterfacePart some OrgIetfJgss
comment: JavaLibrary implementing the org.ietf.jgss package for J2SE 5.0

OrgIetfJgssClassLibrary
type: Class
subclass of: JavaClassLibrary
comment: platform:implementsInterface some OrgIetfJgssAPI
comment: JavaLibrary implementing the org.ietf.jgss package for J2SE 5.0

OrgOmgCORBA
type: Class
subclass of: OrgOmgCORBA
comment: Java API part implementing the org.omg.CORBA package for J2SE 5.0

OrgOmgCORBAAPI
type: Class
subclass of: OrgOmgCORBAAPI
comment: platform:comprisesInterfacePart some OrgOmgCORBA
comment: JavaLibrary implementing the org.omg.CORBA package for J2SE 5.0

OrgOmgCORBAClassLibrary
type: Class
subclass of: OrgOmgCORBAClassLibrary
comment: platform:implementsInterface some OrgOmgCORBAAPI
comment: JavaLibrary implementing the org.omg.CORBA package for J2SE 5.0

OrgOmgCORBADynAnyPackage
type: Class
subclass of: JavaAPIPart
comment: Java API part implementing the org.omg.CORBA.DynAnyPackage package for J2SE 5.0

OrgOmgCORBADynAnyPackageAPI
type: Class
subclass of: JavaAPI
comment: platform:comprisesInterfacePart some OrgOmgCORBADynAnyPackage
comment: JavaLibrary implementing the org.omg.CORBA.DynAnyPackage package for J2SE 5.0

OrgOmgCORBADynAnyPackageClassLibrary
type: Class
subclass of: JavaClassLibrary
comment: platform:implementsInterface some OrgOmgCORBADynAnyPackageAPI
comment: JavaLibrary implementing the org.omg.CORBA.DynAnyPackage package for J2SE 5.0

OrgOmgCORBAORBPackage
type: Class
subclass of: JavaAPIPart
comment: Java API part implementing the org.omg.CORBA.ORBPackage package for J2SE 5.0

OrgOmgCORBAORBPackageAPI
type: Class
subclass of: JavaAPI
comment: platform:comprisesInterfacePart some OrgOmgCORBAORBPackage
comment: JavaLibrary implementing the org.omg.CORBA.ORBPackage package for J2SE 5.0

OrgOmgCORBAORBPackageClassLibrary
type: Class
subclass of: JavaClassLibrary
comment: platform:implementsInterface some OrgOmgCORBAORBPackageAPI
comment: JavaLibrary implementing the org.omg.CORBA.ORBPackage package for J2SE 5.0

OrgOmgCORBAPortable
type: Class
subclass of: OrgOmgCORBAPortable
comment: Java API part implementing the org.omg.CORBA.portable package for J2SE 5.0

OrgOmgCORBAPortableAPI
type: Class
subclass of: OrgOmgCORBAPortableAPI
comment: platform:comprisesInterfacePart some OrgOmgCORBAPortable
comment: JavaLibrary implementing the org.omg.CORBA.portable package for J2SE 5.0

OrgOmgCORBAPortableClassLibrary
type: Class
subclass of: OrgOmgCORBAPortableClassLibrary
comment: platform:implementsInterface some OrgOmgCORBAPortableAPI
comment: JavaLibrary implementing the org.omg.CORBA.portable package for J2SE 5.0

OrgOmgCORBATypeCodePackage
type: Class
subclass of: JavaAPIPart
comment: Java API part implementing the org.omg.CORBA.TypeCodePackage package for J2SE 5.0

OrgOmgCORBATypeCodePackageAPI
type: Class
subclass of: JavaAPI
comment: platform:comprisesInterfacePart some OrgOmgCORBATypeCodePackage
comment: JavaLibrary implementing the org.omg.CORBA.TypeCodePackage package for J2SE 5.0

OrgOmgCORBATypeCodePackageClassLibrary
type: Class
subclass of: JavaClassLibrary
comment: platform:implementsInterface some OrgOmgCORBATypeCodePackageAPI
comment: JavaLibrary implementing the org.omg.CORBA.TypeCodePackage package for J2SE 5.0

OrgOmgCORBA 2 3
type: Class
subclass of: JavaAPIPart
comment: Java API part implementing the org.omg.CORBA_2_3 package for J2SE 5.0

OrgOmgCORBA 2 3API
type: Class
subclass of: JavaAPI
comment: platform:comprisesInterfacePart some OrgOmgCORBA_2_3
comment: JavaLibrary implementing the org.omg.CORBA_2_3 package for J2SE 5.0

OrgOmgCORBA 2 3ClassLibrary
type: Class
subclass of: JavaClassLibrary
comment: platform:implementsInterface some OrgOmgCORBA_2_3API
comment: JavaLibrary implementing the org.omg.CORBA_2_3 package for J2SE 5.0

OrgOmgCORBA 2 3Portable
type: Class
subclass of: JavaAPIPart
comment: Java API part implementing the org.omg.CORBA_2_3.portable package for J2SE 5.0

OrgOmgCORBA 2 3PortableAPI
type: Class
subclass of: JavaAPI
comment: platform:comprisesInterfacePart some OrgOmgCORBA_2_3Portable
comment: JavaLibrary implementing the org.omg.CORBA_2_3.portable package for J2SE 5.0

OrgOmgCORBA 2 3PortableClassLibrary
type: Class
subclass of: JavaClassLibrary
comment: platform:implementsInterface some OrgOmgCORBA_2_3PortableAPI
comment: JavaLibrary implementing the org.omg.CORBA_2_3.portable package for J2SE 5.0

OrgOmgCosNaming
type: Class
subclass of: OrgOmgCosNaming
comment: Java API part implementing the org.omg.CosNaming package for J2SE 5.0

OrgOmgCosNamingAPI
type: Class
subclass of: OrgOmgCosNamingAPI
comment: platform:comprisesInterfacePart some OrgOmgCosNaming
comment: JavaLibrary implementing the org.omg.CosNaming package for J2SE 5.0

OrgOmgCosNamingClassLibrary
type: Class
subclass of: OrgOmgCosNamingClassLibrary
comment: platform:implementsInterface some OrgOmgCosNamingAPI
comment: JavaLibrary implementing the org.omg.CosNaming package for J2SE 5.0

OrgOmgCosNamingNamingContextExtPackage
type: Class
subclass of: JavaAPIPart
comment: Java API part implementing the org.omg.CosNaming.NamingContextExtPackage package for J2SE 5.0

OrgOmgCosNamingNamingContextExtPackageAPI
type: Class
subclass of: JavaAPI
comment: platform:comprisesInterfacePart some OrgOmgCosNamingNamingContextExtPackage
comment: JavaLibrary implementing the org.omg.CosNaming.NamingContextExtPackage package for J2SE 5.0

OrgOmgCosNamingNamingContextExtPackageClassLibrary
type: Class
subclass of: JavaClassLibrary
comment: platform:implementsInterface some OrgOmgCosNamingNamingContextExtPackageAPI
comment: JavaLibrary implementing the org.omg.CosNaming.NamingContextExtPackage package for J2SE 5.0

OrgOmgCosNamingNamingContextPackage
type: Class
subclass of: JavaAPIPart
comment: Java API part implementing the org.omg.CosNaming.NamingContextPackage package for J2SE 5.0

OrgOmgCosNamingNamingContextPackageAPI
type: Class
subclass of: JavaAPI
comment: platform:comprisesInterfacePart some OrgOmgCosNamingNamingContextPackage
comment: JavaLibrary implementing the org.omg.CosNaming.NamingContextPackage package for J2SE 5.0

OrgOmgCosNamingNamingContextPackageClassLibrary
type: Class
subclass of: JavaClassLibrary
comment: platform:implementsInterface some OrgOmgCosNamingNamingContextPackageAPI
comment: JavaLibrary implementing the org.omg.CosNaming.NamingContextPackage package for J2SE 5.0

OrgOmgDynamic
type: Class
subclass of: JavaAPIPart
comment: Java API part implementing the org.omg.Dynamic package for J2SE 5.0

OrgOmgDynamicAPI
type: Class
subclass of: JavaAPI
comment: platform:comprisesInterfacePart some OrgOmgDynamic
comment: JavaLibrary implementing the org.omg.Dynamic package for J2SE 5.0

OrgOmgDynamicAny
type: Class
subclass of: OrgOmgDynamicAny
comment: Java API part implementing the org.omg.DynamicAny package for J2SE 5.0

OrgOmgDynamicAnyAPI
type: Class
subclass of: OrgOmgDynamicAnyAPI
comment: platform:comprisesInterfacePart some OrgOmgDynamicAny
comment: JavaLibrary implementing the org.omg.DynamicAny package for J2SE 5.0

OrgOmgDynamicAnyClassLibrary
type: Class
subclass of: OrgOmgDynamicAnyClassLibrary
comment: platform:implementsInterface some OrgOmgDynamicAnyAPI
comment: JavaLibrary implementing the org.omg.DynamicAny package for J2SE 5.0

OrgOmgDynamicAnyDynAnyFactoryPackage
type: Class
subclass of: JavaAPIPart
comment: Java API part implementing the org.omg.DynamicAny.DynAnyFactoryPackage package for J2SE 5.0

OrgOmgDynamicAnyDynAnyFactoryPackageAPI
type: Class
subclass of: JavaAPI
comment: platform:comprisesInterfacePart some OrgOmgDynamicAnyDynAnyFactoryPackage
comment: JavaLibrary implementing the org.omg.DynamicAny.DynAnyFactoryPackage package for J2SE 5.0

OrgOmgDynamicAnyDynAnyFactoryPackageClassLibrary
type: Class
subclass of: JavaClassLibrary
comment: platform:implementsInterface some OrgOmgDynamicAnyDynAnyFactoryPackageAPI
comment: JavaLibrary implementing the org.omg.DynamicAny.DynAnyFactoryPackage package for J2SE 5.0

OrgOmgDynamicAnyDynAnyPackage
type: Class
subclass of: JavaAPIPart
comment: Java API part implementing the org.omg.DynamicAny.DynAnyPackage package for J2SE 5.0

OrgOmgDynamicAnyDynAnyPackageAPI
type: Class
subclass of: JavaAPI
comment: platform:comprisesInterfacePart some OrgOmgDynamicAnyDynAnyPackage
comment: JavaLibrary implementing the org.omg.DynamicAny.DynAnyPackage package for J2SE 5.0

OrgOmgDynamicAnyDynAnyPackageClassLibrary
type: Class
subclass of: JavaClassLibrary
comment: platform:implementsInterface some OrgOmgDynamicAnyDynAnyPackageAPI
comment: JavaLibrary implementing the org.omg.DynamicAny.DynAnyPackage package for J2SE 5.0

OrgOmgDynamicClassLibrary
type: Class
subclass of: JavaClassLibrary
comment: platform:implementsInterface some OrgOmgDynamicAPI
comment: JavaLibrary implementing the org.omg.Dynamic package for J2SE 5.0

OrgOmgIOP
type: Class
subclass of: OrgOmgIOP
comment: Java API part implementing the org.omg.IOP package for J2SE 5.0

OrgOmgIOPAPI
type: Class
subclass of: OrgOmgIOPAPI
comment: platform:comprisesInterfacePart some OrgOmgIOP
comment: JavaLibrary implementing the org.omg.IOP package for J2SE 5.0

OrgOmgIOPClassLibrary
type: Class
subclass of: OrgOmgIOPClassLibrary
comment: platform:implementsInterface some OrgOmgIOPAPI
comment: JavaLibrary implementing the org.omg.IOP package for J2SE 5.0

OrgOmgIOPCodecFactoryPackage
type: Class
subclass of: JavaAPIPart
comment: Java API part implementing the org.omg.IOP.CodecFactoryPackage package for J2SE 5.0

OrgOmgIOPCodecFactoryPackageAPI
type: Class
subclass of: JavaAPI
comment: platform:comprisesInterfacePart some OrgOmgIOPCodecFactoryPackage
comment: JavaLibrary implementing the org.omg.IOP.CodecFactoryPackage package for J2SE 5.0

OrgOmgIOPCodecFactoryPackageClassLibrary
type: Class
subclass of: JavaClassLibrary
comment: platform:implementsInterface some OrgOmgIOPCodecFactoryPackageAPI
comment: JavaLibrary implementing the org.omg.IOP.CodecFactoryPackage package for J2SE 5.0

OrgOmgIOPCodecPackage
type: Class
subclass of: JavaAPIPart
comment: Java API part implementing the org.omg.IOP.CodecPackage package for J2SE 5.0

OrgOmgIOPCodecPackageAPI
type: Class
subclass of: JavaAPI
comment: platform:comprisesInterfacePart some OrgOmgIOPCodecPackage
comment: JavaLibrary implementing the org.omg.IOP.CodecPackage package for J2SE 5.0

OrgOmgIOPCodecPackageClassLibrary
type: Class
subclass of: JavaClassLibrary
comment: platform:implementsInterface some OrgOmgIOPCodecPackageAPI
comment: JavaLibrary implementing the org.omg.IOP.CodecPackage package for J2SE 5.0

OrgOmgMessaging
type: Class
subclass of: JavaAPIPart
comment: Java API part implementing the org.omg.Messaging package for J2SE 5.0

OrgOmgMessagingAPI
type: Class
subclass of: JavaAPI
comment: platform:comprisesInterfacePart some OrgOmgMessaging
comment: JavaLibrary implementing the org.omg.Messaging package for J2SE 5.0

OrgOmgMessagingClassLibrary
type: Class
subclass of: JavaClassLibrary
comment: platform:implementsInterface some OrgOmgMessagingAPI
comment: JavaLibrary implementing the org.omg.Messaging package for J2SE 5.0

OrgOmgPortableInterceptor
type: Class
subclass of: OrgOmgPortableInterceptor
comment: Java API part implementing the org.omg.PortableInterceptor package for J2SE 5.0

OrgOmgPortableInterceptorAPI
type: Class
subclass of: OrgOmgPortableInterceptorAPI
comment: platform:comprisesInterfacePart some OrgOmgPortableInterceptor
comment: JavaLibrary implementing the org.omg.PortableInterceptor package for J2SE 5.0

OrgOmgPortableInterceptorClassLibrary
type: Class
subclass of: OrgOmgPortableInterceptorClassLibrary
comment: platform:implementsInterface some OrgOmgPortableInterceptorAPI
comment: JavaLibrary implementing the org.omg.PortableInterceptor package for J2SE 5.0

OrgOmgPortableInterceptorORBInitInfoPackage
type: Class
subclass of: JavaAPIPart
comment: Java API part implementing the org.omg.PortableInterceptor.ORBInitInfoPackage package for J2SE 5.0

OrgOmgPortableInterceptorORBInitInfoPackageAPI
type: Class
subclass of: JavaAPI
comment: platform:comprisesInterfacePart some OrgOmgPortableInterceptorORBInitInfoPackage
comment: JavaLibrary implementing the org.omg.PortableInterceptor.ORBInitInfoPackage package for J2SE 5.0

OrgOmgPortableInterceptorORBInitInfoPackageClassLibrary
type: Class
subclass of: JavaClassLibrary
comment: platform:implementsInterface some OrgOmgPortableInterceptorORBInitInfoPackageAPI
comment: JavaLibrary implementing the org.omg.PortableInterceptor.ORBInitInfoPackage package for J2SE 5.0

OrgOmgPortableServer
type: Class
subclass of: OrgOmgPortableServer
comment: Java API part implementing the org.omg.PortableServer package for J2SE 5.0

OrgOmgPortableServerAPI
type: Class
subclass of: OrgOmgPortableServerAPI
comment: platform:comprisesInterfacePart some OrgOmgPortableServer
comment: JavaLibrary implementing the org.omg.PortableServer package for J2SE 5.0

OrgOmgPortableServerClassLibrary
type: Class
subclass of: OrgOmgPortableServerClassLibrary
comment: platform:implementsInterface some OrgOmgPortableServerAPI
comment: JavaLibrary implementing the org.omg.PortableServer package for J2SE 5.0

OrgOmgPortableServerCurrentPackage
type: Class
subclass of: JavaAPIPart
comment: Java API part implementing the org.omg.PortableServer.CurrentPackage package for J2SE 5.0

OrgOmgPortableServerCurrentPackageAPI
type: Class
subclass of: JavaAPI
comment: platform:comprisesInterfacePart some OrgOmgPortableServerCurrentPackage
comment: JavaLibrary implementing the org.omg.PortableServer.CurrentPackage package for J2SE 5.0

OrgOmgPortableServerCurrentPackageClassLibrary
type: Class
subclass of: JavaClassLibrary
comment: platform:implementsInterface some OrgOmgPortableServerCurrentPackageAPI
comment: JavaLibrary implementing the org.omg.PortableServer.CurrentPackage package for J2SE 5.0

OrgOmgPortableServerPOAManagerPackage
type: Class
subclass of: JavaAPIPart
comment: Java API part implementing the org.omg.PortableServer.POAManagerPackage package for J2SE 5.0

OrgOmgPortableServerPOAManagerPackageAPI
type: Class
subclass of: JavaAPI
comment: platform:comprisesInterfacePart some OrgOmgPortableServerPOAManagerPackage
comment: JavaLibrary implementing the org.omg.PortableServer.POAManagerPackage package for J2SE 5.0

OrgOmgPortableServerPOAManagerPackageClassLibrary
type: Class
subclass of: JavaClassLibrary
comment: platform:implementsInterface some OrgOmgPortableServerPOAManagerPackageAPI
comment: JavaLibrary implementing the org.omg.PortableServer.POAManagerPackage package for J2SE 5.0

OrgOmgPortableServerPOAPackage
type: Class
subclass of: JavaAPIPart
comment: Java API part implementing the org.omg.PortableServer.POAPackage package for J2SE 5.0

OrgOmgPortableServerPOAPackageAPI
type: Class
subclass of: JavaAPI
comment: platform:comprisesInterfacePart some OrgOmgPortableServerPOAPackage
comment: JavaLibrary implementing the org.omg.PortableServer.POAPackage package for J2SE 5.0

OrgOmgPortableServerPOAPackageClassLibrary
type: Class
subclass of: JavaClassLibrary
comment: platform:implementsInterface some OrgOmgPortableServerPOAPackageAPI
comment: JavaLibrary implementing the org.omg.PortableServer.POAPackage package for J2SE 5.0

OrgOmgPortableServerPortable
type: Class
subclass of: JavaAPIPart
comment: Java API part implementing the org.omg.PortableServer.portable package for J2SE 5.0

OrgOmgPortableServerPortableAPI
type: Class
subclass of: JavaAPI
comment: platform:comprisesInterfacePart some OrgOmgPortableServerPortable
comment: JavaLibrary implementing the org.omg.PortableServer.portable package for J2SE 5.0

OrgOmgPortableServerPortableClassLibrary
type: Class
subclass of: JavaClassLibrary
comment: platform:implementsInterface some OrgOmgPortableServerPortableAPI
comment: JavaLibrary implementing the org.omg.PortableServer.portable package for J2SE 5.0

OrgOmgPortableServerServantLocatorPackage
type: Class
subclass of: JavaAPIPart
comment: Java API part implementing the org.omg.PortableServer.ServantLocatorPackage package for J2SE 5.0

OrgOmgPortableServerServantLocatorPackageAPI
type: Class
subclass of: JavaAPI
comment: platform:comprisesInterfacePart some OrgOmgPortableServerServantLocatorPackage
comment: JavaLibrary implementing the org.omg.PortableServer.ServantLocatorPackage package for J2SE 5.0

OrgOmgPortableServerServantLocatorPackageClassLibrary
type: Class
subclass of: JavaClassLibrary
comment: platform:implementsInterface some OrgOmgPortableServerServantLocatorPackageAPI
comment: JavaLibrary implementing the org.omg.PortableServer.ServantLocatorPackage package for J2SE 5.0

OrgOmgSendingContext
type: Class
subclass of: JavaAPIPart
comment: Java API part implementing the org.omg.SendingContext package for J2SE 5.0

OrgOmgSendingContextAPI
type: Class
subclass of: JavaAPI
comment: platform:comprisesInterfacePart some OrgOmgSendingContext
comment: JavaLibrary implementing the org.omg.SendingContext package for J2SE 5.0

OrgOmgSendingContextClassLibrary
type: Class
subclass of: JavaClassLibrary
comment: platform:implementsInterface some OrgOmgSendingContextAPI
comment: JavaLibrary implementing the org.omg.SendingContext package for J2SE 5.0

OrgOmgStubJavaRmi
type: Class
subclass of: JavaAPIPart
comment: Java API part implementing the org.omg.stub.java.rmi package for J2SE 5.0

OrgOmgStubJavaRmiAPI
type: Class
subclass of: JavaAPI
comment: platform:comprisesInterfacePart some OrgOmgStubJavaRmi
comment: JavaLibrary implementing the org.omg.stub.java.rmi package for J2SE 5.0

OrgOmgStubJavaRmiClassLibrary
type: Class
subclass of: JavaClassLibrary
comment: platform:implementsInterface some OrgOmgStubJavaRmiAPI
comment: JavaLibrary implementing the org.omg.stub.java.rmi package for J2SE 5.0

OrgOmgStubJavaxManagementRemoteRmi
type: Class
subclass of: JavaAPIPart
comment: Java API part implementing the org.omg.stub.javax.management.remote.rmi package for J2SE 5.0

OrgOmgStubJavaxManagementRemoteRmiAPI
type: Class
subclass of: JavaAPI
comment: platform:comprisesInterfacePart some OrgOmgStubJavaxManagementRemoteRmi
comment: JavaLibrary implementing the org.omg.stub.javax.management.remote.rmi package for J2SE 5.0

OrgOmgStubJavaxManagementRemoteRmiClassLibrary
type: Class
subclass of: JavaClassLibrary
comment: platform:implementsInterface some OrgOmgStubJavaxManagementRemoteRmiAPI
comment: JavaLibrary implementing the org.omg.stub.javax.management.remote.rmi package for J2SE 5.0

OrgW3cDom
type: Class
subclass of: OrgW3cDom
comment: Java API part implementing the org.w3c.dom package for J2SE 5.0

OrgW3cDomAPI
type: Class
subclass of: OrgW3cDomAPI
comment: platform:comprisesInterfacePart some OrgW3cDom
comment: JavaLibrary implementing the org.w3c.dom package for J2SE 5.0

OrgW3cDomBootstrap
type: Class
subclass of: JavaAPIPart
comment: Java API part implementing the org.w3c.dom.bootstrap package for J2SE 5.0

OrgW3cDomBootstrapAPI
type: Class
subclass of: JavaAPI
comment: platform:comprisesInterfacePart some OrgW3cDomBootstrap
comment: JavaLibrary implementing the org.w3c.dom.bootstrap package for J2SE 5.0

OrgW3cDomBootstrapClassLibrary
type: Class
subclass of: JavaClassLibrary
comment: platform:implementsInterface some OrgW3cDomBootstrapAPI
comment: JavaLibrary implementing the org.w3c.dom.bootstrap package for J2SE 5.0

OrgW3cDomClassLibrary
type: Class
subclass of: OrgW3cDomClassLibrary
comment: platform:implementsInterface some OrgW3cDomAPI
comment: JavaLibrary implementing the org.w3c.dom package for J2SE 5.0

OrgW3cDomCss
type: Class
subclass of: OrgW3cDomCss
comment: Java API part implementing the org.w3c.dom.css package for J2SE 5.0

OrgW3cDomCssAPI
type: Class
subclass of: OrgW3cDomCssAPI
comment: platform:comprisesInterfacePart some OrgW3cDomCss
comment: JavaLibrary implementing the org.w3c.dom.css package for J2SE 5.0

OrgW3cDomCssClassLibrary
type: Class
subclass of: OrgW3cDomCssClassLibrary
comment: platform:implementsInterface some OrgW3cDomCssAPI
comment: JavaLibrary implementing the org.w3c.dom.css package for J2SE 5.0

OrgW3cDomEvents
type: Class
subclass of: JavaAPIPart
comment: Java API part implementing the org.w3c.dom.events package for J2SE 5.0

OrgW3cDomEventsAPI
type: Class
subclass of: JavaAPI
comment: platform:comprisesInterfacePart some OrgW3cDomEvents
comment: JavaLibrary implementing the org.w3c.dom.events package for J2SE 5.0

OrgW3cDomEventsClassLibrary
type: Class
subclass of: JavaClassLibrary
comment: platform:implementsInterface some OrgW3cDomEventsAPI
comment: JavaLibrary implementing the org.w3c.dom.events package for J2SE 5.0

OrgW3cDomHtml
type: Class
subclass of: OrgW3cDomHtml
comment: Java API part implementing the org.w3c.dom.html package for J2SE 5.0

OrgW3cDomHtmlAPI
type: Class
subclass of: OrgW3cDomHtmlAPI
comment: platform:comprisesInterfacePart some OrgW3cDomHtml
comment: JavaLibrary implementing the org.w3c.dom.html package for J2SE 5.0

OrgW3cDomHtmlClassLibrary
type: Class
subclass of: OrgW3cDomHtmlClassLibrary
comment: platform:implementsInterface some OrgW3cDomHtmlAPI
comment: JavaLibrary implementing the org.w3c.dom.html package for J2SE 5.0

OrgW3cDomLs
type: Class
subclass of: JavaAPIPart
comment: Java API part implementing the org.w3c.dom.ls package for J2SE 5.0

OrgW3cDomLsAPI
type: Class
subclass of: JavaAPI
comment: platform:comprisesInterfacePart some OrgW3cDomLs
comment: JavaLibrary implementing the org.w3c.dom.ls package for J2SE 5.0

OrgW3cDomLsClassLibrary
type: Class
subclass of: JavaClassLibrary
comment: platform:implementsInterface some OrgW3cDomLsAPI
comment: JavaLibrary implementing the org.w3c.dom.ls package for J2SE 5.0

OrgW3cDomRanges
type: Class
subclass of: JavaAPIPart
comment: Java API part implementing the org.w3c.dom.ranges package for J2SE 5.0

OrgW3cDomRangesAPI
type: Class
subclass of: JavaAPI
comment: platform:comprisesInterfacePart some OrgW3cDomRanges
comment: JavaLibrary implementing the org.w3c.dom.ranges package for J2SE 5.0

OrgW3cDomRangesClassLibrary
type: Class
subclass of: JavaClassLibrary
comment: platform:implementsInterface some OrgW3cDomRangesAPI
comment: JavaLibrary implementing the org.w3c.dom.ranges package for J2SE 5.0

OrgW3cDomStylesheets
type: Class
subclass of: JavaAPIPart
comment: Java API part implementing the org.w3c.dom.stylesheets package for J2SE 5.0

OrgW3cDomStylesheetsAPI
type: Class
subclass of: JavaAPI
comment: platform:comprisesInterfacePart some OrgW3cDomStylesheets
comment: JavaLibrary implementing the org.w3c.dom.stylesheets package for J2SE 5.0

OrgW3cDomStylesheetsClassLibrary
type: Class
subclass of: JavaClassLibrary
comment: platform:implementsInterface some OrgW3cDomStylesheetsAPI
comment: JavaLibrary implementing the org.w3c.dom.stylesheets package for J2SE 5.0

OrgW3cDomTraversal
type: Class
subclass of: JavaAPIPart
comment: Java API part implementing the org.w3c.dom.traversal package for J2SE 5.0

OrgW3cDomTraversalAPI
type: Class
subclass of: JavaAPI
comment: platform:comprisesInterfacePart some OrgW3cDomTraversal
comment: JavaLibrary implementing the org.w3c.dom.traversal package for J2SE 5.0

OrgW3cDomTraversalClassLibrary
type: Class
subclass of: JavaClassLibrary
comment: platform:implementsInterface some OrgW3cDomTraversalAPI
comment: JavaLibrary implementing the org.w3c.dom.traversal package for J2SE 5.0

OrgW3cDomViews
type: Class
subclass of: JavaAPIPart
comment: Java API part implementing the org.w3c.dom.views package for J2SE 5.0

OrgW3cDomViewsAPI
type: Class
subclass of: JavaAPI
comment: platform:comprisesInterfacePart some OrgW3cDomViews
comment: JavaLibrary implementing the org.w3c.dom.views package for J2SE 5.0

OrgW3cDomViewsClassLibrary
type: Class
subclass of: JavaClassLibrary
comment: platform:implementsInterface some OrgW3cDomViewsAPI
comment: JavaLibrary implementing the org.w3c.dom.views package for J2SE 5.0

OrgXmlSax
type: Class
subclass of: JavaAPIPart
comment: Java API part implementing the org.xml.sax package for J2SE 5.0

OrgXmlSaxAPI
type: Class
subclass of: JavaAPI
comment: platform:comprisesInterfacePart some OrgXmlSax
comment: JavaLibrary implementing the org.xml.sax package for J2SE 5.0

OrgXmlSaxClassLibrary
type: Class
subclass of: JavaClassLibrary
comment: platform:implementsInterface some OrgXmlSaxAPI
comment: JavaLibrary implementing the org.xml.sax package for J2SE 5.0

OrgXmlSaxExt
type: Class
subclass of: OrgXmlSaxExt
comment: Java API part implementing the org.xml.sax.ext package for J2SE 5.0

OrgXmlSaxExtAPI
type: Class
subclass of: OrgXmlSaxExtAPI
comment: platform:comprisesInterfacePart some OrgXmlSaxExt
comment: JavaLibrary implementing the org.xml.sax.ext package for J2SE 5.0

OrgXmlSaxExtClassLibrary
type: Class
subclass of: OrgXmlSaxExtClassLibrary
comment: platform:implementsInterface some OrgXmlSaxExtAPI
comment: JavaLibrary implementing the org.xml.sax.ext package for J2SE 5.0

OrgXmlSaxHelpers
type: Class
subclass of: OrgXmlSaxHelpers
comment: Java API part implementing the org.xml.sax.helpers package for J2SE 5.0

OrgXmlSaxHelpersAPI
type: Class
subclass of: OrgXmlSaxHelpersAPI
comment: platform:comprisesInterfacePart some OrgXmlSaxHelpers
comment: JavaLibrary implementing the org.xml.sax.helpers package for J2SE 5.0

OrgXmlSaxHelpersClassLibrary
type: Class
subclass of: OrgXmlSaxHelpersClassLibrary
comment: platform:implementsInterface some OrgXmlSaxHelpersAPI
comment: JavaLibrary implementing the org.xml.sax.helpers package for J2SE 5.0

theJ2SE5 0BytecodeFormat
type: Thing
type: J2SE5 0BytecodeFormat
minor version number: 3
major version number: 49
preverified: false