Java SE 6
type: Ontology
creator: Dennis Wagelaar <dennis.wagelaar@vub.ac.be>
version info: $Id$
comment: Generated by [UML2ToSimplifiedPackageAPIOntology.atl 8080 2010-03-18 10:46:40Z dwagelaa], [UML2ToPackageAPIOntology.atl 8082 2010-03-18 21:11:00Z dwagelaa], [UML2ToAPIOntology.atl 8082 2010-03-18 21:11:00Z dwagelaa], and [UML2Comparison.atl 8082 2010-03-18 21:11:00Z dwagelaa]
rights: © 2010, Vrije Universiteit Brussel. All rights reserved.
imports: isa.owl
imports: j2se-5 0.owl
imports: java.owl
imports: platform.owl

JavaApplet
type: Class
subclass of: JavaApplet
comment: Java API part implementing the java.applet package for Java SE 6

JavaAppletAPI
type: Class
subclass of: JavaAppletAPI
comment: platform:comprisesInterfacePart some JavaApplet
comment: JavaLibrary implementing the java.applet package for Java SE 6

JavaAppletClassLibrary
type: Class
subclass of: JavaAppletClassLibrary
comment: platform:implementsInterface some JavaAppletAPI
comment: JavaLibrary implementing the java.applet package for Java SE 6

JavaAwt
type: Class
subclass of: JavaAwt
comment: Java API part implementing the java.awt package for Java SE 6

JavaAwtAPI
type: Class
subclass of: JavaAwtAPI
comment: platform:comprisesInterfacePart some JavaAwt
comment: JavaLibrary implementing the java.awt package for Java SE 6

JavaAwtClassLibrary
type: Class
subclass of: JavaAwtClassLibrary
comment: platform:implementsInterface some JavaAwtAPI
comment: JavaLibrary implementing the java.awt package for Java SE 6

JavaAwtColor
type: Class
subclass of: JavaAPIPart
comment: Java API part implementing the java.awt.color package for Java SE 6

JavaAwtColorAPI
type: Class
subclass of: JavaAPI
comment: platform:comprisesInterfacePart some JavaAwtColor
comment: JavaLibrary implementing the java.awt.color package for Java SE 6

JavaAwtColorClassLibrary
type: Class
subclass of: JavaClassLibrary
comment: platform:implementsInterface some JavaAwtColorAPI
comment: JavaLibrary implementing the java.awt.color package for Java SE 6

JavaAwtDatatransfer
type: Class
subclass of: JavaAPIPart
comment: Java API part implementing the java.awt.datatransfer package for Java SE 6

JavaAwtDatatransferAPI
type: Class
subclass of: JavaAPI
comment: platform:comprisesInterfacePart some JavaAwtDatatransfer
comment: JavaLibrary implementing the java.awt.datatransfer package for Java SE 6

JavaAwtDatatransferClassLibrary
type: Class
subclass of: JavaClassLibrary
comment: platform:implementsInterface some JavaAwtDatatransferAPI
comment: JavaLibrary implementing the java.awt.datatransfer package for Java SE 6

JavaAwtDnd
type: Class
subclass of: JavaAPIPart
comment: Java API part implementing the java.awt.dnd package for Java SE 6

JavaAwtDndAPI
type: Class
subclass of: JavaAPI
comment: platform:comprisesInterfacePart some JavaAwtDnd
comment: JavaLibrary implementing the java.awt.dnd package for Java SE 6

JavaAwtDndClassLibrary
type: Class
subclass of: JavaClassLibrary
comment: platform:implementsInterface some JavaAwtDndAPI
comment: JavaLibrary implementing the java.awt.dnd package for Java SE 6

JavaAwtEvent
type: Class
subclass of: JavaAwtEvent
comment: Java API part implementing the java.awt.event package for Java SE 6

JavaAwtEventAPI
type: Class
subclass of: JavaAwtEventAPI
comment: platform:comprisesInterfacePart some JavaAwtEvent
comment: JavaLibrary implementing the java.awt.event package for Java SE 6

JavaAwtEventClassLibrary
type: Class
subclass of: JavaAwtEventClassLibrary
comment: platform:implementsInterface some JavaAwtEventAPI
comment: JavaLibrary implementing the java.awt.event package for Java SE 6

JavaAwtFont
type: Class
subclass of: JavaAwtFont
comment: Java API part implementing the java.awt.font package for Java SE 6

JavaAwtFontAPI
type: Class
subclass of: JavaAwtFontAPI
comment: platform:comprisesInterfacePart some JavaAwtFont
comment: JavaLibrary implementing the java.awt.font package for Java SE 6

JavaAwtFontClassLibrary
type: Class
subclass of: JavaAwtFontClassLibrary
comment: platform:implementsInterface some JavaAwtFontAPI
comment: JavaLibrary implementing the java.awt.font package for Java SE 6

JavaAwtGeom
type: Class
subclass of: JavaAPIPart
comment: Java API part implementing the java.awt.geom package for Java SE 6

JavaAwtGeomAPI
type: Class
subclass of: JavaAPI
comment: platform:comprisesInterfacePart some JavaAwtGeom
comment: JavaLibrary implementing the java.awt.geom package for Java SE 6

JavaAwtGeomClassLibrary
type: Class
subclass of: JavaClassLibrary
comment: platform:implementsInterface some JavaAwtGeomAPI
comment: JavaLibrary implementing the java.awt.geom package for Java SE 6

JavaAwtIm
type: Class
subclass of: JavaAPIPart
comment: Java API part implementing the java.awt.im package for Java SE 6

JavaAwtImAPI
type: Class
subclass of: JavaAPI
comment: platform:comprisesInterfacePart some JavaAwtIm
comment: JavaLibrary implementing the java.awt.im package for Java SE 6

JavaAwtImClassLibrary
type: Class
subclass of: JavaClassLibrary
comment: platform:implementsInterface some JavaAwtImAPI
comment: JavaLibrary implementing the java.awt.im package for Java SE 6

JavaAwtImSpi
type: Class
subclass of: JavaAPIPart
comment: Java API part implementing the java.awt.im.spi package for Java SE 6

JavaAwtImSpiAPI
type: Class
subclass of: JavaAPI
comment: platform:comprisesInterfacePart some JavaAwtImSpi
comment: JavaLibrary implementing the java.awt.im.spi package for Java SE 6

JavaAwtImSpiClassLibrary
type: Class
subclass of: JavaClassLibrary
comment: platform:implementsInterface some JavaAwtImSpiAPI
comment: JavaLibrary implementing the java.awt.im.spi package for Java SE 6

JavaAwtImage
type: Class
subclass of: JavaAwtImage
comment: Java API part implementing the java.awt.image package for Java SE 6

JavaAwtImageAPI
type: Class
subclass of: JavaAwtImageAPI
comment: platform:comprisesInterfacePart some JavaAwtImage
comment: JavaLibrary implementing the java.awt.image package for Java SE 6

JavaAwtImageClassLibrary
type: Class
subclass of: JavaAwtImageClassLibrary
comment: platform:implementsInterface some JavaAwtImageAPI
comment: JavaLibrary implementing the java.awt.image package for Java SE 6

JavaAwtImageRenderable
type: Class
subclass of: JavaAPIPart
comment: Java API part implementing the java.awt.image.renderable package for Java SE 6

JavaAwtImageRenderableAPI
type: Class
subclass of: JavaAPI
comment: platform:comprisesInterfacePart some JavaAwtImageRenderable
comment: JavaLibrary implementing the java.awt.image.renderable package for Java SE 6

JavaAwtImageRenderableClassLibrary
type: Class
subclass of: JavaClassLibrary
comment: platform:implementsInterface some JavaAwtImageRenderableAPI
comment: JavaLibrary implementing the java.awt.image.renderable package for Java SE 6

JavaAwtPrint
type: Class
subclass of: JavaAwtPrint
comment: Java API part implementing the java.awt.print package for Java SE 6

JavaAwtPrintAPI
type: Class
subclass of: JavaAwtPrintAPI
comment: platform:comprisesInterfacePart some JavaAwtPrint
comment: JavaLibrary implementing the java.awt.print package for Java SE 6

JavaAwtPrintClassLibrary
type: Class
subclass of: JavaAwtPrintClassLibrary
comment: platform:implementsInterface some JavaAwtPrintAPI
comment: JavaLibrary implementing the java.awt.print package for Java SE 6

JavaBeans
type: Class
subclass of: JavaBeans
comment: Java API part implementing the java.beans package for Java SE 6

JavaBeansAPI
type: Class
subclass of: JavaBeansAPI
comment: platform:comprisesInterfacePart some JavaBeans
comment: JavaLibrary implementing the java.beans package for Java SE 6

JavaBeansBeancontext
type: Class
subclass of: JavaAPIPart
comment: Java API part implementing the java.beans.beancontext package for Java SE 6

JavaBeansBeancontextAPI
type: Class
subclass of: JavaAPI
comment: platform:comprisesInterfacePart some JavaBeansBeancontext
comment: JavaLibrary implementing the java.beans.beancontext package for Java SE 6

JavaBeansBeancontextClassLibrary
type: Class
subclass of: JavaClassLibrary
comment: platform:implementsInterface some JavaBeansBeancontextAPI
comment: JavaLibrary implementing the java.beans.beancontext package for Java SE 6

JavaBeansClassLibrary
type: Class
subclass of: JavaBeansClassLibrary
comment: platform:implementsInterface some JavaBeansAPI
comment: JavaLibrary implementing the java.beans package for Java SE 6

JavaIo
type: Class
subclass of: JavaIo
comment: Java API part implementing the java.io package for Java SE 6

JavaIoAPI
type: Class
subclass of: JavaIoAPI
comment: platform:comprisesInterfacePart some JavaIo
comment: JavaLibrary implementing the java.io package for Java SE 6

JavaIoClassLibrary
type: Class
subclass of: JavaIoClassLibrary
comment: platform:implementsInterface some JavaIoAPI
comment: JavaLibrary implementing the java.io package for Java SE 6

JavaLang
type: Class
subclass of: JavaLang
comment: Java API part implementing the java.lang package for Java SE 6

JavaLangAPI
type: Class
subclass of: JavaLangAPI
comment: platform:comprisesInterfacePart some JavaLang
comment: JavaLibrary implementing the java.lang package for Java SE 6

JavaLangAnnotation
type: Class
subclass of: JavaLangAnnotation
comment: Java API part implementing the java.lang.annotation package for Java SE 6

JavaLangAnnotationAPI
type: Class
subclass of: JavaLangAnnotationAPI
comment: platform:comprisesInterfacePart some JavaLangAnnotation
comment: JavaLibrary implementing the java.lang.annotation package for Java SE 6

JavaLangAnnotationClassLibrary
type: Class
subclass of: JavaLangAnnotationClassLibrary
comment: platform:implementsInterface some JavaLangAnnotationAPI
comment: JavaLibrary implementing the java.lang.annotation package for Java SE 6

JavaLangClassLibrary
type: Class
subclass of: JavaLangClassLibrary
comment: platform:implementsInterface some JavaLangAPI
comment: JavaLibrary implementing the java.lang package for Java SE 6

JavaLangInstrument
type: Class
subclass of: JavaLangInstrument
comment: Java API part implementing the java.lang.instrument package for Java SE 6

JavaLangInstrumentAPI
type: Class
subclass of: JavaLangInstrumentAPI
comment: platform:comprisesInterfacePart some JavaLangInstrument
comment: JavaLibrary implementing the java.lang.instrument package for Java SE 6

JavaLangInstrumentClassLibrary
type: Class
subclass of: JavaLangInstrumentClassLibrary
comment: platform:implementsInterface some JavaLangInstrumentAPI
comment: JavaLibrary implementing the java.lang.instrument package for Java SE 6

JavaLangManagement
type: Class
subclass of: JavaLangManagement
comment: Java API part implementing the java.lang.management package for Java SE 6

JavaLangManagementAPI
type: Class
subclass of: JavaLangManagementAPI
comment: platform:comprisesInterfacePart some JavaLangManagement
comment: JavaLibrary implementing the java.lang.management package for Java SE 6

JavaLangManagementClassLibrary
type: Class
subclass of: JavaLangManagementClassLibrary
comment: platform:implementsInterface some JavaLangManagementAPI
comment: JavaLibrary implementing the java.lang.management package for Java SE 6

JavaLangRef
type: Class
subclass of: JavaAPIPart
comment: Java API part implementing the java.lang.ref package for Java SE 6

JavaLangRefAPI
type: Class
subclass of: JavaAPI
comment: platform:comprisesInterfacePart some JavaLangRef
comment: JavaLibrary implementing the java.lang.ref package for Java SE 6

JavaLangRefClassLibrary
type: Class
subclass of: JavaClassLibrary
comment: platform:implementsInterface some JavaLangRefAPI
comment: JavaLibrary implementing the java.lang.ref package for Java SE 6

JavaLangReflect
type: Class
subclass of: JavaAPIPart
comment: Java API part implementing the java.lang.reflect package for Java SE 6

JavaLangReflectAPI
type: Class
subclass of: JavaAPI
comment: platform:comprisesInterfacePart some JavaLangReflect
comment: JavaLibrary implementing the java.lang.reflect package for Java SE 6

JavaLangReflectClassLibrary
type: Class
subclass of: JavaClassLibrary
comment: platform:implementsInterface some JavaLangReflectAPI
comment: JavaLibrary implementing the java.lang.reflect package for Java SE 6

JavaMath
type: Class
subclass of: JavaMath
comment: Java API part implementing the java.math package for Java SE 6

JavaMathAPI
type: Class
subclass of: JavaMathAPI
comment: platform:comprisesInterfacePart some JavaMath
comment: JavaLibrary implementing the java.math package for Java SE 6

JavaMathClassLibrary
type: Class
subclass of: JavaMathClassLibrary
comment: platform:implementsInterface some JavaMathAPI
comment: JavaLibrary implementing the java.math package for Java SE 6

JavaNet
type: Class
subclass of: JavaNet
comment: Java API part implementing the java.net package for Java SE 6

JavaNetAPI
type: Class
subclass of: JavaNetAPI
comment: platform:comprisesInterfacePart some JavaNet
comment: JavaLibrary implementing the java.net package for Java SE 6

JavaNetClassLibrary
type: Class
subclass of: JavaNetClassLibrary
comment: platform:implementsInterface some JavaNetAPI
comment: JavaLibrary implementing the java.net package for Java SE 6

JavaNio
type: Class
subclass of: JavaNio
comment: Java API part implementing the java.nio package for Java SE 6

JavaNioAPI
type: Class
subclass of: JavaNioAPI
comment: platform:comprisesInterfacePart some JavaNio
comment: JavaLibrary implementing the java.nio package for Java SE 6

JavaNioChannels
type: Class
subclass of: JavaAPIPart
comment: Java API part implementing the java.nio.channels package for Java SE 6

JavaNioChannelsAPI
type: Class
subclass of: JavaAPI
comment: platform:comprisesInterfacePart some JavaNioChannels
comment: JavaLibrary implementing the java.nio.channels package for Java SE 6

JavaNioChannelsClassLibrary
type: Class
subclass of: JavaClassLibrary
comment: platform:implementsInterface some JavaNioChannelsAPI
comment: JavaLibrary implementing the java.nio.channels package for Java SE 6

JavaNioChannelsSpi
type: Class
subclass of: JavaAPIPart
comment: Java API part implementing the java.nio.channels.spi package for Java SE 6

JavaNioChannelsSpiAPI
type: Class
subclass of: JavaAPI
comment: platform:comprisesInterfacePart some JavaNioChannelsSpi
comment: JavaLibrary implementing the java.nio.channels.spi package for Java SE 6

JavaNioChannelsSpiClassLibrary
type: Class
subclass of: JavaClassLibrary
comment: platform:implementsInterface some JavaNioChannelsSpiAPI
comment: JavaLibrary implementing the java.nio.channels.spi package for Java SE 6

JavaNioCharset
type: Class
subclass of: JavaAPIPart
comment: Java API part implementing the java.nio.charset package for Java SE 6

JavaNioCharsetAPI
type: Class
subclass of: JavaAPI
comment: platform:comprisesInterfacePart some JavaNioCharset
comment: JavaLibrary implementing the java.nio.charset package for Java SE 6

JavaNioCharsetClassLibrary
type: Class
subclass of: JavaClassLibrary
comment: platform:implementsInterface some JavaNioCharsetAPI
comment: JavaLibrary implementing the java.nio.charset package for Java SE 6

JavaNioCharsetSpi
type: Class
subclass of: JavaAPIPart
comment: Java API part implementing the java.nio.charset.spi package for Java SE 6

JavaNioCharsetSpiAPI
type: Class
subclass of: JavaAPI
comment: platform:comprisesInterfacePart some JavaNioCharsetSpi
comment: JavaLibrary implementing the java.nio.charset.spi package for Java SE 6

JavaNioCharsetSpiClassLibrary
type: Class
subclass of: JavaClassLibrary
comment: platform:implementsInterface some JavaNioCharsetSpiAPI
comment: JavaLibrary implementing the java.nio.charset.spi package for Java SE 6

JavaNioClassLibrary
type: Class
subclass of: JavaNioClassLibrary
comment: platform:implementsInterface some JavaNioAPI
comment: JavaLibrary implementing the java.nio package for Java SE 6

JavaRmi
type: Class
subclass of: JavaAPIPart
comment: Java API part implementing the java.rmi package for Java SE 6

JavaRmiAPI
type: Class
subclass of: JavaAPI
comment: platform:comprisesInterfacePart some JavaRmi
comment: JavaLibrary implementing the java.rmi package for Java SE 6

JavaRmiActivation
type: Class
subclass of: JavaAPIPart
comment: Java API part implementing the java.rmi.activation package for Java SE 6

JavaRmiActivationAPI
type: Class
subclass of: JavaAPI
comment: platform:comprisesInterfacePart some JavaRmiActivation
comment: JavaLibrary implementing the java.rmi.activation package for Java SE 6

JavaRmiActivationClassLibrary
type: Class
subclass of: JavaClassLibrary
comment: platform:implementsInterface some JavaRmiActivationAPI
comment: JavaLibrary implementing the java.rmi.activation package for Java SE 6

JavaRmiClassLibrary
type: Class
subclass of: JavaClassLibrary
comment: platform:implementsInterface some JavaRmiAPI
comment: JavaLibrary implementing the java.rmi package for Java SE 6

JavaRmiDgc
type: Class
subclass of: JavaAPIPart
comment: Java API part implementing the java.rmi.dgc package for Java SE 6

JavaRmiDgcAPI
type: Class
subclass of: JavaAPI
comment: platform:comprisesInterfacePart some JavaRmiDgc
comment: JavaLibrary implementing the java.rmi.dgc package for Java SE 6

JavaRmiDgcClassLibrary
type: Class
subclass of: JavaClassLibrary
comment: platform:implementsInterface some JavaRmiDgcAPI
comment: JavaLibrary implementing the java.rmi.dgc package for Java SE 6

JavaRmiRegistry
type: Class
subclass of: JavaAPIPart
comment: Java API part implementing the java.rmi.registry package for Java SE 6

JavaRmiRegistryAPI
type: Class
subclass of: JavaAPI
comment: platform:comprisesInterfacePart some JavaRmiRegistry
comment: JavaLibrary implementing the java.rmi.registry package for Java SE 6

JavaRmiRegistryClassLibrary
type: Class
subclass of: JavaClassLibrary
comment: platform:implementsInterface some JavaRmiRegistryAPI
comment: JavaLibrary implementing the java.rmi.registry package for Java SE 6

JavaRmiServer
type: Class
subclass of: JavaRmiServer
comment: Java API part implementing the java.rmi.server package for Java SE 6

JavaRmiServerAPI
type: Class
subclass of: JavaRmiServerAPI
comment: platform:comprisesInterfacePart some JavaRmiServer
comment: JavaLibrary implementing the java.rmi.server package for Java SE 6

JavaRmiServerClassLibrary
type: Class
subclass of: JavaRmiServerClassLibrary
comment: platform:implementsInterface some JavaRmiServerAPI
comment: JavaLibrary implementing the java.rmi.server package for Java SE 6

JavaSE6API
type: Class
subclass of: JavaAppletAPI
subclass of: JavaAwtAPI
subclass of: JavaAwtColorAPI
subclass of: JavaAwtDatatransferAPI
subclass of: JavaAwtDndAPI
subclass of: JavaAwtEventAPI
subclass of: JavaAwtFontAPI
subclass of: JavaAwtGeomAPI
subclass of: JavaAwtImAPI
subclass of: JavaAwtImSpiAPI
subclass of: JavaAwtImageAPI
subclass of: JavaAwtImageRenderableAPI
subclass of: JavaAwtPrintAPI
subclass of: JavaBeansAPI
subclass of: JavaBeansBeancontextAPI
subclass of: JavaIoAPI
subclass of: JavaLangAPI
subclass of: JavaLangAnnotationAPI
subclass of: JavaLangInstrumentAPI
subclass of: JavaLangManagementAPI
subclass of: JavaLangRefAPI
subclass of: JavaLangReflectAPI
subclass of: JavaMathAPI
subclass of: JavaNetAPI
subclass of: JavaNioAPI
subclass of: JavaNioChannelsAPI
subclass of: JavaNioChannelsSpiAPI
subclass of: JavaNioCharsetAPI
subclass of: JavaNioCharsetSpiAPI
subclass of: JavaRmiAPI
subclass of: JavaRmiActivationAPI
subclass of: JavaRmiDgcAPI
subclass of: JavaRmiRegistryAPI
subclass of: JavaRmiServerAPI
subclass of: JavaSecurityAPI
subclass of: JavaSecurityAclAPI
subclass of: JavaSecurityCertAPI
subclass of: JavaSecurityInterfacesAPI
subclass of: JavaSecuritySpecAPI
subclass of: JavaSqlAPI
subclass of: JavaTextAPI
subclass of: JavaTextSpiAPI
subclass of: JavaUtilAPI
subclass of: JavaUtilConcurrentAPI
subclass of: JavaUtilConcurrentAtomicAPI
subclass of: JavaUtilConcurrentLocksAPI
subclass of: JavaUtilJarAPI
subclass of: JavaUtilLoggingAPI
subclass of: JavaUtilPrefsAPI
subclass of: JavaUtilRegexAPI
subclass of: JavaUtilSpiAPI
subclass of: JavaUtilZipAPI
subclass of: JavaxAccessibilityAPI
subclass of: JavaxActivationAPI
subclass of: JavaxActivityAPI
subclass of: JavaxAnnotationAPI
subclass of: JavaxAnnotationProcessingAPI
subclass of: JavaxCryptoAPI
subclass of: JavaxCryptoInterfacesAPI
subclass of: JavaxCryptoSpecAPI
subclass of: JavaxImageioAPI
subclass of: JavaxImageioEventAPI
subclass of: JavaxImageioMetadataAPI
subclass of: JavaxImageioPluginsBmpAPI
subclass of: JavaxImageioPluginsJpegAPI
subclass of: JavaxImageioSpiAPI
subclass of: JavaxImageioStreamAPI
subclass of: JavaxJnlpAPI
subclass of: JavaxJwsAPI
subclass of: JavaxJwsSoapAPI
subclass of: JavaxLangModelAPI
subclass of: JavaxLangModelElementAPI
subclass of: JavaxLangModelTypeAPI
subclass of: JavaxLangModelUtilAPI
subclass of: JavaxManagementAPI
subclass of: JavaxManagementLoadingAPI
subclass of: JavaxManagementModelmbeanAPI
subclass of: JavaxManagementMonitorAPI
subclass of: JavaxManagementOpenmbeanAPI

JavaSE6BytecodeFormat
type: Class
equivalent class: Class
  intersection of: Restriction
    on property: majorVersionNumber
    some values from: Datatype
      on datatype: integer
      with restrictions:
        min inclusive: 50
  intersection of: Restriction
    on property: preverified
    has value: false
subclass of: J2SE5 0BytecodeFormat
comment: Java SE 6 bytecode format

JavaSE6ClassLibrary
type: Class
subclass of: JavaAppletClassLibrary
subclass of: JavaAwtClassLibrary
subclass of: JavaAwtColorClassLibrary
subclass of: JavaAwtDatatransferClassLibrary
subclass of: JavaAwtDndClassLibrary
subclass of: JavaAwtEventClassLibrary
subclass of: JavaAwtFontClassLibrary
subclass of: JavaAwtGeomClassLibrary
subclass of: JavaAwtImClassLibrary
subclass of: JavaAwtImSpiClassLibrary
subclass of: JavaAwtImageClassLibrary
subclass of: JavaAwtImageRenderableClassLibrary
subclass of: JavaAwtPrintClassLibrary
subclass of: JavaBeansBeancontextClassLibrary
subclass of: JavaBeansClassLibrary
subclass of: JavaIoClassLibrary
subclass of: JavaLangAnnotationClassLibrary
subclass of: JavaLangClassLibrary
subclass of: JavaLangInstrumentClassLibrary
subclass of: JavaLangManagementClassLibrary
subclass of: JavaLangRefClassLibrary
subclass of: JavaLangReflectClassLibrary
subclass of: JavaMathClassLibrary
subclass of: JavaNetClassLibrary
subclass of: JavaNioChannelsClassLibrary
subclass of: JavaNioChannelsSpiClassLibrary
subclass of: JavaNioCharsetClassLibrary
subclass of: JavaNioCharsetSpiClassLibrary
subclass of: JavaNioClassLibrary
subclass of: JavaRmiActivationClassLibrary
subclass of: JavaRmiClassLibrary
subclass of: JavaRmiDgcClassLibrary
subclass of: JavaRmiRegistryClassLibrary
subclass of: JavaRmiServerClassLibrary
subclass of: JavaSecurityAclClassLibrary
subclass of: JavaSecurityCertClassLibrary
subclass of: JavaSecurityClassLibrary
subclass of: JavaSecurityInterfacesClassLibrary
subclass of: JavaSecuritySpecClassLibrary
subclass of: JavaSqlClassLibrary
subclass of: JavaTextClassLibrary
subclass of: JavaTextSpiClassLibrary
subclass of: JavaUtilClassLibrary
subclass of: JavaUtilConcurrentAtomicClassLibrary
subclass of: JavaUtilConcurrentClassLibrary
subclass of: JavaUtilConcurrentLocksClassLibrary
subclass of: JavaUtilJarClassLibrary
subclass of: JavaUtilLoggingClassLibrary
subclass of: JavaUtilPrefsClassLibrary
subclass of: JavaUtilRegexClassLibrary
subclass of: JavaUtilSpiClassLibrary
subclass of: JavaUtilZipClassLibrary
subclass of: JavaxAccessibilityClassLibrary
subclass of: JavaxActivationClassLibrary
subclass of: JavaxActivityClassLibrary
subclass of: JavaxAnnotationClassLibrary
subclass of: JavaxAnnotationProcessingClassLibrary
subclass of: JavaxCryptoClassLibrary
subclass of: JavaxCryptoInterfacesClassLibrary
subclass of: JavaxCryptoSpecClassLibrary
subclass of: JavaxImageioClassLibrary
subclass of: JavaxImageioEventClassLibrary
subclass of: JavaxImageioMetadataClassLibrary
subclass of: JavaxImageioPluginsBmpClassLibrary
subclass of: JavaxImageioPluginsJpegClassLibrary
subclass of: JavaxImageioSpiClassLibrary
subclass of: JavaxImageioStreamClassLibrary
subclass of: JavaxJnlpClassLibrary
subclass of: JavaxJwsClassLibrary
subclass of: JavaxJwsSoapClassLibrary
subclass of: JavaxLangModelClassLibrary
subclass of: JavaxLangModelElementClassLibrary
subclass of: JavaxLangModelTypeClassLibrary
subclass of: JavaxLangModelUtilClassLibrary
subclass of: JavaxManagementClassLibrary
subclass of: JavaxManagementLoadingClassLibrary
subclass of: JavaxManagementModelmbeanClassLibrary
subclass of: JavaxManagementMonitorClassLibrary
subclass of: JavaxManagementOpenmbeanClassLibrary

JavaSE6JRE
type: Class
equivalent class: Class
  intersection of: Restriction
    on property: providesFeature
    some values from: JavaSE6ClassLibrary
  intersection of: Restriction
    on property: providesFeature
    some values from: JavaSE6VM
subclass of: JRE
comment: Java SE 6 Java Runtime Environment

JavaSE6VM
type: Class
equivalent class: Restriction
  on property: implementsInterface
  some values from: JavaSE6BytecodeFormat
subclass of: JavaVM
comment: Java SE 6 virtual machine

JavaSecurity
type: Class
subclass of: JavaSecurity
comment: Java API part implementing the java.security package for Java SE 6

JavaSecurityAPI
type: Class
subclass of: JavaSecurityAPI
comment: platform:comprisesInterfacePart some JavaSecurity
comment: JavaLibrary implementing the java.security package for Java SE 6

JavaSecurityAcl
type: Class
subclass of: JavaAPIPart
comment: Java API part implementing the java.security.acl package for Java SE 6

JavaSecurityAclAPI
type: Class
subclass of: JavaAPI
comment: platform:comprisesInterfacePart some JavaSecurityAcl
comment: JavaLibrary implementing the java.security.acl package for Java SE 6

JavaSecurityAclClassLibrary
type: Class
subclass of: JavaClassLibrary
comment: platform:implementsInterface some JavaSecurityAclAPI
comment: JavaLibrary implementing the java.security.acl package for Java SE 6

JavaSecurityCert
type: Class
subclass of: JavaAPIPart
comment: Java API part implementing the java.security.cert package for Java SE 6

JavaSecurityCertAPI
type: Class
subclass of: JavaAPI
comment: platform:comprisesInterfacePart some JavaSecurityCert
comment: JavaLibrary implementing the java.security.cert package for Java SE 6

JavaSecurityCertClassLibrary
type: Class
subclass of: JavaClassLibrary
comment: platform:implementsInterface some JavaSecurityCertAPI
comment: JavaLibrary implementing the java.security.cert package for Java SE 6

JavaSecurityClassLibrary
type: Class
subclass of: JavaSecurityClassLibrary
comment: platform:implementsInterface some JavaSecurityAPI
comment: JavaLibrary implementing the java.security package for Java SE 6

JavaSecurityInterfaces
type: Class
subclass of: JavaAPIPart
comment: Java API part implementing the java.security.interfaces package for Java SE 6

JavaSecurityInterfacesAPI
type: Class
subclass of: JavaAPI
comment: platform:comprisesInterfacePart some JavaSecurityInterfaces
comment: JavaLibrary implementing the java.security.interfaces package for Java SE 6

JavaSecurityInterfacesClassLibrary
type: Class
subclass of: JavaClassLibrary
comment: platform:implementsInterface some JavaSecurityInterfacesAPI
comment: JavaLibrary implementing the java.security.interfaces package for Java SE 6

JavaSecuritySpec
type: Class
subclass of: JavaAPIPart
comment: Java API part implementing the java.security.spec package for Java SE 6

JavaSecuritySpecAPI
type: Class
subclass of: JavaAPI
comment: platform:comprisesInterfacePart some JavaSecuritySpec
comment: JavaLibrary implementing the java.security.spec package for Java SE 6

JavaSecuritySpecClassLibrary
type: Class
subclass of: JavaClassLibrary
comment: platform:implementsInterface some JavaSecuritySpecAPI
comment: JavaLibrary implementing the java.security.spec package for Java SE 6

JavaSql
type: Class
subclass of: JavaSql
comment: Java API part implementing the java.sql package for Java SE 6

JavaSqlAPI
type: Class
subclass of: JavaSqlAPI
comment: platform:comprisesInterfacePart some JavaSql
comment: JavaLibrary implementing the java.sql package for Java SE 6

JavaSqlClassLibrary
type: Class
subclass of: JavaSqlClassLibrary
comment: platform:implementsInterface some JavaSqlAPI
comment: JavaLibrary implementing the java.sql package for Java SE 6

JavaText
type: Class
subclass of: JavaAPIPart
comment: Java API part implementing the java.text package for Java SE 6

JavaTextAPI
type: Class
subclass of: JavaAPI
comment: platform:comprisesInterfacePart some JavaText
comment: JavaLibrary implementing the java.text package for Java SE 6

JavaTextClassLibrary
type: Class
subclass of: JavaClassLibrary
comment: platform:implementsInterface some JavaTextAPI
comment: JavaLibrary implementing the java.text package for Java SE 6

JavaTextSpi
type: Class
subclass of: JavaAPIPart
comment: Java API part implementing the java.text.spi package for Java SE 6

JavaTextSpiAPI
type: Class
subclass of: JavaAPI
comment: platform:comprisesInterfacePart some JavaTextSpi
comment: JavaLibrary implementing the java.text.spi package for Java SE 6

JavaTextSpiClassLibrary
type: Class
subclass of: JavaClassLibrary
comment: platform:implementsInterface some JavaTextSpiAPI
comment: JavaLibrary implementing the java.text.spi package for Java SE 6

JavaUtil
type: Class
subclass of: JavaUtil
comment: Java API part implementing the java.util package for Java SE 6

JavaUtilAPI
type: Class
subclass of: JavaUtilAPI
comment: platform:comprisesInterfacePart some JavaUtil
comment: JavaLibrary implementing the java.util package for Java SE 6

JavaUtilClassLibrary
type: Class
subclass of: JavaUtilClassLibrary
comment: platform:implementsInterface some JavaUtilAPI
comment: JavaLibrary implementing the java.util package for Java SE 6

JavaUtilConcurrent
type: Class
subclass of: JavaAPIPart
comment: Java API part implementing the java.util.concurrent package for Java SE 6

JavaUtilConcurrentAPI
type: Class
subclass of: JavaAPI
comment: platform:comprisesInterfacePart some JavaUtilConcurrent
comment: JavaLibrary implementing the java.util.concurrent package for Java SE 6

JavaUtilConcurrentAtomic
type: Class
subclass of: JavaUtilConcurrentAtomic
comment: Java API part implementing the java.util.concurrent.atomic package for Java SE 6

JavaUtilConcurrentAtomicAPI
type: Class
subclass of: JavaUtilConcurrentAtomicAPI
comment: platform:comprisesInterfacePart some JavaUtilConcurrentAtomic
comment: JavaLibrary implementing the java.util.concurrent.atomic package for Java SE 6

JavaUtilConcurrentAtomicClassLibrary
type: Class
subclass of: JavaUtilConcurrentAtomicClassLibrary
comment: platform:implementsInterface some JavaUtilConcurrentAtomicAPI
comment: JavaLibrary implementing the java.util.concurrent.atomic package for Java SE 6

JavaUtilConcurrentClassLibrary
type: Class
subclass of: JavaClassLibrary
comment: platform:implementsInterface some JavaUtilConcurrentAPI
comment: JavaLibrary implementing the java.util.concurrent package for Java SE 6

JavaUtilConcurrentLocks
type: Class
subclass of: JavaUtilConcurrentLocks
comment: Java API part implementing the java.util.concurrent.locks package for Java SE 6

JavaUtilConcurrentLocksAPI
type: Class
subclass of: JavaUtilConcurrentLocksAPI
comment: platform:comprisesInterfacePart some JavaUtilConcurrentLocks
comment: JavaLibrary implementing the java.util.concurrent.locks package for Java SE 6

JavaUtilConcurrentLocksClassLibrary
type: Class
subclass of: JavaUtilConcurrentLocksClassLibrary
comment: platform:implementsInterface some JavaUtilConcurrentLocksAPI
comment: JavaLibrary implementing the java.util.concurrent.locks package for Java SE 6

JavaUtilJar
type: Class
subclass of: JavaAPIPart
comment: Java API part implementing the java.util.jar package for Java SE 6

JavaUtilJarAPI
type: Class
subclass of: JavaAPI
comment: platform:comprisesInterfacePart some JavaUtilJar
comment: JavaLibrary implementing the java.util.jar package for Java SE 6

JavaUtilJarClassLibrary
type: Class
subclass of: JavaClassLibrary
comment: platform:implementsInterface some JavaUtilJarAPI
comment: JavaLibrary implementing the java.util.jar package for Java SE 6

JavaUtilLogging
type: Class
subclass of: JavaUtilLogging
comment: Java API part implementing the java.util.logging package for Java SE 6

JavaUtilLoggingAPI
type: Class
subclass of: JavaUtilLoggingAPI
comment: platform:comprisesInterfacePart some JavaUtilLogging
comment: JavaLibrary implementing the java.util.logging package for Java SE 6

JavaUtilLoggingClassLibrary
type: Class
subclass of: JavaUtilLoggingClassLibrary
comment: platform:implementsInterface some JavaUtilLoggingAPI
comment: JavaLibrary implementing the java.util.logging package for Java SE 6

JavaUtilPrefs
type: Class
subclass of: JavaAPIPart
comment: Java API part implementing the java.util.prefs package for Java SE 6

JavaUtilPrefsAPI
type: Class
subclass of: JavaAPI
comment: platform:comprisesInterfacePart some JavaUtilPrefs
comment: JavaLibrary implementing the java.util.prefs package for Java SE 6

JavaUtilPrefsClassLibrary
type: Class
subclass of: JavaClassLibrary
comment: platform:implementsInterface some JavaUtilPrefsAPI
comment: JavaLibrary implementing the java.util.prefs package for Java SE 6

JavaUtilRegex
type: Class
subclass of: JavaAPIPart
comment: Java API part implementing the java.util.regex package for Java SE 6

JavaUtilRegexAPI
type: Class
subclass of: JavaAPI
comment: platform:comprisesInterfacePart some JavaUtilRegex
comment: JavaLibrary implementing the java.util.regex package for Java SE 6

JavaUtilRegexClassLibrary
type: Class
subclass of: JavaClassLibrary
comment: platform:implementsInterface some JavaUtilRegexAPI
comment: JavaLibrary implementing the java.util.regex package for Java SE 6

JavaUtilSpi
type: Class
subclass of: JavaAPIPart
comment: Java API part implementing the java.util.spi package for Java SE 6

JavaUtilSpiAPI
type: Class
subclass of: JavaAPI
comment: platform:comprisesInterfacePart some JavaUtilSpi
comment: JavaLibrary implementing the java.util.spi package for Java SE 6

JavaUtilSpiClassLibrary
type: Class
subclass of: JavaClassLibrary
comment: platform:implementsInterface some JavaUtilSpiAPI
comment: JavaLibrary implementing the java.util.spi package for Java SE 6

JavaUtilZip
type: Class
subclass of: JavaUtilZip
comment: Java API part implementing the java.util.zip package for Java SE 6

JavaUtilZipAPI
type: Class
subclass of: JavaUtilZipAPI
comment: platform:comprisesInterfacePart some JavaUtilZip
comment: JavaLibrary implementing the java.util.zip package for Java SE 6

JavaUtilZipClassLibrary
type: Class
subclass of: JavaUtilZipClassLibrary
comment: platform:implementsInterface some JavaUtilZipAPI
comment: JavaLibrary implementing the java.util.zip package for Java SE 6

JavaxAccessibility
type: Class
subclass of: JavaxAccessibility
comment: Java API part implementing the javax.accessibility package for Java SE 6

JavaxAccessibilityAPI
type: Class
subclass of: JavaxAccessibilityAPI
comment: platform:comprisesInterfacePart some JavaxAccessibility
comment: JavaLibrary implementing the javax.accessibility package for Java SE 6

JavaxAccessibilityClassLibrary
type: Class
subclass of: JavaxAccessibilityClassLibrary
comment: platform:implementsInterface some JavaxAccessibilityAPI
comment: JavaLibrary implementing the javax.accessibility package for Java SE 6

JavaxActivation
type: Class
subclass of: JavaAPIPart
comment: Java API part implementing the javax.activation package for Java SE 6

JavaxActivationAPI
type: Class
subclass of: JavaAPI
comment: platform:comprisesInterfacePart some JavaxActivation
comment: JavaLibrary implementing the javax.activation package for Java SE 6

JavaxActivationClassLibrary
type: Class
subclass of: JavaClassLibrary
comment: platform:implementsInterface some JavaxActivationAPI
comment: JavaLibrary implementing the javax.activation package for Java SE 6

JavaxActivity
type: Class
subclass of: JavaAPIPart
comment: Java API part implementing the javax.activity package for Java SE 6

JavaxActivityAPI
type: Class
subclass of: JavaAPI
comment: platform:comprisesInterfacePart some JavaxActivity
comment: JavaLibrary implementing the javax.activity package for Java SE 6

JavaxActivityClassLibrary
type: Class
subclass of: JavaClassLibrary
comment: platform:implementsInterface some JavaxActivityAPI
comment: JavaLibrary implementing the javax.activity package for Java SE 6

JavaxAnnotation
type: Class
subclass of: JavaAPIPart
comment: Java API part implementing the javax.annotation package for Java SE 6

JavaxAnnotationAPI
type: Class
subclass of: JavaAPI
comment: platform:comprisesInterfacePart some JavaxAnnotation
comment: JavaLibrary implementing the javax.annotation package for Java SE 6

JavaxAnnotationClassLibrary
type: Class
subclass of: JavaClassLibrary
comment: platform:implementsInterface some JavaxAnnotationAPI
comment: JavaLibrary implementing the javax.annotation package for Java SE 6

JavaxAnnotationProcessing
type: Class
subclass of: JavaAPIPart
comment: Java API part implementing the javax.annotation.processing package for Java SE 6

JavaxAnnotationProcessingAPI
type: Class
subclass of: JavaAPI
comment: platform:comprisesInterfacePart some JavaxAnnotationProcessing
comment: JavaLibrary implementing the javax.annotation.processing package for Java SE 6

JavaxAnnotationProcessingClassLibrary
type: Class
subclass of: JavaClassLibrary
comment: platform:implementsInterface some JavaxAnnotationProcessingAPI
comment: JavaLibrary implementing the javax.annotation.processing package for Java SE 6

JavaxCrypto
type: Class
subclass of: JavaAPIPart
comment: Java API part implementing the javax.crypto package for Java SE 6

JavaxCryptoAPI
type: Class
subclass of: JavaAPI
comment: platform:comprisesInterfacePart some JavaxCrypto
comment: JavaLibrary implementing the javax.crypto package for Java SE 6

JavaxCryptoClassLibrary
type: Class
subclass of: JavaClassLibrary
comment: platform:implementsInterface some JavaxCryptoAPI
comment: JavaLibrary implementing the javax.crypto package for Java SE 6

JavaxCryptoInterfaces
type: Class
subclass of: JavaAPIPart
comment: Java API part implementing the javax.crypto.interfaces package for Java SE 6

JavaxCryptoInterfacesAPI
type: Class
subclass of: JavaAPI
comment: platform:comprisesInterfacePart some JavaxCryptoInterfaces
comment: JavaLibrary implementing the javax.crypto.interfaces package for Java SE 6

JavaxCryptoInterfacesClassLibrary
type: Class
subclass of: JavaClassLibrary
comment: platform:implementsInterface some JavaxCryptoInterfacesAPI
comment: JavaLibrary implementing the javax.crypto.interfaces package for Java SE 6

JavaxCryptoSpec
type: Class
subclass of: JavaAPIPart
comment: Java API part implementing the javax.crypto.spec package for Java SE 6

JavaxCryptoSpecAPI
type: Class
subclass of: JavaAPI
comment: platform:comprisesInterfacePart some JavaxCryptoSpec
comment: JavaLibrary implementing the javax.crypto.spec package for Java SE 6

JavaxCryptoSpecClassLibrary
type: Class
subclass of: JavaClassLibrary
comment: platform:implementsInterface some JavaxCryptoSpecAPI
comment: JavaLibrary implementing the javax.crypto.spec package for Java SE 6

JavaxImageio
type: Class
subclass of: JavaxImageio
comment: Java API part implementing the javax.imageio package for Java SE 6

JavaxImageioAPI
type: Class
subclass of: JavaxImageioAPI
comment: platform:comprisesInterfacePart some JavaxImageio
comment: JavaLibrary implementing the javax.imageio package for Java SE 6

JavaxImageioClassLibrary
type: Class
subclass of: JavaxImageioClassLibrary
comment: platform:implementsInterface some JavaxImageioAPI
comment: JavaLibrary implementing the javax.imageio package for Java SE 6

JavaxImageioEvent
type: Class
subclass of: JavaAPIPart
comment: Java API part implementing the javax.imageio.event package for Java SE 6

JavaxImageioEventAPI
type: Class
subclass of: JavaAPI
comment: platform:comprisesInterfacePart some JavaxImageioEvent
comment: JavaLibrary implementing the javax.imageio.event package for Java SE 6

JavaxImageioEventClassLibrary
type: Class
subclass of: JavaClassLibrary
comment: platform:implementsInterface some JavaxImageioEventAPI
comment: JavaLibrary implementing the javax.imageio.event package for Java SE 6

JavaxImageioMetadata
type: Class
subclass of: JavaAPIPart
comment: Java API part implementing the javax.imageio.metadata package for Java SE 6

JavaxImageioMetadataAPI
type: Class
subclass of: JavaAPI
comment: platform:comprisesInterfacePart some JavaxImageioMetadata
comment: JavaLibrary implementing the javax.imageio.metadata package for Java SE 6

JavaxImageioMetadataClassLibrary
type: Class
subclass of: JavaClassLibrary
comment: platform:implementsInterface some JavaxImageioMetadataAPI
comment: JavaLibrary implementing the javax.imageio.metadata package for Java SE 6

JavaxImageioPluginsBmp
type: Class
subclass of: JavaAPIPart
comment: Java API part implementing the javax.imageio.plugins.bmp package for Java SE 6

JavaxImageioPluginsBmpAPI
type: Class
subclass of: JavaAPI
comment: platform:comprisesInterfacePart some JavaxImageioPluginsBmp
comment: JavaLibrary implementing the javax.imageio.plugins.bmp package for Java SE 6

JavaxImageioPluginsBmpClassLibrary
type: Class
subclass of: JavaClassLibrary
comment: platform:implementsInterface some JavaxImageioPluginsBmpAPI
comment: JavaLibrary implementing the javax.imageio.plugins.bmp package for Java SE 6

JavaxImageioPluginsJpeg
type: Class
subclass of: JavaAPIPart
comment: Java API part implementing the javax.imageio.plugins.jpeg package for Java SE 6

JavaxImageioPluginsJpegAPI
type: Class
subclass of: JavaAPI
comment: platform:comprisesInterfacePart some JavaxImageioPluginsJpeg
comment: JavaLibrary implementing the javax.imageio.plugins.jpeg package for Java SE 6

JavaxImageioPluginsJpegClassLibrary
type: Class
subclass of: JavaClassLibrary
comment: platform:implementsInterface some JavaxImageioPluginsJpegAPI
comment: JavaLibrary implementing the javax.imageio.plugins.jpeg package for Java SE 6

JavaxImageioSpi
type: Class
subclass of: JavaAPIPart
comment: Java API part implementing the javax.imageio.spi package for Java SE 6

JavaxImageioSpiAPI
type: Class
subclass of: JavaAPI
comment: platform:comprisesInterfacePart some JavaxImageioSpi
comment: JavaLibrary implementing the javax.imageio.spi package for Java SE 6

JavaxImageioSpiClassLibrary
type: Class
subclass of: JavaClassLibrary
comment: platform:implementsInterface some JavaxImageioSpiAPI
comment: JavaLibrary implementing the javax.imageio.spi package for Java SE 6

JavaxImageioStream
type: Class
subclass of: JavaAPIPart
comment: Java API part implementing the javax.imageio.stream package for Java SE 6

JavaxImageioStreamAPI
type: Class
subclass of: JavaAPI
comment: platform:comprisesInterfacePart some JavaxImageioStream
comment: JavaLibrary implementing the javax.imageio.stream package for Java SE 6

JavaxImageioStreamClassLibrary
type: Class
subclass of: JavaClassLibrary
comment: platform:implementsInterface some JavaxImageioStreamAPI
comment: JavaLibrary implementing the javax.imageio.stream package for Java SE 6

JavaxJnlp
type: Class
subclass of: JavaAPIPart
comment: Java API part implementing the javax.jnlp package for Java SE 6

JavaxJnlpAPI
type: Class
subclass of: JavaAPI
comment: platform:comprisesInterfacePart some JavaxJnlp
comment: JavaLibrary implementing the javax.jnlp package for Java SE 6

JavaxJnlpClassLibrary
type: Class
subclass of: JavaClassLibrary
comment: platform:implementsInterface some JavaxJnlpAPI
comment: JavaLibrary implementing the javax.jnlp package for Java SE 6

JavaxJws
type: Class
subclass of: JavaAPIPart
comment: Java API part implementing the javax.jws package for Java SE 6

JavaxJwsAPI
type: Class
subclass of: JavaAPI
comment: platform:comprisesInterfacePart some JavaxJws
comment: JavaLibrary implementing the javax.jws package for Java SE 6

JavaxJwsClassLibrary
type: Class
subclass of: JavaClassLibrary
comment: platform:implementsInterface some JavaxJwsAPI
comment: JavaLibrary implementing the javax.jws package for Java SE 6

JavaxJwsSoap
type: Class
subclass of: JavaAPIPart
comment: Java API part implementing the javax.jws.soap package for Java SE 6

JavaxJwsSoapAPI
type: Class
subclass of: JavaAPI
comment: platform:comprisesInterfacePart some JavaxJwsSoap
comment: JavaLibrary implementing the javax.jws.soap package for Java SE 6

JavaxJwsSoapClassLibrary
type: Class
subclass of: JavaClassLibrary
comment: platform:implementsInterface some JavaxJwsSoapAPI
comment: JavaLibrary implementing the javax.jws.soap package for Java SE 6

JavaxLangModel
type: Class
subclass of: JavaAPIPart
comment: Java API part implementing the javax.lang.model package for Java SE 6

JavaxLangModelAPI
type: Class
subclass of: JavaAPI
comment: platform:comprisesInterfacePart some JavaxLangModel
comment: JavaLibrary implementing the javax.lang.model package for Java SE 6

JavaxLangModelClassLibrary
type: Class
subclass of: JavaClassLibrary
comment: platform:implementsInterface some JavaxLangModelAPI
comment: JavaLibrary implementing the javax.lang.model package for Java SE 6

JavaxLangModelElement
type: Class
subclass of: JavaAPIPart
comment: Java API part implementing the javax.lang.model.element package for Java SE 6

JavaxLangModelElementAPI
type: Class
subclass of: JavaAPI
comment: platform:comprisesInterfacePart some JavaxLangModelElement
comment: JavaLibrary implementing the javax.lang.model.element package for Java SE 6

JavaxLangModelElementClassLibrary
type: Class
subclass of: JavaClassLibrary
comment: platform:implementsInterface some JavaxLangModelElementAPI
comment: JavaLibrary implementing the javax.lang.model.element package for Java SE 6

JavaxLangModelType
type: Class
subclass of: JavaAPIPart
comment: Java API part implementing the javax.lang.model.type package for Java SE 6

JavaxLangModelTypeAPI
type: Class
subclass of: JavaAPI
comment: platform:comprisesInterfacePart some JavaxLangModelType
comment: JavaLibrary implementing the javax.lang.model.type package for Java SE 6

JavaxLangModelTypeClassLibrary
type: Class
subclass of: JavaClassLibrary
comment: platform:implementsInterface some JavaxLangModelTypeAPI
comment: JavaLibrary implementing the javax.lang.model.type package for Java SE 6

JavaxLangModelUtil
type: Class
subclass of: JavaAPIPart
comment: Java API part implementing the javax.lang.model.util package for Java SE 6

JavaxLangModelUtilAPI
type: Class
subclass of: JavaAPI
comment: platform:comprisesInterfacePart some JavaxLangModelUtil
comment: JavaLibrary implementing the javax.lang.model.util package for Java SE 6

JavaxLangModelUtilClassLibrary
type: Class
subclass of: JavaClassLibrary
comment: platform:implementsInterface some JavaxLangModelUtilAPI
comment: JavaLibrary implementing the javax.lang.model.util package for Java SE 6

JavaxManagement
type: Class
subclass of: JavaxManagement
comment: Java API part implementing the javax.management package for Java SE 6

JavaxManagementAPI
type: Class
subclass of: JavaxManagementAPI
comment: platform:comprisesInterfacePart some JavaxManagement
comment: JavaLibrary implementing the javax.management package for Java SE 6

JavaxManagementClassLibrary
type: Class
subclass of: JavaxManagementClassLibrary
comment: platform:implementsInterface some JavaxManagementAPI
comment: JavaLibrary implementing the javax.management package for Java SE 6

JavaxManagementLoading
type: Class
subclass of: JavaxManagementLoading
comment: Java API part implementing the javax.management.loading package for Java SE 6

JavaxManagementLoadingAPI
type: Class
subclass of: JavaxManagementLoadingAPI
comment: platform:comprisesInterfacePart some JavaxManagementLoading
comment: JavaLibrary implementing the javax.management.loading package for Java SE 6

JavaxManagementLoadingClassLibrary
type: Class
subclass of: JavaxManagementLoadingClassLibrary
comment: platform:implementsInterface some JavaxManagementLoadingAPI
comment: JavaLibrary implementing the javax.management.loading package for Java SE 6

JavaxManagementModelmbean
type: Class
subclass of: JavaxManagementModelmbean
comment: Java API part implementing the javax.management.modelmbean package for Java SE 6

JavaxManagementModelmbeanAPI
type: Class
subclass of: JavaxManagementModelmbeanAPI
comment: platform:comprisesInterfacePart some JavaxManagementModelmbean
comment: JavaLibrary implementing the javax.management.modelmbean package for Java SE 6

JavaxManagementModelmbeanClassLibrary
type: Class
subclass of: JavaxManagementModelmbeanClassLibrary
comment: platform:implementsInterface some JavaxManagementModelmbeanAPI
comment: JavaLibrary implementing the javax.management.modelmbean package for Java SE 6

JavaxManagementMonitor
type: Class
subclass of: JavaxManagementMonitor
comment: Java API part implementing the javax.management.monitor package for Java SE 6

JavaxManagementMonitorAPI
type: Class
subclass of: JavaxManagementMonitorAPI
comment: platform:comprisesInterfacePart some JavaxManagementMonitor
comment: JavaLibrary implementing the javax.management.monitor package for Java SE 6

JavaxManagementMonitorClassLibrary
type: Class
subclass of: JavaxManagementMonitorClassLibrary
comment: platform:implementsInterface some JavaxManagementMonitorAPI
comment: JavaLibrary implementing the javax.management.monitor package for Java SE 6

JavaxManagementOpenmbean
type: Class
subclass of: JavaxManagementOpenmbean
comment: Java API part implementing the javax.management.openmbean package for Java SE 6

JavaxManagementOpenmbeanAPI
type: Class
subclass of: JavaxManagementOpenmbeanAPI
comment: platform:comprisesInterfacePart some JavaxManagementOpenmbean
comment: JavaLibrary implementing the javax.management.openmbean package for Java SE 6

JavaxManagementOpenmbeanClassLibrary
type: Class
subclass of: JavaxManagementOpenmbeanClassLibrary
comment: platform:implementsInterface some JavaxManagementOpenmbeanAPI
comment: JavaLibrary implementing the javax.management.openmbean package for Java SE 6

JavaxManagementRelation
type: Class
subclass of: JavaxManagementRelation
comment: Java API part implementing the javax.management.relation package for Java SE 6

JavaxManagementRelationAPI
type: Class
subclass of: JavaxManagementRelationAPI
comment: platform:comprisesInterfacePart some JavaxManagementRelation
comment: JavaLibrary implementing the javax.management.relation package for Java SE 6

JavaxManagementRelationClassLibrary
type: Class
subclass of: JavaxManagementRelationClassLibrary
comment: platform:implementsInterface some JavaxManagementRelationAPI
comment: JavaLibrary implementing the javax.management.relation package for Java SE 6

JavaxManagementRemote
type: Class
subclass of: JavaxManagementRemote
comment: Java API part implementing the javax.management.remote package for Java SE 6

JavaxManagementRemoteAPI
type: Class
subclass of: JavaxManagementRemoteAPI
comment: platform:comprisesInterfacePart some JavaxManagementRemote
comment: JavaLibrary implementing the javax.management.remote package for Java SE 6

JavaxManagementRemoteClassLibrary
type: Class
subclass of: JavaxManagementRemoteClassLibrary
comment: platform:implementsInterface some JavaxManagementRemoteAPI
comment: JavaLibrary implementing the javax.management.remote package for Java SE 6

JavaxManagementRemoteRmi
type: Class
subclass of: JavaxManagementRemoteRmi
comment: Java API part implementing the javax.management.remote.rmi package for Java SE 6

JavaxManagementRemoteRmiAPI
type: Class
subclass of: JavaxManagementRemoteRmiAPI
comment: platform:comprisesInterfacePart some JavaxManagementRemoteRmi
comment: JavaLibrary implementing the javax.management.remote.rmi package for Java SE 6

JavaxManagementRemoteRmiClassLibrary
type: Class
subclass of: JavaxManagementRemoteRmiClassLibrary
comment: platform:implementsInterface some JavaxManagementRemoteRmiAPI
comment: JavaLibrary implementing the javax.management.remote.rmi package for Java SE 6

JavaxManagementTimer
type: Class
subclass of: JavaAPIPart
comment: Java API part implementing the javax.management.timer package for Java SE 6

JavaxManagementTimerAPI
type: Class
subclass of: JavaAPI
comment: platform:comprisesInterfacePart some JavaxManagementTimer
comment: JavaLibrary implementing the javax.management.timer package for Java SE 6

JavaxManagementTimerClassLibrary
type: Class
subclass of: JavaClassLibrary
comment: platform:implementsInterface some JavaxManagementTimerAPI
comment: JavaLibrary implementing the javax.management.timer package for Java SE 6

JavaxNaming
type: Class
subclass of: JavaxNaming
comment: Java API part implementing the javax.naming package for Java SE 6

JavaxNamingAPI
type: Class
subclass of: JavaxNamingAPI
comment: platform:comprisesInterfacePart some JavaxNaming
comment: JavaLibrary implementing the javax.naming package for Java SE 6

JavaxNamingClassLibrary
type: Class
subclass of: JavaxNamingClassLibrary
comment: platform:implementsInterface some JavaxNamingAPI
comment: JavaLibrary implementing the javax.naming package for Java SE 6

JavaxNamingDirectory
type: Class
subclass of: JavaxNamingDirectory
comment: Java API part implementing the javax.naming.directory package for Java SE 6

JavaxNamingDirectoryAPI
type: Class
subclass of: JavaxNamingDirectoryAPI
comment: platform:comprisesInterfacePart some JavaxNamingDirectory
comment: JavaLibrary implementing the javax.naming.directory package for Java SE 6

JavaxNamingDirectoryClassLibrary
type: Class
subclass of: JavaxNamingDirectoryClassLibrary
comment: platform:implementsInterface some JavaxNamingDirectoryAPI
comment: JavaLibrary implementing the javax.naming.directory package for Java SE 6

JavaxNamingEvent
type: Class
subclass of: JavaAPIPart
comment: Java API part implementing the javax.naming.event package for Java SE 6

JavaxNamingEventAPI
type: Class
subclass of: JavaAPI
comment: platform:comprisesInterfacePart some JavaxNamingEvent
comment: JavaLibrary implementing the javax.naming.event package for Java SE 6

JavaxNamingEventClassLibrary
type: Class
subclass of: JavaClassLibrary
comment: platform:implementsInterface some JavaxNamingEventAPI
comment: JavaLibrary implementing the javax.naming.event package for Java SE 6

JavaxNamingLdap
type: Class
subclass of: JavaxNamingLdap
comment: Java API part implementing the javax.naming.ldap package for Java SE 6

JavaxNamingLdapAPI
type: Class
subclass of: JavaxNamingLdapAPI
comment: platform:comprisesInterfacePart some JavaxNamingLdap
comment: JavaLibrary implementing the javax.naming.ldap package for Java SE 6

JavaxNamingLdapClassLibrary
type: Class
subclass of: JavaxNamingLdapClassLibrary
comment: platform:implementsInterface some JavaxNamingLdapAPI
comment: JavaLibrary implementing the javax.naming.ldap package for Java SE 6

JavaxNamingSpi
type: Class
subclass of: JavaAPIPart
comment: Java API part implementing the javax.naming.spi package for Java SE 6

JavaxNamingSpiAPI
type: Class
subclass of: JavaAPI
comment: platform:comprisesInterfacePart some JavaxNamingSpi
comment: JavaLibrary implementing the javax.naming.spi package for Java SE 6

JavaxNamingSpiClassLibrary
type: Class
subclass of: JavaClassLibrary
comment: platform:implementsInterface some JavaxNamingSpiAPI
comment: JavaLibrary implementing the javax.naming.spi package for Java SE 6

JavaxNet
type: Class
subclass of: JavaAPIPart
comment: Java API part implementing the javax.net package for Java SE 6

JavaxNetAPI
type: Class
subclass of: JavaAPI
comment: platform:comprisesInterfacePart some JavaxNet
comment: JavaLibrary implementing the javax.net package for Java SE 6

JavaxNetClassLibrary
type: Class
subclass of: JavaClassLibrary
comment: platform:implementsInterface some JavaxNetAPI
comment: JavaLibrary implementing the javax.net package for Java SE 6

JavaxNetSsl
type: Class
subclass of: JavaxNetSsl
comment: Java API part implementing the javax.net.ssl package for Java SE 6

JavaxNetSslAPI
type: Class
subclass of: JavaxNetSslAPI
comment: platform:comprisesInterfacePart some JavaxNetSsl
comment: JavaLibrary implementing the javax.net.ssl package for Java SE 6

JavaxNetSslClassLibrary
type: Class
subclass of: JavaxNetSslClassLibrary
comment: platform:implementsInterface some JavaxNetSslAPI
comment: JavaLibrary implementing the javax.net.ssl package for Java SE 6

JavaxPrint
type: Class
subclass of: JavaAPIPart
comment: Java API part implementing the javax.print package for Java SE 6

JavaxPrintAPI
type: Class
subclass of: JavaAPI
comment: platform:comprisesInterfacePart some JavaxPrint
comment: JavaLibrary implementing the javax.print package for Java SE 6

JavaxPrintAttribute
type: Class
subclass of: JavaAPIPart
comment: Java API part implementing the javax.print.attribute package for Java SE 6

JavaxPrintAttributeAPI
type: Class
subclass of: JavaAPI
comment: platform:comprisesInterfacePart some JavaxPrintAttribute
comment: JavaLibrary implementing the javax.print.attribute package for Java SE 6

JavaxPrintAttributeClassLibrary
type: Class
subclass of: JavaClassLibrary
comment: platform:implementsInterface some JavaxPrintAttributeAPI
comment: JavaLibrary implementing the javax.print.attribute package for Java SE 6

JavaxPrintAttributeStandard
type: Class
subclass of: JavaAPIPart
comment: Java API part implementing the javax.print.attribute.standard package for Java SE 6

JavaxPrintAttributeStandardAPI
type: Class
subclass of: JavaAPI
comment: platform:comprisesInterfacePart some JavaxPrintAttributeStandard
comment: JavaLibrary implementing the javax.print.attribute.standard package for Java SE 6

JavaxPrintAttributeStandardClassLibrary
type: Class
subclass of: JavaClassLibrary
comment: platform:implementsInterface some JavaxPrintAttributeStandardAPI
comment: JavaLibrary implementing the javax.print.attribute.standard package for Java SE 6

JavaxPrintClassLibrary
type: Class
subclass of: JavaClassLibrary
comment: platform:implementsInterface some JavaxPrintAPI
comment: JavaLibrary implementing the javax.print package for Java SE 6

JavaxPrintEvent
type: Class
subclass of: JavaAPIPart
comment: Java API part implementing the javax.print.event package for Java SE 6

JavaxPrintEventAPI
type: Class
subclass of: JavaAPI
comment: platform:comprisesInterfacePart some JavaxPrintEvent
comment: JavaLibrary implementing the javax.print.event package for Java SE 6

JavaxPrintEventClassLibrary
type: Class
subclass of: JavaClassLibrary
comment: platform:implementsInterface some JavaxPrintEventAPI
comment: JavaLibrary implementing the javax.print.event package for Java SE 6

JavaxRmi
type: Class
subclass of: JavaAPIPart
comment: Java API part implementing the javax.rmi package for Java SE 6

JavaxRmiAPI
type: Class
subclass of: JavaAPI
comment: platform:comprisesInterfacePart some JavaxRmi
comment: JavaLibrary implementing the javax.rmi package for Java SE 6

JavaxRmiCORBA
type: Class
subclass of: JavaAPIPart
comment: Java API part implementing the javax.rmi.CORBA package for Java SE 6

JavaxRmiCORBAAPI
type: Class
subclass of: JavaAPI
comment: platform:comprisesInterfacePart some JavaxRmiCORBA
comment: JavaLibrary implementing the javax.rmi.CORBA package for Java SE 6

JavaxRmiCORBAClassLibrary
type: Class
subclass of: JavaClassLibrary
comment: platform:implementsInterface some JavaxRmiCORBAAPI
comment: JavaLibrary implementing the javax.rmi.CORBA package for Java SE 6

JavaxRmiClassLibrary
type: Class
subclass of: JavaClassLibrary
comment: platform:implementsInterface some JavaxRmiAPI
comment: JavaLibrary implementing the javax.rmi package for Java SE 6

JavaxRmiSsl
type: Class
subclass of: JavaAPIPart
comment: Java API part implementing the javax.rmi.ssl package for Java SE 6

JavaxRmiSslAPI
type: Class
subclass of: JavaAPI
comment: platform:comprisesInterfacePart some JavaxRmiSsl
comment: JavaLibrary implementing the javax.rmi.ssl package for Java SE 6

JavaxRmiSslClassLibrary
type: Class
subclass of: JavaClassLibrary
comment: platform:implementsInterface some JavaxRmiSslAPI
comment: JavaLibrary implementing the javax.rmi.ssl package for Java SE 6

JavaxScript
type: Class
subclass of: JavaAPIPart
comment: Java API part implementing the javax.script package for Java SE 6

JavaxScriptAPI
type: Class
subclass of: JavaAPI
comment: platform:comprisesInterfacePart some JavaxScript
comment: JavaLibrary implementing the javax.script package for Java SE 6

JavaxScriptClassLibrary
type: Class
subclass of: JavaClassLibrary
comment: platform:implementsInterface some JavaxScriptAPI
comment: JavaLibrary implementing the javax.script package for Java SE 6

JavaxSecurityAuth
type: Class
subclass of: JavaAPIPart
comment: Java API part implementing the javax.security.auth package for Java SE 6

JavaxSecurityAuthAPI
type: Class
subclass of: JavaAPI
comment: platform:comprisesInterfacePart some JavaxSecurityAuth
comment: JavaLibrary implementing the javax.security.auth package for Java SE 6

JavaxSecurityAuthCallback
type: Class
subclass of: JavaAPIPart
comment: Java API part implementing the javax.security.auth.callback package for Java SE 6

JavaxSecurityAuthCallbackAPI
type: Class
subclass of: JavaAPI
comment: platform:comprisesInterfacePart some JavaxSecurityAuthCallback
comment: JavaLibrary implementing the javax.security.auth.callback package for Java SE 6

JavaxSecurityAuthCallbackClassLibrary
type: Class
subclass of: JavaClassLibrary
comment: platform:implementsInterface some JavaxSecurityAuthCallbackAPI
comment: JavaLibrary implementing the javax.security.auth.callback package for Java SE 6

JavaxSecurityAuthClassLibrary
type: Class
subclass of: JavaClassLibrary
comment: platform:implementsInterface some JavaxSecurityAuthAPI
comment: JavaLibrary implementing the javax.security.auth package for Java SE 6

JavaxSecurityAuthKerberos
type: Class
subclass of: JavaAPIPart
comment: Java API part implementing the javax.security.auth.kerberos package for Java SE 6

JavaxSecurityAuthKerberosAPI
type: Class
subclass of: JavaAPI
comment: platform:comprisesInterfacePart some JavaxSecurityAuthKerberos
comment: JavaLibrary implementing the javax.security.auth.kerberos package for Java SE 6

JavaxSecurityAuthKerberosClassLibrary
type: Class
subclass of: JavaClassLibrary
comment: platform:implementsInterface some JavaxSecurityAuthKerberosAPI
comment: JavaLibrary implementing the javax.security.auth.kerberos package for Java SE 6

JavaxSecurityAuthLogin
type: Class
subclass of: JavaxSecurityAuthLogin
comment: Java API part implementing the javax.security.auth.login package for Java SE 6

JavaxSecurityAuthLoginAPI
type: Class
subclass of: JavaxSecurityAuthLoginAPI
comment: platform:comprisesInterfacePart some JavaxSecurityAuthLogin
comment: JavaLibrary implementing the javax.security.auth.login package for Java SE 6

JavaxSecurityAuthLoginClassLibrary
type: Class
subclass of: JavaxSecurityAuthLoginClassLibrary
comment: platform:implementsInterface some JavaxSecurityAuthLoginAPI
comment: JavaLibrary implementing the javax.security.auth.login package for Java SE 6

JavaxSecurityAuthSpi
type: Class
subclass of: JavaAPIPart
comment: Java API part implementing the javax.security.auth.spi package for Java SE 6

JavaxSecurityAuthSpiAPI
type: Class
subclass of: JavaAPI
comment: platform:comprisesInterfacePart some JavaxSecurityAuthSpi
comment: JavaLibrary implementing the javax.security.auth.spi package for Java SE 6

JavaxSecurityAuthSpiClassLibrary
type: Class
subclass of: JavaClassLibrary
comment: platform:implementsInterface some JavaxSecurityAuthSpiAPI
comment: JavaLibrary implementing the javax.security.auth.spi package for Java SE 6

JavaxSecurityAuthX500
type: Class
subclass of: JavaxSecurityAuthX500
comment: Java API part implementing the javax.security.auth.x500 package for Java SE 6

JavaxSecurityAuthX500API
type: Class
subclass of: JavaxSecurityAuthX500API
comment: platform:comprisesInterfacePart some JavaxSecurityAuthX500
comment: JavaLibrary implementing the javax.security.auth.x500 package for Java SE 6

JavaxSecurityAuthX500ClassLibrary
type: Class
subclass of: JavaxSecurityAuthX500ClassLibrary
comment: platform:implementsInterface some JavaxSecurityAuthX500API
comment: JavaLibrary implementing the javax.security.auth.x500 package for Java SE 6

JavaxSecurityCert
type: Class
subclass of: JavaAPIPart
comment: Java API part implementing the javax.security.cert package for Java SE 6

JavaxSecurityCertAPI
type: Class
subclass of: JavaAPI
comment: platform:comprisesInterfacePart some JavaxSecurityCert
comment: JavaLibrary implementing the javax.security.cert package for Java SE 6

JavaxSecurityCertClassLibrary
type: Class
subclass of: JavaClassLibrary
comment: platform:implementsInterface some JavaxSecurityCertAPI
comment: JavaLibrary implementing the javax.security.cert package for Java SE 6

JavaxSecuritySasl
type: Class
subclass of: JavaxSecuritySasl
comment: Java API part implementing the javax.security.sasl package for Java SE 6

JavaxSecuritySaslAPI
type: Class
subclass of: JavaxSecuritySaslAPI
comment: platform:comprisesInterfacePart some JavaxSecuritySasl
comment: JavaLibrary implementing the javax.security.sasl package for Java SE 6

JavaxSecuritySaslClassLibrary
type: Class
subclass of: JavaxSecuritySaslClassLibrary
comment: platform:implementsInterface some JavaxSecuritySaslAPI
comment: JavaLibrary implementing the javax.security.sasl package for Java SE 6

JavaxSmartcardio
type: Class
subclass of: JavaAPIPart
comment: Java API part implementing the javax.smartcardio package for Java SE 6

JavaxSmartcardioAPI
type: Class
subclass of: JavaAPI
comment: platform:comprisesInterfacePart some JavaxSmartcardio
comment: JavaLibrary implementing the javax.smartcardio package for Java SE 6

JavaxSmartcardioClassLibrary
type: Class
subclass of: JavaClassLibrary
comment: platform:implementsInterface some JavaxSmartcardioAPI
comment: JavaLibrary implementing the javax.smartcardio package for Java SE 6

JavaxSoundMidi
type: Class
subclass of: JavaAPIPart
comment: Java API part implementing the javax.sound.midi package for Java SE 6

JavaxSoundMidiAPI
type: Class
subclass of: JavaAPI
comment: platform:comprisesInterfacePart some JavaxSoundMidi
comment: JavaLibrary implementing the javax.sound.midi package for Java SE 6

JavaxSoundMidiClassLibrary
type: Class
subclass of: JavaClassLibrary
comment: platform:implementsInterface some JavaxSoundMidiAPI
comment: JavaLibrary implementing the javax.sound.midi package for Java SE 6

JavaxSoundMidiSpi
type: Class
subclass of: JavaAPIPart
comment: Java API part implementing the javax.sound.midi.spi package for Java SE 6

JavaxSoundMidiSpiAPI
type: Class
subclass of: JavaAPI
comment: platform:comprisesInterfacePart some JavaxSoundMidiSpi
comment: JavaLibrary implementing the javax.sound.midi.spi package for Java SE 6

JavaxSoundMidiSpiClassLibrary
type: Class
subclass of: JavaClassLibrary
comment: platform:implementsInterface some JavaxSoundMidiSpiAPI
comment: JavaLibrary implementing the javax.sound.midi.spi package for Java SE 6

JavaxSoundSampled
type: Class
subclass of: JavaAPIPart
comment: Java API part implementing the javax.sound.sampled package for Java SE 6

JavaxSoundSampledAPI
type: Class
subclass of: JavaAPI
comment: platform:comprisesInterfacePart some JavaxSoundSampled
comment: JavaLibrary implementing the javax.sound.sampled package for Java SE 6

JavaxSoundSampledClassLibrary
type: Class
subclass of: JavaClassLibrary
comment: platform:implementsInterface some JavaxSoundSampledAPI
comment: JavaLibrary implementing the javax.sound.sampled package for Java SE 6

JavaxSoundSampledSpi
type: Class
subclass of: JavaAPIPart
comment: Java API part implementing the javax.sound.sampled.spi package for Java SE 6

JavaxSoundSampledSpiAPI
type: Class
subclass of: JavaAPI
comment: platform:comprisesInterfacePart some JavaxSoundSampledSpi
comment: JavaLibrary implementing the javax.sound.sampled.spi package for Java SE 6

JavaxSoundSampledSpiClassLibrary
type: Class
subclass of: JavaClassLibrary
comment: platform:implementsInterface some JavaxSoundSampledSpiAPI
comment: JavaLibrary implementing the javax.sound.sampled.spi package for Java SE 6

JavaxSql
type: Class
subclass of: JavaxSql
comment: Java API part implementing the javax.sql package for Java SE 6

JavaxSqlAPI
type: Class
subclass of: JavaxSqlAPI
comment: platform:comprisesInterfacePart some JavaxSql
comment: JavaLibrary implementing the javax.sql package for Java SE 6

JavaxSqlClassLibrary
type: Class
subclass of: JavaxSqlClassLibrary
comment: platform:implementsInterface some JavaxSqlAPI
comment: JavaLibrary implementing the javax.sql package for Java SE 6

JavaxSqlRowset
type: Class
subclass of: JavaxSqlRowset
comment: Java API part implementing the javax.sql.rowset package for Java SE 6

JavaxSqlRowsetAPI
type: Class
subclass of: JavaxSqlRowsetAPI
comment: platform:comprisesInterfacePart some JavaxSqlRowset
comment: JavaLibrary implementing the javax.sql.rowset package for Java SE 6

JavaxSqlRowsetClassLibrary
type: Class
subclass of: JavaxSqlRowsetClassLibrary
comment: platform:implementsInterface some JavaxSqlRowsetAPI
comment: JavaLibrary implementing the javax.sql.rowset package for Java SE 6

JavaxSqlRowsetSerial
type: Class
subclass of: JavaxSqlRowsetSerial
comment: Java API part implementing the javax.sql.rowset.serial package for Java SE 6

JavaxSqlRowsetSerialAPI
type: Class
subclass of: JavaxSqlRowsetSerialAPI
comment: platform:comprisesInterfacePart some JavaxSqlRowsetSerial
comment: JavaLibrary implementing the javax.sql.rowset.serial package for Java SE 6

JavaxSqlRowsetSerialClassLibrary
type: Class
subclass of: JavaxSqlRowsetSerialClassLibrary
comment: platform:implementsInterface some JavaxSqlRowsetSerialAPI
comment: JavaLibrary implementing the javax.sql.rowset.serial package for Java SE 6

JavaxSqlRowsetSpi
type: Class
subclass of: JavaxSqlRowsetSpi
comment: Java API part implementing the javax.sql.rowset.spi package for Java SE 6

JavaxSqlRowsetSpiAPI
type: Class
subclass of: JavaxSqlRowsetSpiAPI
comment: platform:comprisesInterfacePart some JavaxSqlRowsetSpi
comment: JavaLibrary implementing the javax.sql.rowset.spi package for Java SE 6

JavaxSqlRowsetSpiClassLibrary
type: Class
subclass of: JavaxSqlRowsetSpiClassLibrary
comment: platform:implementsInterface some JavaxSqlRowsetSpiAPI
comment: JavaLibrary implementing the javax.sql.rowset.spi package for Java SE 6

JavaxSwing
type: Class
subclass of: JavaxSwing
comment: Java API part implementing the javax.swing package for Java SE 6

JavaxSwingAPI
type: Class
subclass of: JavaxSwingAPI
comment: platform:comprisesInterfacePart some JavaxSwing
comment: JavaLibrary implementing the javax.swing package for Java SE 6

JavaxSwingBorder
type: Class
subclass of: JavaxSwingBorder
comment: Java API part implementing the javax.swing.border package for Java SE 6

JavaxSwingBorderAPI
type: Class
subclass of: JavaxSwingBorderAPI
comment: platform:comprisesInterfacePart some JavaxSwingBorder
comment: JavaLibrary implementing the javax.swing.border package for Java SE 6

JavaxSwingBorderClassLibrary
type: Class
subclass of: JavaxSwingBorderClassLibrary
comment: platform:implementsInterface some JavaxSwingBorderAPI
comment: JavaLibrary implementing the javax.swing.border package for Java SE 6

JavaxSwingClassLibrary
type: Class
subclass of: JavaxSwingClassLibrary
comment: platform:implementsInterface some JavaxSwingAPI
comment: JavaLibrary implementing the javax.swing package for Java SE 6

JavaxSwingColorchooser
type: Class
subclass of: JavaxSwingColorchooser
comment: Java API part implementing the javax.swing.colorchooser package for Java SE 6

JavaxSwingColorchooserAPI
type: Class
subclass of: JavaxSwingColorchooserAPI
comment: platform:comprisesInterfacePart some JavaxSwingColorchooser
comment: JavaLibrary implementing the javax.swing.colorchooser package for Java SE 6

JavaxSwingColorchooserClassLibrary
type: Class
subclass of: JavaxSwingColorchooserClassLibrary
comment: platform:implementsInterface some JavaxSwingColorchooserAPI
comment: JavaLibrary implementing the javax.swing.colorchooser package for Java SE 6

JavaxSwingEvent
type: Class
subclass of: JavaxSwingEvent
comment: Java API part implementing the javax.swing.event package for Java SE 6

JavaxSwingEventAPI
type: Class
subclass of: JavaxSwingEventAPI
comment: platform:comprisesInterfacePart some JavaxSwingEvent
comment: JavaLibrary implementing the javax.swing.event package for Java SE 6

JavaxSwingEventClassLibrary
type: Class
subclass of: JavaxSwingEventClassLibrary
comment: platform:implementsInterface some JavaxSwingEventAPI
comment: JavaLibrary implementing the javax.swing.event package for Java SE 6

JavaxSwingFilechooser
type: Class
subclass of: JavaxSwingFilechooser
comment: Java API part implementing the javax.swing.filechooser package for Java SE 6

JavaxSwingFilechooserAPI
type: Class
subclass of: JavaxSwingFilechooserAPI
comment: platform:comprisesInterfacePart some JavaxSwingFilechooser
comment: JavaLibrary implementing the javax.swing.filechooser package for Java SE 6

JavaxSwingFilechooserClassLibrary
type: Class
subclass of: JavaxSwingFilechooserClassLibrary
comment: platform:implementsInterface some JavaxSwingFilechooserAPI
comment: JavaLibrary implementing the javax.swing.filechooser package for Java SE 6

JavaxSwingPlaf
type: Class
subclass of: JavaxSwingPlaf
comment: Java API part implementing the javax.swing.plaf package for Java SE 6

JavaxSwingPlafAPI
type: Class
subclass of: JavaxSwingPlafAPI
comment: platform:comprisesInterfacePart some JavaxSwingPlaf
comment: JavaLibrary implementing the javax.swing.plaf package for Java SE 6

JavaxSwingPlafBasic
type: Class
subclass of: JavaxSwingPlafBasic
comment: Java API part implementing the javax.swing.plaf.basic package for Java SE 6

JavaxSwingPlafBasicAPI
type: Class
subclass of: JavaxSwingPlafBasicAPI
comment: platform:comprisesInterfacePart some JavaxSwingPlafBasic
comment: JavaLibrary implementing the javax.swing.plaf.basic package for Java SE 6

JavaxSwingPlafBasicClassLibrary
type: Class
subclass of: JavaxSwingPlafBasicClassLibrary
comment: platform:implementsInterface some JavaxSwingPlafBasicAPI
comment: JavaLibrary implementing the javax.swing.plaf.basic package for Java SE 6

JavaxSwingPlafClassLibrary
type: Class
subclass of: JavaxSwingPlafClassLibrary
comment: platform:implementsInterface some JavaxSwingPlafAPI
comment: JavaLibrary implementing the javax.swing.plaf package for Java SE 6

JavaxSwingPlafMetal
type: Class
subclass of: JavaxSwingPlafMetal
comment: Java API part implementing the javax.swing.plaf.metal package for Java SE 6

JavaxSwingPlafMetalAPI
type: Class
subclass of: JavaxSwingPlafMetalAPI
comment: platform:comprisesInterfacePart some JavaxSwingPlafMetal
comment: JavaLibrary implementing the javax.swing.plaf.metal package for Java SE 6

JavaxSwingPlafMetalClassLibrary
type: Class
subclass of: JavaxSwingPlafMetalClassLibrary
comment: platform:implementsInterface some JavaxSwingPlafMetalAPI
comment: JavaLibrary implementing the javax.swing.plaf.metal package for Java SE 6

JavaxSwingPlafMulti
type: Class
subclass of: JavaxSwingPlafMulti
comment: Java API part implementing the javax.swing.plaf.multi package for Java SE 6

JavaxSwingPlafMultiAPI
type: Class
subclass of: JavaxSwingPlafMultiAPI
comment: platform:comprisesInterfacePart some JavaxSwingPlafMulti
comment: JavaLibrary implementing the javax.swing.plaf.multi package for Java SE 6

JavaxSwingPlafMultiClassLibrary
type: Class
subclass of: JavaxSwingPlafMultiClassLibrary
comment: platform:implementsInterface some JavaxSwingPlafMultiAPI
comment: JavaLibrary implementing the javax.swing.plaf.multi package for Java SE 6

JavaxSwingPlafSynth
type: Class
subclass of: JavaxSwingPlafSynth
comment: Java API part implementing the javax.swing.plaf.synth package for Java SE 6

JavaxSwingPlafSynthAPI
type: Class
subclass of: JavaxSwingPlafSynthAPI
comment: platform:comprisesInterfacePart some JavaxSwingPlafSynth
comment: JavaLibrary implementing the javax.swing.plaf.synth package for Java SE 6

JavaxSwingPlafSynthClassLibrary
type: Class
subclass of: JavaxSwingPlafSynthClassLibrary
comment: platform:implementsInterface some JavaxSwingPlafSynthAPI
comment: JavaLibrary implementing the javax.swing.plaf.synth package for Java SE 6

JavaxSwingTable
type: Class
subclass of: JavaxSwingTable
comment: Java API part implementing the javax.swing.table package for Java SE 6

JavaxSwingTableAPI
type: Class
subclass of: JavaxSwingTableAPI
comment: platform:comprisesInterfacePart some JavaxSwingTable
comment: JavaLibrary implementing the javax.swing.table package for Java SE 6

JavaxSwingTableClassLibrary
type: Class
subclass of: JavaxSwingTableClassLibrary
comment: platform:implementsInterface some JavaxSwingTableAPI
comment: JavaLibrary implementing the javax.swing.table package for Java SE 6

JavaxSwingText
type: Class
subclass of: JavaxSwingText
comment: Java API part implementing the javax.swing.text package for Java SE 6

JavaxSwingTextAPI
type: Class
subclass of: JavaxSwingTextAPI
comment: platform:comprisesInterfacePart some JavaxSwingText
comment: JavaLibrary implementing the javax.swing.text package for Java SE 6

JavaxSwingTextClassLibrary
type: Class
subclass of: JavaxSwingTextClassLibrary
comment: platform:implementsInterface some JavaxSwingTextAPI
comment: JavaLibrary implementing the javax.swing.text package for Java SE 6

JavaxSwingTextHtml
type: Class
subclass of: JavaxSwingTextHtml
comment: Java API part implementing the javax.swing.text.html package for Java SE 6

JavaxSwingTextHtmlAPI
type: Class
subclass of: JavaxSwingTextHtmlAPI
comment: platform:comprisesInterfacePart some JavaxSwingTextHtml
comment: JavaLibrary implementing the javax.swing.text.html package for Java SE 6

JavaxSwingTextHtmlClassLibrary
type: Class
subclass of: JavaxSwingTextHtmlClassLibrary
comment: platform:implementsInterface some JavaxSwingTextHtmlAPI
comment: JavaLibrary implementing the javax.swing.text.html package for Java SE 6

JavaxSwingTextHtmlParser
type: Class
subclass of: JavaAPIPart
comment: Java API part implementing the javax.swing.text.html.parser package for Java SE 6

JavaxSwingTextHtmlParserAPI
type: Class
subclass of: JavaAPI
comment: platform:comprisesInterfacePart some JavaxSwingTextHtmlParser
comment: JavaLibrary implementing the javax.swing.text.html.parser package for Java SE 6

JavaxSwingTextHtmlParserClassLibrary
type: Class
subclass of: JavaClassLibrary
comment: platform:implementsInterface some JavaxSwingTextHtmlParserAPI
comment: JavaLibrary implementing the javax.swing.text.html.parser package for Java SE 6

JavaxSwingTextRtf
type: Class
subclass of: JavaxSwingTextRtf
comment: Java API part implementing the javax.swing.text.rtf package for Java SE 6

JavaxSwingTextRtfAPI
type: Class
subclass of: JavaxSwingTextRtfAPI
comment: platform:comprisesInterfacePart some JavaxSwingTextRtf
comment: JavaLibrary implementing the javax.swing.text.rtf package for Java SE 6

JavaxSwingTextRtfClassLibrary
type: Class
subclass of: JavaxSwingTextRtfClassLibrary
comment: platform:implementsInterface some JavaxSwingTextRtfAPI
comment: JavaLibrary implementing the javax.swing.text.rtf package for Java SE 6

JavaxSwingTree
type: Class
subclass of: JavaxSwingTree
comment: Java API part implementing the javax.swing.tree package for Java SE 6

JavaxSwingTreeAPI
type: Class
subclass of: JavaxSwingTreeAPI
comment: platform:comprisesInterfacePart some JavaxSwingTree
comment: JavaLibrary implementing the javax.swing.tree package for Java SE 6

JavaxSwingTreeClassLibrary
type: Class
subclass of: JavaxSwingTreeClassLibrary
comment: platform:implementsInterface some JavaxSwingTreeAPI
comment: JavaLibrary implementing the javax.swing.tree package for Java SE 6

JavaxSwingUndo
type: Class
subclass of: JavaAPIPart
comment: Java API part implementing the javax.swing.undo package for Java SE 6

JavaxSwingUndoAPI
type: Class
subclass of: JavaAPI
comment: platform:comprisesInterfacePart some JavaxSwingUndo
comment: JavaLibrary implementing the javax.swing.undo package for Java SE 6

JavaxSwingUndoClassLibrary
type: Class
subclass of: JavaClassLibrary
comment: platform:implementsInterface some JavaxSwingUndoAPI
comment: JavaLibrary implementing the javax.swing.undo package for Java SE 6

JavaxTools
type: Class
subclass of: JavaAPIPart
comment: Java API part implementing the javax.tools package for Java SE 6

JavaxToolsAPI
type: Class
subclass of: JavaAPI
comment: platform:comprisesInterfacePart some JavaxTools
comment: JavaLibrary implementing the javax.tools package for Java SE 6

JavaxToolsClassLibrary
type: Class
subclass of: JavaClassLibrary
comment: platform:implementsInterface some JavaxToolsAPI
comment: JavaLibrary implementing the javax.tools package for Java SE 6

JavaxTransaction
type: Class
subclass of: JavaAPIPart
comment: Java API part implementing the javax.transaction package for Java SE 6

JavaxTransactionAPI
type: Class
subclass of: JavaAPI
comment: platform:comprisesInterfacePart some JavaxTransaction
comment: JavaLibrary implementing the javax.transaction package for Java SE 6

JavaxTransactionClassLibrary
type: Class
subclass of: JavaClassLibrary
comment: platform:implementsInterface some JavaxTransactionAPI
comment: JavaLibrary implementing the javax.transaction package for Java SE 6

JavaxTransactionXa
type: Class
subclass of: JavaAPIPart
comment: Java API part implementing the javax.transaction.xa package for Java SE 6

JavaxTransactionXaAPI
type: Class
subclass of: JavaAPI
comment: platform:comprisesInterfacePart some JavaxTransactionXa
comment: JavaLibrary implementing the javax.transaction.xa package for Java SE 6

JavaxTransactionXaClassLibrary
type: Class
subclass of: JavaClassLibrary
comment: platform:implementsInterface some JavaxTransactionXaAPI
comment: JavaLibrary implementing the javax.transaction.xa package for Java SE 6

JavaxXml
type: Class
subclass of: JavaAPIPart
comment: Java API part implementing the javax.xml package for Java SE 6

JavaxXmlAPI
type: Class
subclass of: JavaAPI
comment: platform:comprisesInterfacePart some JavaxXml
comment: JavaLibrary implementing the javax.xml package for Java SE 6

JavaxXmlBind
type: Class
subclass of: JavaAPIPart
comment: Java API part implementing the javax.xml.bind package for Java SE 6

JavaxXmlBindAPI
type: Class
subclass of: JavaAPI
comment: platform:comprisesInterfacePart some JavaxXmlBind
comment: JavaLibrary implementing the javax.xml.bind package for Java SE 6

JavaxXmlBindAnnotation
type: Class
subclass of: JavaAPIPart
comment: Java API part implementing the javax.xml.bind.annotation package for Java SE 6

JavaxXmlBindAnnotationAPI
type: Class
subclass of: JavaAPI
comment: platform:comprisesInterfacePart some JavaxXmlBindAnnotation
comment: JavaLibrary implementing the javax.xml.bind.annotation package for Java SE 6

JavaxXmlBindAnnotationAdapters
type: Class
subclass of: JavaAPIPart
comment: Java API part implementing the javax.xml.bind.annotation.adapters package for Java SE 6

JavaxXmlBindAnnotationAdaptersAPI
type: Class
subclass of: JavaAPI
comment: platform:comprisesInterfacePart some JavaxXmlBindAnnotationAdapters
comment: JavaLibrary implementing the javax.xml.bind.annotation.adapters package for Java SE 6

JavaxXmlBindAnnotationAdaptersClassLibrary
type: Class
subclass of: JavaClassLibrary
comment: platform:implementsInterface some JavaxXmlBindAnnotationAdaptersAPI
comment: JavaLibrary implementing the javax.xml.bind.annotation.adapters package for Java SE 6

JavaxXmlBindAnnotationClassLibrary
type: Class
subclass of: JavaClassLibrary
comment: platform:implementsInterface some JavaxXmlBindAnnotationAPI
comment: JavaLibrary implementing the javax.xml.bind.annotation package for Java SE 6

JavaxXmlBindAttachment
type: Class
subclass of: JavaAPIPart
comment: Java API part implementing the javax.xml.bind.attachment package for Java SE 6

JavaxXmlBindAttachmentAPI
type: Class
subclass of: JavaAPI
comment: platform:comprisesInterfacePart some JavaxXmlBindAttachment
comment: JavaLibrary implementing the javax.xml.bind.attachment package for Java SE 6

JavaxXmlBindAttachmentClassLibrary
type: Class
subclass of: JavaClassLibrary
comment: platform:implementsInterface some JavaxXmlBindAttachmentAPI
comment: JavaLibrary implementing the javax.xml.bind.attachment package for Java SE 6

JavaxXmlBindClassLibrary
type: Class
subclass of: JavaClassLibrary
comment: platform:implementsInterface some JavaxXmlBindAPI
comment: JavaLibrary implementing the javax.xml.bind package for Java SE 6

JavaxXmlBindHelpers
type: Class
subclass of: JavaAPIPart
comment: Java API part implementing the javax.xml.bind.helpers package for Java SE 6

JavaxXmlBindHelpersAPI
type: Class
subclass of: JavaAPI
comment: platform:comprisesInterfacePart some JavaxXmlBindHelpers
comment: JavaLibrary implementing the javax.xml.bind.helpers package for Java SE 6

JavaxXmlBindHelpersClassLibrary
type: Class
subclass of: JavaClassLibrary
comment: platform:implementsInterface some JavaxXmlBindHelpersAPI
comment: JavaLibrary implementing the javax.xml.bind.helpers package for Java SE 6

JavaxXmlBindUtil
type: Class
subclass of: JavaAPIPart
comment: Java API part implementing the javax.xml.bind.util package for Java SE 6

JavaxXmlBindUtilAPI
type: Class
subclass of: JavaAPI
comment: platform:comprisesInterfacePart some JavaxXmlBindUtil
comment: JavaLibrary implementing the javax.xml.bind.util package for Java SE 6

JavaxXmlBindUtilClassLibrary
type: Class
subclass of: JavaClassLibrary
comment: platform:implementsInterface some JavaxXmlBindUtilAPI
comment: JavaLibrary implementing the javax.xml.bind.util package for Java SE 6

JavaxXmlClassLibrary
type: Class
subclass of: JavaClassLibrary
comment: platform:implementsInterface some JavaxXmlAPI
comment: JavaLibrary implementing the javax.xml package for Java SE 6

JavaxXmlCrypto
type: Class
subclass of: JavaAPIPart
comment: Java API part implementing the javax.xml.crypto package for Java SE 6

JavaxXmlCryptoAPI
type: Class
subclass of: JavaAPI
comment: platform:comprisesInterfacePart some JavaxXmlCrypto
comment: JavaLibrary implementing the javax.xml.crypto package for Java SE 6

JavaxXmlCryptoClassLibrary
type: Class
subclass of: JavaClassLibrary
comment: platform:implementsInterface some JavaxXmlCryptoAPI
comment: JavaLibrary implementing the javax.xml.crypto package for Java SE 6

JavaxXmlCryptoDom
type: Class
subclass of: JavaAPIPart
comment: Java API part implementing the javax.xml.crypto.dom package for Java SE 6

JavaxXmlCryptoDomAPI
type: Class
subclass of: JavaAPI
comment: platform:comprisesInterfacePart some JavaxXmlCryptoDom
comment: JavaLibrary implementing the javax.xml.crypto.dom package for Java SE 6

JavaxXmlCryptoDomClassLibrary
type: Class
subclass of: JavaClassLibrary
comment: platform:implementsInterface some JavaxXmlCryptoDomAPI
comment: JavaLibrary implementing the javax.xml.crypto.dom package for Java SE 6

JavaxXmlCryptoDsig
type: Class
subclass of: JavaAPIPart
comment: Java API part implementing the javax.xml.crypto.dsig package for Java SE 6

JavaxXmlCryptoDsigAPI
type: Class
subclass of: JavaAPI
comment: platform:comprisesInterfacePart some JavaxXmlCryptoDsig
comment: JavaLibrary implementing the javax.xml.crypto.dsig package for Java SE 6

JavaxXmlCryptoDsigClassLibrary
type: Class
subclass of: JavaClassLibrary
comment: platform:implementsInterface some JavaxXmlCryptoDsigAPI
comment: JavaLibrary implementing the javax.xml.crypto.dsig package for Java SE 6

JavaxXmlCryptoDsigDom
type: Class
subclass of: JavaAPIPart
comment: Java API part implementing the javax.xml.crypto.dsig.dom package for Java SE 6

JavaxXmlCryptoDsigDomAPI
type: Class
subclass of: JavaAPI
comment: platform:comprisesInterfacePart some JavaxXmlCryptoDsigDom
comment: JavaLibrary implementing the javax.xml.crypto.dsig.dom package for Java SE 6

JavaxXmlCryptoDsigDomClassLibrary
type: Class
subclass of: JavaClassLibrary
comment: platform:implementsInterface some JavaxXmlCryptoDsigDomAPI
comment: JavaLibrary implementing the javax.xml.crypto.dsig.dom package for Java SE 6

JavaxXmlCryptoDsigKeyinfo
type: Class
subclass of: JavaAPIPart
comment: Java API part implementing the javax.xml.crypto.dsig.keyinfo package for Java SE 6

JavaxXmlCryptoDsigKeyinfoAPI
type: Class
subclass of: JavaAPI
comment: platform:comprisesInterfacePart some JavaxXmlCryptoDsigKeyinfo
comment: JavaLibrary implementing the javax.xml.crypto.dsig.keyinfo package for Java SE 6

JavaxXmlCryptoDsigKeyinfoClassLibrary
type: Class
subclass of: JavaClassLibrary
comment: platform:implementsInterface some JavaxXmlCryptoDsigKeyinfoAPI
comment: JavaLibrary implementing the javax.xml.crypto.dsig.keyinfo package for Java SE 6

JavaxXmlCryptoDsigSpec
type: Class
subclass of: JavaAPIPart
comment: Java API part implementing the javax.xml.crypto.dsig.spec package for Java SE 6

JavaxXmlCryptoDsigSpecAPI
type: Class
subclass of: JavaAPI
comment: platform:comprisesInterfacePart some JavaxXmlCryptoDsigSpec
comment: JavaLibrary implementing the javax.xml.crypto.dsig.spec package for Java SE 6

JavaxXmlCryptoDsigSpecClassLibrary
type: Class
subclass of: JavaClassLibrary
comment: platform:implementsInterface some JavaxXmlCryptoDsigSpecAPI
comment: JavaLibrary implementing the javax.xml.crypto.dsig.spec package for Java SE 6

JavaxXmlDatatype
type: Class
subclass of: JavaxXmlDatatype
comment: Java API part implementing the javax.xml.datatype package for Java SE 6

JavaxXmlDatatypeAPI
type: Class
subclass of: JavaxXmlDatatypeAPI
comment: platform:comprisesInterfacePart some JavaxXmlDatatype
comment: JavaLibrary implementing the javax.xml.datatype package for Java SE 6

JavaxXmlDatatypeClassLibrary
type: Class
subclass of: JavaxXmlDatatypeClassLibrary
comment: platform:implementsInterface some JavaxXmlDatatypeAPI
comment: JavaLibrary implementing the javax.xml.datatype package for Java SE 6

JavaxXmlNamespace
type: Class
subclass of: JavaAPIPart
comment: Java API part implementing the javax.xml.namespace package for Java SE 6

JavaxXmlNamespaceAPI
type: Class
subclass of: JavaAPI
comment: platform:comprisesInterfacePart some JavaxXmlNamespace
comment: JavaLibrary implementing the javax.xml.namespace package for Java SE 6

JavaxXmlNamespaceClassLibrary
type: Class
subclass of: JavaClassLibrary
comment: platform:implementsInterface some JavaxXmlNamespaceAPI
comment: JavaLibrary implementing the javax.xml.namespace package for Java SE 6

JavaxXmlParsers
type: Class
subclass of: JavaxXmlParsers
comment: Java API part implementing the javax.xml.parsers package for Java SE 6

JavaxXmlParsersAPI
type: Class
subclass of: JavaxXmlParsersAPI
comment: platform:comprisesInterfacePart some JavaxXmlParsers
comment: JavaLibrary implementing the javax.xml.parsers package for Java SE 6

JavaxXmlParsersClassLibrary
type: Class
subclass of: JavaxXmlParsersClassLibrary
comment: platform:implementsInterface some JavaxXmlParsersAPI
comment: JavaLibrary implementing the javax.xml.parsers package for Java SE 6

JavaxXmlSoap
type: Class
subclass of: JavaAPIPart
comment: Java API part implementing the javax.xml.soap package for Java SE 6

JavaxXmlSoapAPI
type: Class
subclass of: JavaAPI
comment: platform:comprisesInterfacePart some JavaxXmlSoap
comment: JavaLibrary implementing the javax.xml.soap package for Java SE 6

JavaxXmlSoapClassLibrary
type: Class
subclass of: JavaClassLibrary
comment: platform:implementsInterface some JavaxXmlSoapAPI
comment: JavaLibrary implementing the javax.xml.soap package for Java SE 6

JavaxXmlStream
type: Class
subclass of: JavaAPIPart
comment: Java API part implementing the javax.xml.stream package for Java SE 6

JavaxXmlStreamAPI
type: Class
subclass of: JavaAPI
comment: platform:comprisesInterfacePart some JavaxXmlStream
comment: JavaLibrary implementing the javax.xml.stream package for Java SE 6

JavaxXmlStreamClassLibrary
type: Class
subclass of: JavaClassLibrary
comment: platform:implementsInterface some JavaxXmlStreamAPI
comment: JavaLibrary implementing the javax.xml.stream package for Java SE 6

JavaxXmlStreamEvents
type: Class
subclass of: JavaAPIPart
comment: Java API part implementing the javax.xml.stream.events package for Java SE 6

JavaxXmlStreamEventsAPI
type: Class
subclass of: JavaAPI
comment: platform:comprisesInterfacePart some JavaxXmlStreamEvents
comment: JavaLibrary implementing the javax.xml.stream.events package for Java SE 6

JavaxXmlStreamEventsClassLibrary
type: Class
subclass of: JavaClassLibrary
comment: platform:implementsInterface some JavaxXmlStreamEventsAPI
comment: JavaLibrary implementing the javax.xml.stream.events package for Java SE 6

JavaxXmlStreamUtil
type: Class
subclass of: JavaAPIPart
comment: Java API part implementing the javax.xml.stream.util package for Java SE 6

JavaxXmlStreamUtilAPI
type: Class
subclass of: JavaAPI
comment: platform:comprisesInterfacePart some JavaxXmlStreamUtil
comment: JavaLibrary implementing the javax.xml.stream.util package for Java SE 6

JavaxXmlStreamUtilClassLibrary
type: Class
subclass of: JavaClassLibrary
comment: platform:implementsInterface some JavaxXmlStreamUtilAPI
comment: JavaLibrary implementing the javax.xml.stream.util package for Java SE 6

JavaxXmlTransform
type: Class
subclass of: JavaxXmlTransform
comment: Java API part implementing the javax.xml.transform package for Java SE 6

JavaxXmlTransformAPI
type: Class
subclass of: JavaxXmlTransformAPI
comment: platform:comprisesInterfacePart some JavaxXmlTransform
comment: JavaLibrary implementing the javax.xml.transform package for Java SE 6

JavaxXmlTransformClassLibrary
type: Class
subclass of: JavaxXmlTransformClassLibrary
comment: platform:implementsInterface some JavaxXmlTransformAPI
comment: JavaLibrary implementing the javax.xml.transform package for Java SE 6

JavaxXmlTransformDom
type: Class
subclass of: JavaAPIPart
comment: Java API part implementing the javax.xml.transform.dom package for Java SE 6

JavaxXmlTransformDomAPI
type: Class
subclass of: JavaAPI
comment: platform:comprisesInterfacePart some JavaxXmlTransformDom
comment: JavaLibrary implementing the javax.xml.transform.dom package for Java SE 6

JavaxXmlTransformDomClassLibrary
type: Class
subclass of: JavaClassLibrary
comment: platform:implementsInterface some JavaxXmlTransformDomAPI
comment: JavaLibrary implementing the javax.xml.transform.dom package for Java SE 6

JavaxXmlTransformSax
type: Class
subclass of: JavaxXmlTransformSax
comment: Java API part implementing the javax.xml.transform.sax package for Java SE 6

JavaxXmlTransformSaxAPI
type: Class
subclass of: JavaxXmlTransformSaxAPI
comment: platform:comprisesInterfacePart some JavaxXmlTransformSax
comment: JavaLibrary implementing the javax.xml.transform.sax package for Java SE 6

JavaxXmlTransformSaxClassLibrary
type: Class
subclass of: JavaxXmlTransformSaxClassLibrary
comment: platform:implementsInterface some JavaxXmlTransformSaxAPI
comment: JavaLibrary implementing the javax.xml.transform.sax package for Java SE 6

JavaxXmlTransformStax
type: Class
subclass of: JavaAPIPart
comment: Java API part implementing the javax.xml.transform.stax package for Java SE 6

JavaxXmlTransformStaxAPI
type: Class
subclass of: JavaAPI
comment: platform:comprisesInterfacePart some JavaxXmlTransformStax
comment: JavaLibrary implementing the javax.xml.transform.stax package for Java SE 6

JavaxXmlTransformStaxClassLibrary
type: Class
subclass of: JavaClassLibrary
comment: platform:implementsInterface some JavaxXmlTransformStaxAPI
comment: JavaLibrary implementing the javax.xml.transform.stax package for Java SE 6

JavaxXmlTransformStream
type: Class
subclass of: JavaAPIPart
comment: Java API part implementing the javax.xml.transform.stream package for Java SE 6

JavaxXmlTransformStreamAPI
type: Class
subclass of: JavaAPI
comment: platform:comprisesInterfacePart some JavaxXmlTransformStream
comment: JavaLibrary implementing the javax.xml.transform.stream package for Java SE 6

JavaxXmlTransformStreamClassLibrary
type: Class
subclass of: JavaClassLibrary
comment: platform:implementsInterface some JavaxXmlTransformStreamAPI
comment: JavaLibrary implementing the javax.xml.transform.stream package for Java SE 6

JavaxXmlValidation
type: Class
subclass of: JavaxXmlValidation
comment: Java API part implementing the javax.xml.validation package for Java SE 6

JavaxXmlValidationAPI
type: Class
subclass of: JavaxXmlValidationAPI
comment: platform:comprisesInterfacePart some JavaxXmlValidation
comment: JavaLibrary implementing the javax.xml.validation package for Java SE 6

JavaxXmlValidationClassLibrary
type: Class
subclass of: JavaxXmlValidationClassLibrary
comment: platform:implementsInterface some JavaxXmlValidationAPI
comment: JavaLibrary implementing the javax.xml.validation package for Java SE 6

JavaxXmlWs
type: Class
subclass of: JavaAPIPart
comment: Java API part implementing the javax.xml.ws package for Java SE 6

JavaxXmlWsAPI
type: Class
subclass of: JavaAPI
comment: platform:comprisesInterfacePart some JavaxXmlWs
comment: JavaLibrary implementing the javax.xml.ws package for Java SE 6

JavaxXmlWsClassLibrary
type: Class
subclass of: JavaClassLibrary
comment: platform:implementsInterface some JavaxXmlWsAPI
comment: JavaLibrary implementing the javax.xml.ws package for Java SE 6

JavaxXmlWsHandler
type: Class
subclass of: JavaAPIPart
comment: Java API part implementing the javax.xml.ws.handler package for Java SE 6

JavaxXmlWsHandlerAPI
type: Class
subclass of: JavaAPI
comment: platform:comprisesInterfacePart some JavaxXmlWsHandler
comment: JavaLibrary implementing the javax.xml.ws.handler package for Java SE 6

JavaxXmlWsHandlerClassLibrary
type: Class
subclass of: JavaClassLibrary
comment: platform:implementsInterface some JavaxXmlWsHandlerAPI
comment: JavaLibrary implementing the javax.xml.ws.handler package for Java SE 6

JavaxXmlWsHandlerSoap
type: Class
subclass of: JavaAPIPart
comment: Java API part implementing the javax.xml.ws.handler.soap package for Java SE 6

JavaxXmlWsHandlerSoapAPI
type: Class
subclass of: JavaAPI
comment: platform:comprisesInterfacePart some JavaxXmlWsHandlerSoap
comment: JavaLibrary implementing the javax.xml.ws.handler.soap package for Java SE 6

JavaxXmlWsHandlerSoapClassLibrary
type: Class
subclass of: JavaClassLibrary
comment: platform:implementsInterface some JavaxXmlWsHandlerSoapAPI
comment: JavaLibrary implementing the javax.xml.ws.handler.soap package for Java SE 6

JavaxXmlWsHttp
type: Class
subclass of: JavaAPIPart
comment: Java API part implementing the javax.xml.ws.http package for Java SE 6

JavaxXmlWsHttpAPI
type: Class
subclass of: JavaAPI
comment: platform:comprisesInterfacePart some JavaxXmlWsHttp
comment: JavaLibrary implementing the javax.xml.ws.http package for Java SE 6

JavaxXmlWsHttpClassLibrary
type: Class
subclass of: JavaClassLibrary
comment: platform:implementsInterface some JavaxXmlWsHttpAPI
comment: JavaLibrary implementing the javax.xml.ws.http package for Java SE 6

JavaxXmlWsSoap
type: Class
subclass of: JavaAPIPart
comment: Java API part implementing the javax.xml.ws.soap package for Java SE 6

JavaxXmlWsSoapAPI
type: Class
subclass of: JavaAPI
comment: platform:comprisesInterfacePart some JavaxXmlWsSoap
comment: JavaLibrary implementing the javax.xml.ws.soap package for Java SE 6

JavaxXmlWsSoapClassLibrary
type: Class
subclass of: JavaClassLibrary
comment: platform:implementsInterface some JavaxXmlWsSoapAPI
comment: JavaLibrary implementing the javax.xml.ws.soap package for Java SE 6

JavaxXmlWsSpi
type: Class
subclass of: JavaAPIPart
comment: Java API part implementing the javax.xml.ws.spi package for Java SE 6

JavaxXmlWsSpiAPI
type: Class
subclass of: JavaAPI
comment: platform:comprisesInterfacePart some JavaxXmlWsSpi
comment: JavaLibrary implementing the javax.xml.ws.spi package for Java SE 6

JavaxXmlWsSpiClassLibrary
type: Class
subclass of: JavaClassLibrary
comment: platform:implementsInterface some JavaxXmlWsSpiAPI
comment: JavaLibrary implementing the javax.xml.ws.spi package for Java SE 6

JavaxXmlWsWsaddressing
type: Class
subclass of: JavaAPIPart
comment: Java API part implementing the javax.xml.ws.wsaddressing package for Java SE 6

JavaxXmlWsWsaddressingAPI
type: Class
subclass of: JavaAPI
comment: platform:comprisesInterfacePart some JavaxXmlWsWsaddressing
comment: JavaLibrary implementing the javax.xml.ws.wsaddressing package for Java SE 6

JavaxXmlWsWsaddressingClassLibrary
type: Class
subclass of: JavaClassLibrary
comment: platform:implementsInterface some JavaxXmlWsWsaddressingAPI
comment: JavaLibrary implementing the javax.xml.ws.wsaddressing package for Java SE 6

JavaxXmlXpath
type: Class
subclass of: JavaxXmlXpath
comment: Java API part implementing the javax.xml.xpath package for Java SE 6

JavaxXmlXpathAPI
type: Class
subclass of: JavaxXmlXpathAPI
comment: platform:comprisesInterfacePart some JavaxXmlXpath
comment: JavaLibrary implementing the javax.xml.xpath package for Java SE 6

JavaxXmlXpathClassLibrary
type: Class
subclass of: JavaxXmlXpathClassLibrary
comment: platform:implementsInterface some JavaxXmlXpathAPI
comment: JavaLibrary implementing the javax.xml.xpath package for Java SE 6

OrgIetfJgss
type: Class
subclass of: JavaAPIPart
comment: Java API part implementing the org.ietf.jgss package for Java SE 6

OrgIetfJgssAPI
type: Class
subclass of: JavaAPI
comment: platform:comprisesInterfacePart some OrgIetfJgss
comment: JavaLibrary implementing the org.ietf.jgss package for Java SE 6

OrgIetfJgssClassLibrary
type: Class
subclass of: JavaClassLibrary
comment: platform:implementsInterface some OrgIetfJgssAPI
comment: JavaLibrary implementing the org.ietf.jgss package for Java SE 6

OrgOmgCORBA
type: Class
subclass of: JavaAPIPart
comment: Java API part implementing the org.omg.CORBA package for Java SE 6

OrgOmgCORBAAPI
type: Class
subclass of: JavaAPI
comment: platform:comprisesInterfacePart some OrgOmgCORBA
comment: JavaLibrary implementing the org.omg.CORBA package for Java SE 6

OrgOmgCORBAClassLibrary
type: Class
subclass of: JavaClassLibrary
comment: platform:implementsInterface some OrgOmgCORBAAPI
comment: JavaLibrary implementing the org.omg.CORBA package for Java SE 6

OrgOmgCORBADynAnyPackage
type: Class
subclass of: JavaAPIPart
comment: Java API part implementing the org.omg.CORBA.DynAnyPackage package for Java SE 6

OrgOmgCORBADynAnyPackageAPI
type: Class
subclass of: JavaAPI
comment: platform:comprisesInterfacePart some OrgOmgCORBADynAnyPackage
comment: JavaLibrary implementing the org.omg.CORBA.DynAnyPackage package for Java SE 6

OrgOmgCORBADynAnyPackageClassLibrary
type: Class
subclass of: JavaClassLibrary
comment: platform:implementsInterface some OrgOmgCORBADynAnyPackageAPI
comment: JavaLibrary implementing the org.omg.CORBA.DynAnyPackage package for Java SE 6

OrgOmgCORBAORBPackage
type: Class
subclass of: JavaAPIPart
comment: Java API part implementing the org.omg.CORBA.ORBPackage package for Java SE 6

OrgOmgCORBAORBPackageAPI
type: Class
subclass of: JavaAPI
comment: platform:comprisesInterfacePart some OrgOmgCORBAORBPackage
comment: JavaLibrary implementing the org.omg.CORBA.ORBPackage package for Java SE 6

OrgOmgCORBAORBPackageClassLibrary
type: Class
subclass of: JavaClassLibrary
comment: platform:implementsInterface some OrgOmgCORBAORBPackageAPI
comment: JavaLibrary implementing the org.omg.CORBA.ORBPackage package for Java SE 6

OrgOmgCORBAPortable
type: Class
subclass of: JavaAPIPart
comment: Java API part implementing the org.omg.CORBA.portable package for Java SE 6

OrgOmgCORBAPortableAPI
type: Class
subclass of: JavaAPI
comment: platform:comprisesInterfacePart some OrgOmgCORBAPortable
comment: JavaLibrary implementing the org.omg.CORBA.portable package for Java SE 6

OrgOmgCORBAPortableClassLibrary
type: Class
subclass of: JavaClassLibrary
comment: platform:implementsInterface some OrgOmgCORBAPortableAPI
comment: JavaLibrary implementing the org.omg.CORBA.portable package for Java SE 6

OrgOmgCORBATypeCodePackage
type: Class
subclass of: JavaAPIPart
comment: Java API part implementing the org.omg.CORBA.TypeCodePackage package for Java SE 6

OrgOmgCORBATypeCodePackageAPI
type: Class
subclass of: JavaAPI
comment: platform:comprisesInterfacePart some OrgOmgCORBATypeCodePackage
comment: JavaLibrary implementing the org.omg.CORBA.TypeCodePackage package for Java SE 6

OrgOmgCORBATypeCodePackageClassLibrary
type: Class
subclass of: JavaClassLibrary
comment: platform:implementsInterface some OrgOmgCORBATypeCodePackageAPI
comment: JavaLibrary implementing the org.omg.CORBA.TypeCodePackage package for Java SE 6

OrgOmgCORBA 2 3
type: Class
subclass of: JavaAPIPart
comment: Java API part implementing the org.omg.CORBA_2_3 package for Java SE 6

OrgOmgCORBA 2 3API
type: Class
subclass of: JavaAPI
comment: platform:comprisesInterfacePart some OrgOmgCORBA_2_3
comment: JavaLibrary implementing the org.omg.CORBA_2_3 package for Java SE 6

OrgOmgCORBA 2 3ClassLibrary
type: Class
subclass of: JavaClassLibrary
comment: platform:implementsInterface some OrgOmgCORBA_2_3API
comment: JavaLibrary implementing the org.omg.CORBA_2_3 package for Java SE 6

OrgOmgCORBA 2 3Portable
type: Class
subclass of: JavaAPIPart
comment: Java API part implementing the org.omg.CORBA_2_3.portable package for Java SE 6

OrgOmgCORBA 2 3PortableAPI
type: Class
subclass of: JavaAPI
comment: platform:comprisesInterfacePart some OrgOmgCORBA_2_3Portable
comment: JavaLibrary implementing the org.omg.CORBA_2_3.portable package for Java SE 6

OrgOmgCORBA 2 3PortableClassLibrary
type: Class
subclass of: JavaClassLibrary
comment: platform:implementsInterface some OrgOmgCORBA_2_3PortableAPI
comment: JavaLibrary implementing the org.omg.CORBA_2_3.portable package for Java SE 6

OrgOmgCosNaming
type: Class
subclass of: JavaAPIPart
comment: Java API part implementing the org.omg.CosNaming package for Java SE 6

OrgOmgCosNamingAPI
type: Class
subclass of: JavaAPI
comment: platform:comprisesInterfacePart some OrgOmgCosNaming
comment: JavaLibrary implementing the org.omg.CosNaming package for Java SE 6

OrgOmgCosNamingClassLibrary
type: Class
subclass of: JavaClassLibrary
comment: platform:implementsInterface some OrgOmgCosNamingAPI
comment: JavaLibrary implementing the org.omg.CosNaming package for Java SE 6

OrgOmgCosNamingNamingContextExtPackage
type: Class
subclass of: JavaAPIPart
comment: Java API part implementing the org.omg.CosNaming.NamingContextExtPackage package for Java SE 6

OrgOmgCosNamingNamingContextExtPackageAPI
type: Class
subclass of: JavaAPI
comment: platform:comprisesInterfacePart some OrgOmgCosNamingNamingContextExtPackage
comment: JavaLibrary implementing the org.omg.CosNaming.NamingContextExtPackage package for Java SE 6

OrgOmgCosNamingNamingContextExtPackageClassLibrary
type: Class
subclass of: JavaClassLibrary
comment: platform:implementsInterface some OrgOmgCosNamingNamingContextExtPackageAPI
comment: JavaLibrary implementing the org.omg.CosNaming.NamingContextExtPackage package for Java SE 6

OrgOmgCosNamingNamingContextPackage
type: Class
subclass of: JavaAPIPart
comment: Java API part implementing the org.omg.CosNaming.NamingContextPackage package for Java SE 6

OrgOmgCosNamingNamingContextPackageAPI
type: Class
subclass of: JavaAPI
comment: platform:comprisesInterfacePart some OrgOmgCosNamingNamingContextPackage
comment: JavaLibrary implementing the org.omg.CosNaming.NamingContextPackage package for Java SE 6

OrgOmgCosNamingNamingContextPackageClassLibrary
type: Class
subclass of: JavaClassLibrary
comment: platform:implementsInterface some OrgOmgCosNamingNamingContextPackageAPI
comment: JavaLibrary implementing the org.omg.CosNaming.NamingContextPackage package for Java SE 6

OrgOmgDynamic
type: Class
subclass of: JavaAPIPart
comment: Java API part implementing the org.omg.Dynamic package for Java SE 6

OrgOmgDynamicAPI
type: Class
subclass of: JavaAPI
comment: platform:comprisesInterfacePart some OrgOmgDynamic
comment: JavaLibrary implementing the org.omg.Dynamic package for Java SE 6

OrgOmgDynamicAny
type: Class
subclass of: JavaAPIPart
comment: Java API part implementing the org.omg.DynamicAny package for Java SE 6

OrgOmgDynamicAnyAPI
type: Class
subclass of: JavaAPI
comment: platform:comprisesInterfacePart some OrgOmgDynamicAny
comment: JavaLibrary implementing the org.omg.DynamicAny package for Java SE 6

OrgOmgDynamicAnyClassLibrary
type: Class
subclass of: JavaClassLibrary
comment: platform:implementsInterface some OrgOmgDynamicAnyAPI
comment: JavaLibrary implementing the org.omg.DynamicAny package for Java SE 6

OrgOmgDynamicAnyDynAnyFactoryPackage
type: Class
subclass of: JavaAPIPart
comment: Java API part implementing the org.omg.DynamicAny.DynAnyFactoryPackage package for Java SE 6

OrgOmgDynamicAnyDynAnyFactoryPackageAPI
type: Class
subclass of: JavaAPI
comment: platform:comprisesInterfacePart some OrgOmgDynamicAnyDynAnyFactoryPackage
comment: JavaLibrary implementing the org.omg.DynamicAny.DynAnyFactoryPackage package for Java SE 6

OrgOmgDynamicAnyDynAnyFactoryPackageClassLibrary
type: Class
subclass of: JavaClassLibrary
comment: platform:implementsInterface some OrgOmgDynamicAnyDynAnyFactoryPackageAPI
comment: JavaLibrary implementing the org.omg.DynamicAny.DynAnyFactoryPackage package for Java SE 6

OrgOmgDynamicAnyDynAnyPackage
type: Class
subclass of: JavaAPIPart
comment: Java API part implementing the org.omg.DynamicAny.DynAnyPackage package for Java SE 6

OrgOmgDynamicAnyDynAnyPackageAPI
type: Class
subclass of: JavaAPI
comment: platform:comprisesInterfacePart some OrgOmgDynamicAnyDynAnyPackage
comment: JavaLibrary implementing the org.omg.DynamicAny.DynAnyPackage package for Java SE 6

OrgOmgDynamicAnyDynAnyPackageClassLibrary
type: Class
subclass of: JavaClassLibrary
comment: platform:implementsInterface some OrgOmgDynamicAnyDynAnyPackageAPI
comment: JavaLibrary implementing the org.omg.DynamicAny.DynAnyPackage package for Java SE 6

OrgOmgDynamicClassLibrary
type: Class
subclass of: JavaClassLibrary
comment: platform:implementsInterface some OrgOmgDynamicAPI
comment: JavaLibrary implementing the org.omg.Dynamic package for Java SE 6

OrgOmgIOP
type: Class
subclass of: JavaAPIPart
comment: Java API part implementing the org.omg.IOP package for Java SE 6

OrgOmgIOPAPI
type: Class
subclass of: JavaAPI
comment: platform:comprisesInterfacePart some OrgOmgIOP
comment: JavaLibrary implementing the org.omg.IOP package for Java SE 6

OrgOmgIOPClassLibrary
type: Class
subclass of: JavaClassLibrary
comment: platform:implementsInterface some OrgOmgIOPAPI
comment: JavaLibrary implementing the org.omg.IOP package for Java SE 6

OrgOmgIOPCodecFactoryPackage
type: Class
subclass of: JavaAPIPart
comment: Java API part implementing the org.omg.IOP.CodecFactoryPackage package for Java SE 6

OrgOmgIOPCodecFactoryPackageAPI
type: Class
subclass of: JavaAPI
comment: platform:comprisesInterfacePart some OrgOmgIOPCodecFactoryPackage
comment: JavaLibrary implementing the org.omg.IOP.CodecFactoryPackage package for Java SE 6

OrgOmgIOPCodecFactoryPackageClassLibrary
type: Class
subclass of: JavaClassLibrary
comment: platform:implementsInterface some OrgOmgIOPCodecFactoryPackageAPI
comment: JavaLibrary implementing the org.omg.IOP.CodecFactoryPackage package for Java SE 6

OrgOmgIOPCodecPackage
type: Class
subclass of: JavaAPIPart
comment: Java API part implementing the org.omg.IOP.CodecPackage package for Java SE 6

OrgOmgIOPCodecPackageAPI
type: Class
subclass of: JavaAPI
comment: platform:comprisesInterfacePart some OrgOmgIOPCodecPackage
comment: JavaLibrary implementing the org.omg.IOP.CodecPackage package for Java SE 6

OrgOmgIOPCodecPackageClassLibrary
type: Class
subclass of: JavaClassLibrary
comment: platform:implementsInterface some OrgOmgIOPCodecPackageAPI
comment: JavaLibrary implementing the org.omg.IOP.CodecPackage package for Java SE 6

OrgOmgMessaging
type: Class
subclass of: JavaAPIPart
comment: Java API part implementing the org.omg.Messaging package for Java SE 6

OrgOmgMessagingAPI
type: Class
subclass of: JavaAPI
comment: platform:comprisesInterfacePart some OrgOmgMessaging
comment: JavaLibrary implementing the org.omg.Messaging package for Java SE 6

OrgOmgMessagingClassLibrary
type: Class
subclass of: JavaClassLibrary
comment: platform:implementsInterface some OrgOmgMessagingAPI
comment: JavaLibrary implementing the org.omg.Messaging package for Java SE 6

OrgOmgPortableInterceptor
type: Class
subclass of: JavaAPIPart
comment: Java API part implementing the org.omg.PortableInterceptor package for Java SE 6

OrgOmgPortableInterceptorAPI
type: Class
subclass of: JavaAPI
comment: platform:comprisesInterfacePart some OrgOmgPortableInterceptor
comment: JavaLibrary implementing the org.omg.PortableInterceptor package for Java SE 6

OrgOmgPortableInterceptorClassLibrary
type: Class
subclass of: JavaClassLibrary
comment: platform:implementsInterface some OrgOmgPortableInterceptorAPI
comment: JavaLibrary implementing the org.omg.PortableInterceptor package for Java SE 6

OrgOmgPortableInterceptorORBInitInfoPackage
type: Class
subclass of: JavaAPIPart
comment: Java API part implementing the org.omg.PortableInterceptor.ORBInitInfoPackage package for Java SE 6

OrgOmgPortableInterceptorORBInitInfoPackageAPI
type: Class
subclass of: JavaAPI
comment: platform:comprisesInterfacePart some OrgOmgPortableInterceptorORBInitInfoPackage
comment: JavaLibrary implementing the org.omg.PortableInterceptor.ORBInitInfoPackage package for Java SE 6

OrgOmgPortableInterceptorORBInitInfoPackageClassLibrary
type: Class
subclass of: JavaClassLibrary
comment: platform:implementsInterface some OrgOmgPortableInterceptorORBInitInfoPackageAPI
comment: JavaLibrary implementing the org.omg.PortableInterceptor.ORBInitInfoPackage package for Java SE 6

OrgOmgPortableServer
type: Class
subclass of: JavaAPIPart
comment: Java API part implementing the org.omg.PortableServer package for Java SE 6

OrgOmgPortableServerAPI
type: Class
subclass of: JavaAPI
comment: platform:comprisesInterfacePart some OrgOmgPortableServer
comment: JavaLibrary implementing the org.omg.PortableServer package for Java SE 6

OrgOmgPortableServerClassLibrary
type: Class
subclass of: JavaClassLibrary
comment: platform:implementsInterface some OrgOmgPortableServerAPI
comment: JavaLibrary implementing the org.omg.PortableServer package for Java SE 6

OrgOmgPortableServerCurrentPackage
type: Class
subclass of: JavaAPIPart
comment: Java API part implementing the org.omg.PortableServer.CurrentPackage package for Java SE 6

OrgOmgPortableServerCurrentPackageAPI
type: Class
subclass of: JavaAPI
comment: platform:comprisesInterfacePart some OrgOmgPortableServerCurrentPackage
comment: JavaLibrary implementing the org.omg.PortableServer.CurrentPackage package for Java SE 6

OrgOmgPortableServerCurrentPackageClassLibrary
type: Class
subclass of: JavaClassLibrary
comment: platform:implementsInterface some OrgOmgPortableServerCurrentPackageAPI
comment: JavaLibrary implementing the org.omg.PortableServer.CurrentPackage package for Java SE 6

OrgOmgPortableServerPOAManagerPackage
type: Class
subclass of: JavaAPIPart
comment: Java API part implementing the org.omg.PortableServer.POAManagerPackage package for Java SE 6

OrgOmgPortableServerPOAManagerPackageAPI
type: Class
subclass of: JavaAPI
comment: platform:comprisesInterfacePart some OrgOmgPortableServerPOAManagerPackage
comment: JavaLibrary implementing the org.omg.PortableServer.POAManagerPackage package for Java SE 6

OrgOmgPortableServerPOAManagerPackageClassLibrary
type: Class
subclass of: JavaClassLibrary
comment: platform:implementsInterface some OrgOmgPortableServerPOAManagerPackageAPI
comment: JavaLibrary implementing the org.omg.PortableServer.POAManagerPackage package for Java SE 6

OrgOmgPortableServerPOAPackage
type: Class
subclass of: JavaAPIPart
comment: Java API part implementing the org.omg.PortableServer.POAPackage package for Java SE 6

OrgOmgPortableServerPOAPackageAPI
type: Class
subclass of: JavaAPI
comment: platform:comprisesInterfacePart some OrgOmgPortableServerPOAPackage
comment: JavaLibrary implementing the org.omg.PortableServer.POAPackage package for Java SE 6

OrgOmgPortableServerPOAPackageClassLibrary
type: Class
subclass of: JavaClassLibrary
comment: platform:implementsInterface some OrgOmgPortableServerPOAPackageAPI
comment: JavaLibrary implementing the org.omg.PortableServer.POAPackage package for Java SE 6

OrgOmgPortableServerPortable
type: Class
subclass of: JavaAPIPart
comment: Java API part implementing the org.omg.PortableServer.portable package for Java SE 6

OrgOmgPortableServerPortableAPI
type: Class
subclass of: JavaAPI
comment: platform:comprisesInterfacePart some OrgOmgPortableServerPortable
comment: JavaLibrary implementing the org.omg.PortableServer.portable package for Java SE 6

OrgOmgPortableServerPortableClassLibrary
type: Class
subclass of: JavaClassLibrary
comment: platform:implementsInterface some OrgOmgPortableServerPortableAPI
comment: JavaLibrary implementing the org.omg.PortableServer.portable package for Java SE 6

OrgOmgPortableServerServantLocatorPackage
type: Class
subclass of: JavaAPIPart
comment: Java API part implementing the org.omg.PortableServer.ServantLocatorPackage package for Java SE 6

OrgOmgPortableServerServantLocatorPackageAPI
type: Class
subclass of: JavaAPI
comment: platform:comprisesInterfacePart some OrgOmgPortableServerServantLocatorPackage
comment: JavaLibrary implementing the org.omg.PortableServer.ServantLocatorPackage package for Java SE 6

OrgOmgPortableServerServantLocatorPackageClassLibrary
type: Class
subclass of: JavaClassLibrary
comment: platform:implementsInterface some OrgOmgPortableServerServantLocatorPackageAPI
comment: JavaLibrary implementing the org.omg.PortableServer.ServantLocatorPackage package for Java SE 6

OrgOmgSendingContext
type: Class
subclass of: JavaAPIPart
comment: Java API part implementing the org.omg.SendingContext package for Java SE 6

OrgOmgSendingContextAPI
type: Class
subclass of: JavaAPI
comment: platform:comprisesInterfacePart some OrgOmgSendingContext
comment: JavaLibrary implementing the org.omg.SendingContext package for Java SE 6

OrgOmgSendingContextClassLibrary
type: Class
subclass of: JavaClassLibrary
comment: platform:implementsInterface some OrgOmgSendingContextAPI
comment: JavaLibrary implementing the org.omg.SendingContext package for Java SE 6

OrgOmgStubJavaRmi
type: Class
subclass of: JavaAPIPart
comment: Java API part implementing the org.omg.stub.java.rmi package for Java SE 6

OrgOmgStubJavaRmiAPI
type: Class
subclass of: JavaAPI
comment: platform:comprisesInterfacePart some OrgOmgStubJavaRmi
comment: JavaLibrary implementing the org.omg.stub.java.rmi package for Java SE 6

OrgOmgStubJavaRmiClassLibrary
type: Class
subclass of: JavaClassLibrary
comment: platform:implementsInterface some OrgOmgStubJavaRmiAPI
comment: JavaLibrary implementing the org.omg.stub.java.rmi package for Java SE 6

OrgOmgStubJavaxManagementRemoteRmi
type: Class
subclass of: JavaAPIPart
comment: Java API part implementing the org.omg.stub.javax.management.remote.rmi package for Java SE 6

OrgOmgStubJavaxManagementRemoteRmiAPI
type: Class
subclass of: JavaAPI
comment: platform:comprisesInterfacePart some OrgOmgStubJavaxManagementRemoteRmi
comment: JavaLibrary implementing the org.omg.stub.javax.management.remote.rmi package for Java SE 6

OrgOmgStubJavaxManagementRemoteRmiClassLibrary
type: Class
subclass of: JavaClassLibrary
comment: platform:implementsInterface some OrgOmgStubJavaxManagementRemoteRmiAPI
comment: JavaLibrary implementing the org.omg.stub.javax.management.remote.rmi package for Java SE 6

OrgW3cDom
type: Class
subclass of: JavaAPIPart
comment: Java API part implementing the org.w3c.dom package for Java SE 6

OrgW3cDomAPI
type: Class
subclass of: JavaAPI
comment: platform:comprisesInterfacePart some OrgW3cDom
comment: JavaLibrary implementing the org.w3c.dom package for Java SE 6

OrgW3cDomBootstrap
type: Class
subclass of: JavaAPIPart
comment: Java API part implementing the org.w3c.dom.bootstrap package for Java SE 6

OrgW3cDomBootstrapAPI
type: Class
subclass of: JavaAPI
comment: platform:comprisesInterfacePart some OrgW3cDomBootstrap
comment: JavaLibrary implementing the org.w3c.dom.bootstrap package for Java SE 6

OrgW3cDomBootstrapClassLibrary
type: Class
subclass of: JavaClassLibrary
comment: platform:implementsInterface some OrgW3cDomBootstrapAPI
comment: JavaLibrary implementing the org.w3c.dom.bootstrap package for Java SE 6

OrgW3cDomClassLibrary
type: Class
subclass of: JavaClassLibrary
comment: platform:implementsInterface some OrgW3cDomAPI
comment: JavaLibrary implementing the org.w3c.dom package for Java SE 6

OrgW3cDomCss
type: Class
subclass of: JavaAPIPart
comment: Java API part implementing the org.w3c.dom.css package for Java SE 6

OrgW3cDomCssAPI
type: Class
subclass of: JavaAPI
comment: platform:comprisesInterfacePart some OrgW3cDomCss
comment: JavaLibrary implementing the org.w3c.dom.css package for Java SE 6

OrgW3cDomCssClassLibrary
type: Class
subclass of: JavaClassLibrary
comment: platform:implementsInterface some OrgW3cDomCssAPI
comment: JavaLibrary implementing the org.w3c.dom.css package for Java SE 6

OrgW3cDomEvents
type: Class
subclass of: JavaAPIPart
comment: Java API part implementing the org.w3c.dom.events package for Java SE 6

OrgW3cDomEventsAPI
type: Class
subclass of: JavaAPI
comment: platform:comprisesInterfacePart some OrgW3cDomEvents
comment: JavaLibrary implementing the org.w3c.dom.events package for Java SE 6

OrgW3cDomEventsClassLibrary
type: Class
subclass of: JavaClassLibrary
comment: platform:implementsInterface some OrgW3cDomEventsAPI
comment: JavaLibrary implementing the org.w3c.dom.events package for Java SE 6

OrgW3cDomHtml
type: Class
subclass of: JavaAPIPart
comment: Java API part implementing the org.w3c.dom.html package for Java SE 6

OrgW3cDomHtmlAPI
type: Class
subclass of: JavaAPI
comment: platform:comprisesInterfacePart some OrgW3cDomHtml
comment: JavaLibrary implementing the org.w3c.dom.html package for Java SE 6

OrgW3cDomHtmlClassLibrary
type: Class
subclass of: JavaClassLibrary
comment: platform:implementsInterface some OrgW3cDomHtmlAPI
comment: JavaLibrary implementing the org.w3c.dom.html package for Java SE 6

OrgW3cDomLs
type: Class
subclass of: JavaAPIPart
comment: Java API part implementing the org.w3c.dom.ls package for Java SE 6

OrgW3cDomLsAPI
type: Class
subclass of: JavaAPI
comment: platform:comprisesInterfacePart some OrgW3cDomLs
comment: JavaLibrary implementing the org.w3c.dom.ls package for Java SE 6

OrgW3cDomLsClassLibrary
type: Class
subclass of: JavaClassLibrary
comment: platform:implementsInterface some OrgW3cDomLsAPI
comment: JavaLibrary implementing the org.w3c.dom.ls package for Java SE 6

OrgW3cDomRanges
type: Class
subclass of: JavaAPIPart
comment: Java API part implementing the org.w3c.dom.ranges package for Java SE 6

OrgW3cDomRangesAPI
type: Class
subclass of: JavaAPI
comment: platform:comprisesInterfacePart some OrgW3cDomRanges
comment: JavaLibrary implementing the org.w3c.dom.ranges package for Java SE 6

OrgW3cDomRangesClassLibrary
type: Class
subclass of: JavaClassLibrary
comment: platform:implementsInterface some OrgW3cDomRangesAPI
comment: JavaLibrary implementing the org.w3c.dom.ranges package for Java SE 6

OrgW3cDomStylesheets
type: Class
subclass of: JavaAPIPart
comment: Java API part implementing the org.w3c.dom.stylesheets package for Java SE 6

OrgW3cDomStylesheetsAPI
type: Class
subclass of: JavaAPI
comment: platform:comprisesInterfacePart some OrgW3cDomStylesheets
comment: JavaLibrary implementing the org.w3c.dom.stylesheets package for Java SE 6

OrgW3cDomStylesheetsClassLibrary
type: Class
subclass of: JavaClassLibrary
comment: platform:implementsInterface some OrgW3cDomStylesheetsAPI
comment: JavaLibrary implementing the org.w3c.dom.stylesheets package for Java SE 6

OrgW3cDomTraversal
type: Class
subclass of: JavaAPIPart
comment: Java API part implementing the org.w3c.dom.traversal package for Java SE 6

OrgW3cDomTraversalAPI
type: Class
subclass of: JavaAPI
comment: platform:comprisesInterfacePart some OrgW3cDomTraversal
comment: JavaLibrary implementing the org.w3c.dom.traversal package for Java SE 6

OrgW3cDomTraversalClassLibrary
type: Class
subclass of: JavaClassLibrary
comment: platform:implementsInterface some OrgW3cDomTraversalAPI
comment: JavaLibrary implementing the org.w3c.dom.traversal package for Java SE 6

OrgW3cDomViews
type: Class
subclass of: JavaAPIPart
comment: Java API part implementing the org.w3c.dom.views package for Java SE 6

OrgW3cDomViewsAPI
type: Class
subclass of: JavaAPI
comment: platform:comprisesInterfacePart some OrgW3cDomViews
comment: JavaLibrary implementing the org.w3c.dom.views package for Java SE 6

OrgW3cDomViewsClassLibrary
type: Class
subclass of: JavaClassLibrary
comment: platform:implementsInterface some OrgW3cDomViewsAPI
comment: JavaLibrary implementing the org.w3c.dom.views package for Java SE 6

OrgW3cDomXpath
type: Class
subclass of: JavaAPIPart
comment: Java API part implementing the org.w3c.dom.xpath package for Java SE 6

OrgW3cDomXpathAPI
type: Class
subclass of: JavaAPI
comment: platform:comprisesInterfacePart some OrgW3cDomXpath
comment: JavaLibrary implementing the org.w3c.dom.xpath package for Java SE 6

OrgW3cDomXpathClassLibrary
type: Class
subclass of: JavaClassLibrary
comment: platform:implementsInterface some OrgW3cDomXpathAPI
comment: JavaLibrary implementing the org.w3c.dom.xpath package for Java SE 6

OrgXmlSax
type: Class
subclass of: JavaAPIPart
comment: Java API part implementing the org.xml.sax package for Java SE 6

OrgXmlSaxAPI
type: Class
subclass of: JavaAPI
comment: platform:comprisesInterfacePart some OrgXmlSax
comment: JavaLibrary implementing the org.xml.sax package for Java SE 6

OrgXmlSaxClassLibrary
type: Class
subclass of: JavaClassLibrary
comment: platform:implementsInterface some OrgXmlSaxAPI
comment: JavaLibrary implementing the org.xml.sax package for Java SE 6

OrgXmlSaxExt
type: Class
subclass of: JavaAPIPart
comment: Java API part implementing the org.xml.sax.ext package for Java SE 6

OrgXmlSaxExtAPI
type: Class
subclass of: JavaAPI
comment: platform:comprisesInterfacePart some OrgXmlSaxExt
comment: JavaLibrary implementing the org.xml.sax.ext package for Java SE 6

OrgXmlSaxExtClassLibrary
type: Class
subclass of: JavaClassLibrary
comment: platform:implementsInterface some OrgXmlSaxExtAPI
comment: JavaLibrary implementing the org.xml.sax.ext package for Java SE 6

OrgXmlSaxHelpers
type: Class
subclass of: JavaAPIPart
comment: Java API part implementing the org.xml.sax.helpers package for Java SE 6

OrgXmlSaxHelpersAPI
type: Class
subclass of: JavaAPI
comment: platform:comprisesInterfacePart some OrgXmlSaxHelpers
comment: JavaLibrary implementing the org.xml.sax.helpers package for Java SE 6

OrgXmlSaxHelpersClassLibrary
type: Class
subclass of: JavaClassLibrary
comment: platform:implementsInterface some OrgXmlSaxHelpersAPI
comment: JavaLibrary implementing the org.xml.sax.helpers package for Java SE 6

theJavaSE6BytecodeFormat
type: JavaSE6BytecodeFormat
type: Thing
minor version number: 0
major version number: 50
preverified: false